{"text_format":"1","workbook":"xlsx","n_sheets":5,"sheets":["Read Me","Data Dictionary","Stations","Agency Totals","Summary Tables"],"not_rendered":{"charts":0,"images":0,"macros":1,"external_links":0,"defined_names":16,"comments":0,"pivot_tables":0},"unopened":[],"bounds":{"document_bytes":16777216,"sheet_cells":100000,"rows_first":2000,"rows_last":500,"rows_between":2000,"halvings":0,"cell_chars":16384,"cell_head_chars":4096},"cells_cut":0,"cells_raw":0,"read":"whole","date_system":"1900"}

{"sheet":"Read Me","index":0,"n_rows":0,"n_cols":0,"rows_kept":0,"cut":false,"hidden":false,"merged":[]}

{"sheet":"Data Dictionary","index":1,"n_rows":49,"n_cols":3,"rows_kept":49,"cut":false,"hidden":false,"merged":[]}
["Term","Who reports it?","Definition"]
["Agency","All","The transit agency's name."]
["City","All","The city in which the agency is headquartered."]
["State","All","The state in which the agency is headquartered."]
["Legacy NTD ID","All","A four-digit identifying number for each agency used in the legacy NTD system."]
["NTD ID","All","A five-digit identifying number for each agency used in the current NTD system."]
["Organization Type","All","Description of the agency's legal entity."]
["Reporter Type","All","The type of NTD report that the agency completed this year."]
["Primary UZA Population","DOES NOT APPLY TO: Rural General Public Transit Sub-recipients, Intercity Bus Sub-recipients","The population of the urbanized area primarily served by the agency."]
["Agency VOMS","DOES NOT APPLY TO: Building Reporters, Planning Reporters, Separate Service Reporters, Tribal Subsidy Reporters, Intercity Bus Sub-recipients","The number of revenue vehicles operated across the whole agency to meet the annual maximum service requirement. This is the revenue vehicle count during the peak season of the year; on the week and day that maximum service is provided. Vehicles operated in maximum service (VOMS) exclude atypical days and one-time special events."]
{"$rows_left_out":40}
{"sheet":"Stations","index":2,"n_rows":1040,"n_cols":26,"rows_kept":1040,"cut":false,"hidden":false,"merged":[]}
["Name","City","State","Legacy NTD ID","NTD ID","Organization Type","Reporter Type","Primary UZA Population","Agency VOMS","Mode","TOS","Mode VOMS","ADA Accessible Stations","ADA Accessible Stations Questionable","Non-ADA Accessible Stations","Non-ADA Accessible Stations Questionable","Total Stations","Total Stations Questionable","Elevators","Elevators Questionable","Escalators","Escalators Questionable","Any data questionable?",null,null,{"$f":"IF(Z4=1,1,0)","v":1}]
["MTA New York City Transit","New York","NY",2008,20008,"Subsidiary Unit of a Transit Agency, Reporting Separately","Full Reporter",18351295,11000,"HR","DO",5282,106,"",363,"",469,"",229,"",186,"",{"$f":"IF(OR(N2=\"Q\",P2=\"Q\",R2=\"Q\",T2=\"Q\",V2=\"Q\",),\"Yes\",\"No\")","v":"No"},null,null,"Hide questionable data tags"]
["MTA New York City Transit","New York","NY",2008,20008,"Subsidiary Unit of a Transit Agency, Reporting Separately","Full Reporter",18351295,11000,"MB","DO",3314,2,"",0,"",2,"",0,"",0,"","No",null,null,"Show questionable data tags"]
["MTA New York City Transit","New York","NY",2008,20008,"Subsidiary Unit of a Transit Agency, Reporting Separately","Full Reporter",18351295,11000,"CB","DO",456,0,"",0,"",0,"",0,"",0,"","No",null,null,1]
["MTA New York City Transit","New York","NY",2008,20008,"Subsidiary Unit of a Transit Agency, Reporting Separately","Full Reporter",18351295,11000,"RB","DO",108,0,"",0,"",0,"",0,"",0,"","No"]
["New Jersey Transit Corporation","Newark","NJ",2080,20080,"Other Publicly-Owned or Privately Chartered Corporation","Full Reporter",18351295,4020,"MB","DO",1870,30,"",0,"",30,"",7,"",0,"","No"]
["New Jersey Transit Corporation","Newark","NJ",2080,20080,"Other Publicly-Owned or Privately Chartered Corporation","Full Reporter",18351295,4020,"CR","DO",1267,78,"",87,"",165,"",102,"",75,"","No"]
["New Jersey Transit Corporation","Newark","NJ",2080,20080,"Other Publicly-Owned or Privately Chartered Corporation","Full Reporter",18351295,4020,"MB","PT",181,0,"",0,"",0,"",0,"",0,"","No"]
["New Jersey Transit Corporation","Newark","NJ",2080,20080,"Other Publicly-Owned or Privately Chartered Corporation","Full Reporter",18351295,4020,"LR","PT",42,24,"",0,"",24,"",15,"",0,"","No"]
["New Jersey Transit Corporation","Newark","NJ",2080,20080,"Other Publicly-Owned or Privately Chartered Corporation","Full Reporter",18351295,4020,"YR","PT",16,21,"",0,"",21,"",0,"",0,"","No"]
{"$rows_left_out":1031}
{"sheet":"Agency Totals","index":3,"n_rows":793,"n_cols":23,"rows_kept":793,"cut":false,"hidden":false,"merged":[]}
["Name","City","State","Legacy NTD ID","NTD ID","Organization Type","Reporter Type","Primary UZA Population","Agency VOMS","ADA Accessible Stations","ADA Accessible Stations Questionable","Non-ADA Accessible Stations","Non-ADA Accessible Stations Questionable","Total Stations","Total Stations Questionable","Elevators","Elevators Questionable","Escalators","Escalators Questionable","Any data questionable?",null,null,{"$f":"IF(W4=1,1,0)","v":1}]
["MTA New York City Transit","New York","NY",2008,20008,"Subsidiary Unit of a Transit Agency, Reporting Separately","Full Reporter",18351295,11000,108,"",363,"",471,"",229,"",186,"",{"$f":"IF(OR(K2=\"Q\",M2=\"Q\",O2=\"Q\",Q2=\"Q\",S2=\"Q\"),\"Yes\",\"No\")","v":"No"},null,null,"Hide questionable data tags"]
["New Jersey Transit Corporation","Newark","NJ",2080,20080,"Other Publicly-Owned or Privately Chartered Corporation","Full Reporter",18351295,4020,164,"",93,"",257,"",129,"",77,"","No",null,null,"Show questionable data tags"]
["Los Angeles County Metropolitan Transportation Authority dba: Metro","Los Angeles","CA",9154,90154,"Independent Public Agency or Authority of Transit Service","Full Reporter",12150996,3516,131,"",0,"",131,"",162,"",172,"","No",null,null,1]
["Washington Metropolitan Area Transit Authority","Washington","DC",3030,30030,"Independent Public Agency or Authority of Transit Service","Full Reporter",4586770,3200,91,"",0,"",91,"",275,"",613,"","No"]
["King County Department of Transportation - Metro Transit Division","Seattle","WA",1,1,"City, County or Local Government Unit or Department of Transportation","Full Reporter",3059393,2875,23,"",0,"",23,"",34,"",40,"","No"]
["Chicago Transit Authority","Chicago","IL",5066,50066,"Independent Public Agency or Authority of Transit Service","Full Reporter",8608208,2728,98,"",47,"",145,"",147,"",158,"","No"]
["Massachusetts Bay Transportation Authority","Boston","MA",1003,10003,"Independent Public Agency or Authority of Transit Service","Full Reporter",4181019,2344,283,"",73,"",356,"",188,"",205,"","No"]
["Southeastern Pennsylvania Transportation Authority","Philadelphia","PA",3019,30019,"Independent Public Agency or Authority of Transit Service","Full Reporter",5441567,2340,107,"",167,"",274,"",110,"",59,"","No"]
["Metropolitan Transit Authority of Harris County, Texas ","Houston","TX",6008,60008,"Independent Public Agency or Authority of Transit Service","Full Reporter",4944332,2240,156,"",0,"",156,"",20,"",8,"","No"]
{"$rows_left_out":784}
{"sheet":"Summary Tables","index":4,"n_rows":116,"n_cols":14,"rows_kept":116,"cut":false,"hidden":false,"merged":[]}
["To bring up the accessible control panel, press ctrl + a. Some screen reading functionality will not work while the sheet is protected. To unprotect the sheet press alt h o p and enter the password ntd.",null,null,null,null,"National Totals",null,null,null,null,null,null,null,{"$f":"IF(N4=1,0,1)","v":0}]
[null,null,null,null,null,"VOMS","ADA Accessible","Non-ADA Accessible","Total Stations","Elevators","Escalators",null,null,"Include Questionable Data"]
[null,null,null,null,null,{"$f":"IF($N$1,SUMIFS(Stations!L:L,Stations!$W:$W,\"=No\"),SUM(Stations!L:L))","v":70910},{"$f":"IF($N$1,SUMIFS(Stations!M:M,Stations!$W:$W,\"=No\"),SUM(Stations!M:M))","v":4212},{"$f":"IF($N$1,SUMIFS(Stations!O:O,Stations!$W:$W,\"=No\"),SUM(Stations!O:O))","v":1033},{"$f":"IF($N$1,SUMIFS(Stations!Q:Q,Stations!$W:$W,\"=No\"),SUM(Stations!Q:Q))","v":5245},{"$f":"IF($N$1,SUMIFS(Stations!S:S,Stations!$W:$W,\"=No\"),SUM(Stations!S:S))","v":2846},{"$f":"IF($N$1,SUMIFS(Stations!U:U,Stations!$W:$W,\"=No\"),SUM(Stations!U:U))","v":2678},null,null,"Exclude Questionable Data"]
[null,null,null,null,null,null,null,null,null,null,null,null,null,1]
["By Urbanized Area Size"]
[null,null,null,"enter bins here","Column1","VOMS","ADA Accessible","Non-ADA Accessible","Total Stations","Elevators","Escalators"]
["under",{"$f":"D7","v":200000},null,200000,{"$f":"IFERROR(IF(A7=\"between\",A7&\" \"&FIXED(B7,0,0)&\" \"&C7&\" \"&FIXED(D7,0,0),A7&\" \"&FIXED(B7,0,0)),\"invalid bin\")","v":"under 200,000"},{"$f":"IF($N$1,SUMIFS(Stations!L:L,Stations!$H:$H,\"<\"&$D7,Stations!$W:$W,\"=No\"),SUMIFS(Stations!L:L,Stations!$H:$H,\"<\"&$D7))","v":4960},{"$f":"IF($N$1,SUMIFS(Stations!M:M,Stations!$H:$H,\"<\"&$D7,Stations!$W:$W,\"=No\"),SUMIFS(Stations!M:M,Stations!$H:$H,\"<\"&$D7))","v":323},{"$f":"IF($N$1,SUMIFS(Stations!O:O,Stations!$H:$H,\"<\"&$D7,Stations!$W:$W,\"=No\"),SUMIFS(Stations!O:O,Stations!$H:$H,\"<\"&$D7))","v":3},{"$f":"IF($N$1,SUMIFS(Stations!Q:Q,Stations!$H:$H,\"<\"&$D7,Stations!$W:$W,\"=No\"),SUMIFS(Stations!Q:Q,Stations!$H:$H,\"<\"&$D7))","v":326},{"$f":"IF($N$1,SUMIFS(Stations!S:S,Stations!$H:$H,\"<\"&$D7,Stations!$W:$W,\"=No\"),SUMIFS(Stations!S:S,Stations!$H:$H,\"<\"&$D7))","v":68},{"$f":"IF($N$1,SUMIFS(Stations!U:U,Stations!$H:$H,\"<\"&$D7,Stations!$W:$W,\"=No\"),SUMIFS(Stations!U:U,Stations!$H:$H,\"<\"&$D7))","v":2}]
[{"$f":"IF(D8<>\"\",\"between\",\"over\")","v":"between"},{"$f":"D7","v":200000},{"$f":"IF(D8<>\"\",\"and\",\"\")","v":"and"},1000000,{"$f":"IFERROR(IF(A8=\"between\",A8&\" \"&FIXED(B8,0,0)&\" \"&C8&\" \"&FIXED(D8,0,0),A8&\" \"&FIXED(B8,0,0)),\"invalid bin\")","v":"between 200,000 and 1,000,000"},{"$f":"IF($N$1,IF($A8=\"between\",SUMIFS(Stations!L:L,Stations!$H:$H,\">=\"&$B8,Stations!$H:$H,\"<\"&$D8,Stations!$W:$W,\"=No\"),SUMIFS(Stations!L:L,Stations!$H:$H,\">=\"&$B8,Stations!$W:$W,\"=No\")),IF($A8=\"between\",SUMIFS(Stations!L:L,Stations!$H:$H,\">=\"&$B8,Stations!$H:$H,\"<\"&$D8),SUMIFS(Stations!L:L,Stations!$H:$H,\">=\"&$B8)))","v":9208},{"$f":"IF($N$1,IF($A8=\"between\",SUMIFS(Stations!M:M,Stations!$H:$H,\">=\"&$B8,Stations!$H:$H,\"<\"&$D8,Stations!$W:$W,\"=No\"),SUMIFS(Stations!M:M,Stations!$H:$H,\">=\"&$B8,Stations!$W:$W,\"=No\")),IF($A8=\"between\",SUMIFS(Stations!M:M,Stations!$H:$H,\">=\"&$B8,Stations!$H:$H,\"<\"&$D8),SUMIFS(Stations!M:M,Stations!$H:$H,\">=\"&$B8)))","v":400},{"$f":"IF($N$1,IF($A8=\"between\",SUMIFS(Stations!O:O,Stations!$H:$H,\">=\"&$B8,Stations!$H:$H,\"<\"&$D8,Stations!$W:$W,\"=No\"),SUMIFS(Stations!O:O,Stations!$H:$H,\">=\"&$B8,Stations!$W:$W,\"=No\")),IF($A8=\"between\",SUMIFS(Stations!O:O,Stations!$H:$H,\">=\"&$B8,Stations!$H:$H,\"<\"&$D8),SUMIFS(Stations!O:O,Stations!$H:$H,\">=\"&$B8)))","v":4},{"$f":"IF($N$1,IF($A8=\"between\",SUMIFS(Stations!Q:Q,Stations!$H:$H,\">=\"&$B8,Stations!$H:$H,\"<\"&$D8,Stations!$W:$W,\"=No\"),SUMIFS(Stations!Q:Q,Stations!$H:$H,\">=\"&$B8,Stations!$W:$W,\"=No\")),IF($A8=\"between\",SUMIFS(Stations!Q:Q,Stations!$H:$H,\">=\"&$B8,Stations!$H:$H,\"<\"&$D8),SUMIFS(Stations!Q:Q,Stations!$H:$H,\">=\"&$B8)))","v":404},{"$f":"IF($N$1,IF($A8=\"between\",SUMIFS(Stations!S:S,Stations!$H:$H,\">=\"&$B8,Stations!$H:$H,\"<\"&$D8,Stations!$W:$W,\"=No\"),SUMIFS(Stations!S:S,Stations!$H:$H,\">=\"&$B8,Stations!$W:$W,\"=No\")),IF($A8=\"between\",SUMIFS(Stations!S:S,Stations!$H:$H,\">=\"&$B8,Stations!$H:$H,\"<\"&$D8),SUMIFS(Stations!S:S,Stations!$H:$H,\">=\"&$B8)))","v":95},{"$f":"IF($N$1,IF($A8=\"between\",SUMIFS(Stations!U:U,Stations!$H:$H,\">=\"&$B8,Stations!$H:$H,\"<\"&$D8,Stations!$W:$W,\"=No\"),SUMIFS(Stations!U:U,Stations!$H:$H,\">=\"&$B8,Stations!$W:$W,\"=No\")),IF($A8=\"between\",SUMIFS(Stations!U:U,Stations!$H:$H,\">=\"&$B8,Stations!$H:$H,\"<\"&$D8),SUMIFS(Stations!U:U,Stations!$H:$H,\">=\"&$B8)))","v":49}]
[{"$f":"IF(OR(A8=\"over\",A8=\"\"),\"\",IF(D9=\"\",\"over\",\"between\"))","v":"over"},{"$f":"IF(D8=\"\",\"\",D8)","v":1000000},{"$f":"IF(D9<>\"\",\"and\",\"\")","v":""},null,"over 1,000,000",{"$f":"IF($N$1,IF($A9=\"\",\"\",IF($A9=\"between\",SUMIFS(Stations!L:L,Stations!$H:$H,\">=\"&$B9,Stations!$H:$H,\"<\"&$D9,Stations!$W:$W,\"=No\"),SUMIFS(Stations!L:L,Stations!$H:$H,\">=\"&$B9,Stations!$W:$W,\"=No\"))),IF($A9=\"\",\"\",IF($A9=\"between\",SUMIFS(Stations!L:L,Stations!$H:$H,\">=\"&$B9,Stations!$H:$H,\"<\"&$D9),SUMIFS(Stations!L:L,Stations!$H:$H,\">=\"&$B9))))","v":56742},{"$f":"IF($N$1,IF($A9=\"\",\"\",IF($A9=\"between\",SUMIFS(Stations!M:M,Stations!$H:$H,\">=\"&$B9,Stations!$H:$H,\"<\"&$D9,Stations!$W:$W,\"=No\"),SUMIFS(Stations!M:M,Stations!$H:$H,\">=\"&$B9,Stations!$W:$W,\"=No\"))),IF($A9=\"\",\"\",IF($A9=\"between\",SUMIFS(Stations!M:M,Stations!$H:$H,\">=\"&$B9,Stations!$H:$H,\"<\"&$D9),SUMIFS(Stations!M:M,Stations!$H:$H,\">=\"&$B9))))","v":3489},{"$f":"IF($N$1,IF($A9=\"\",\"\",IF($A9=\"between\",SUMIFS(Stations!O:O,Stations!$H:$H,\">=\"&$B9,Stations!$H:$H,\"<\"&$D9,Stations!$W:$W,\"=No\"),SUMIFS(Stations!O:O,Stations!$H:$H,\">=\"&$B9,Stations!$W:$W,\"=No\"))),IF($A9=\"\",\"\",IF($A9=\"between\",SUMIFS(Stations!O:O,Stations!$H:$H,\">=\"&$B9,Stations!$H:$H,\"<\"&$D9),SUMIFS(Stations!O:O,Stations!$H:$H,\">=\"&$B9))))","v":1026},{"$f":"IF($N$1,IF($A9=\"\",\"\",IF($A9=\"between\",SUMIFS(Stations!Q:Q,Stations!$H:$H,\">=\"&$B9,Stations!$H:$H,\"<\"&$D9,Stations!$W:$W,\"=No\"),SUMIFS(Stations!Q:Q,Stations!$H:$H,\">=\"&$B9,Stations!$W:$W,\"=No\"))),IF($A9=\"\",\"\",IF($A9=\"between\",SUMIFS(Stations!Q:Q,Stations!$H:$H,\">=\"&$B9,Stations!$H:$H,\"<\"&$D9),SUMIFS(Stations!Q:Q,Stations!$H:$H,\">=\"&$B9))))","v":4515},{"$f":"IF($N$1,IF($A9=\"\",\"\",IF($A9=\"between\",SUMIFS(Stations!S:S,Stations!$H:$H,\">=\"&$B9,Stations!$H:$H,\"<\"&$D9,Stations!$W:$W,\"=No\"),SUMIFS(Stations!S:S,Stations!$H:$H,\">=\"&$B9,Stations!$W:$W,\"=No\"))),IF($A9=\"\",\"\",IF($A9=\"between\",SUMIFS(Stations!S:S,Stations!$H:$H,\">=\"&$B9,Stations!$H:$H,\"<\"&$D9),SUMIFS(Stations!S:S,Stations!$H:$H,\">=\"&$B9))))","v":2683},{"$f":"IF($N$1,IF($A9=\"\",\"\",IF($A9=\"between\",SUMIFS(Stations!U:U,Stations!$H:$H,\">=\"&$B9,Stations!$H:$H,\"<\"&$D9,Stations!$W:$W,\"=No\"),SUMIFS(Stations!U:U,Stations!$H:$H,\">=\"&$B9,Stations!$W:$W,\"=No\"))),IF($A9=\"\",\"\",IF($A9=\"between\",SUMIFS(Stations!U:U,Stations!$H:$H,\">=\"&$B9,Stations!$H:$H,\"<\"&$D9),SUMIFS(Stations!U:U,Stations!$H:$H,\">=\"&$B9))))","v":2627}]
["","",{"$f":"IF(D10<>\"\",\"and\",\"\")","v":""},null,"invalid bin",{"$f":"IF($N$1,IF($A10=\"\",\"\",IF($A10=\"between\",SUMIFS(Stations!L:L,Stations!$H:$H,\">=\"&$B10,Stations!$H:$H,\"<\"&$D10,Stations!$W:$W,\"=No\"),SUMIFS(Stations!L:L,Stations!$H:$H,\">=\"&$B10,Stations!$W:$W,\"=No\"))),IF($A10=\"\",\"\",IF($A10=\"between\",SUMIFS(Stations!L:L,Stations!$H:$H,\">=\"&$B10,Stations!$H:$H,\"<\"&$D10),SUMIFS(Stations!L:L,Stations!$H:$H,\">=\"&$B10))))","v":""},{"$f":"IF($N$1,IF($A10=\"\",\"\",IF($A10=\"between\",SUMIFS(Stations!M:M,Stations!$H:$H,\">=\"&$B10,Stations!$H:$H,\"<\"&$D10,Stations!$W:$W,\"=No\"),SUMIFS(Stations!M:M,Stations!$H:$H,\">=\"&$B10,Stations!$W:$W,\"=No\"))),IF($A10=\"\",\"\",IF($A10=\"between\",SUMIFS(Stations!M:M,Stations!$H:$H,\">=\"&$B10,Stations!$H:$H,\"<\"&$D10),SUMIFS(Stations!M:M,Stations!$H:$H,\">=\"&$B10))))","v":""},{"$f":"IF($N$1,IF($A10=\"\",\"\",IF($A10=\"between\",SUMIFS(Stations!O:O,Stations!$H:$H,\">=\"&$B10,Stations!$H:$H,\"<\"&$D10,Stations!$W:$W,\"=No\"),SUMIFS(Stations!O:O,Stations!$H:$H,\">=\"&$B10,Stations!$W:$W,\"=No\"))),IF($A10=\"\",\"\",IF($A10=\"between\",SUMIFS(Stations!O:O,Stations!$H:$H,\">=\"&$B10,Stations!$H:$H,\"<\"&$D10),SUMIFS(Stations!O:O,Stations!$H:$H,\">=\"&$B10))))","v":""},{"$f":"IF($N$1,IF($A10=\"\",\"\",IF($A10=\"between\",SUMIFS(Stations!Q:Q,Stations!$H:$H,\">=\"&$B10,Stations!$H:$H,\"<\"&$D10,Stations!$W:$W,\"=No\"),SUMIFS(Stations!Q:Q,Stations!$H:$H,\">=\"&$B10,Stations!$W:$W,\"=No\"))),IF($A10=\"\",\"\",IF($A10=\"between\",SUMIFS(Stations!Q:Q,Stations!$H:$H,\">=\"&$B10,Stations!$H:$H,\"<\"&$D10),SUMIFS(Stations!Q:Q,Stations!$H:$H,\">=\"&$B10))))","v":""},{"$f":"IF($N$1,IF($A10=\"\",\"\",IF($A10=\"between\",SUMIFS(Stations!S:S,Stations!$H:$H,\">=\"&$B10,Stations!$H:$H,\"<\"&$D10,Stations!$W:$W,\"=No\"),SUMIFS(Stations!S:S,Stations!$H:$H,\">=\"&$B10,Stations!$W:$W,\"=No\"))),IF($A10=\"\",\"\",IF($A10=\"between\",SUMIFS(Stations!S:S,Stations!$H:$H,\">=\"&$B10,Stations!$H:$H,\"<\"&$D10),SUMIFS(Stations!S:S,Stations!$H:$H,\">=\"&$B10))))","v":""},{"$f":"IF($N$1,IF($A10=\"\",\"\",IF($A10=\"between\",SUMIFS(Stations!U:U,Stations!$H:$H,\">=\"&$B10,Stations!$H:$H,\"<\"&$D10,Stations!$W:$W,\"=No\"),SUMIFS(Stations!U:U,Stations!$H:$H,\">=\"&$B10,Stations!$W:$W,\"=No\"))),IF($A10=\"\",\"\",IF($A10=\"between\",SUMIFS(Stations!U:U,Stations!$H:$H,\">=\"&$B10,Stations!$H:$H,\"<\"&$D10),SUMIFS(Stations!U:U,Stations!$H:$H,\">=\"&$B10))))","v":""}]
{"$rows_left_out":106}