{"text_format":"1","workbook":"xlsx","n_sheets":4,"sheets":["Read Me","Data Dictionary","Breakdowns","Summary"],"not_rendered":{"charts":2,"images":0,"macros":1,"external_links":0,"defined_names":17,"comments":0,"pivot_tables":0},"unopened":[],"bounds":{"document_bytes":16777216,"sheet_cells":100000,"rows_first":2000,"rows_last":500,"rows_between":2000,"halvings":0,"cell_chars":16384,"cell_head_chars":4096},"cells_cut":0,"cells_raw":0,"read":"whole","date_system":"1900"}

{"sheet":"Read Me","index":0,"n_rows":0,"n_cols":0,"rows_kept":0,"cut":false,"hidden":false,"merged":[]}

{"sheet":"Data Dictionary","index":1,"n_rows":51,"n_cols":3,"rows_kept":51,"cut":false,"hidden":false,"merged":[]}
["Term","Who reports it?","Definition"]
["Agency","All","The transit agency's name."]
["City","All","The city in which the agency is headquartered."]
["State","All","The state in which the agency is headquartered."]
["Legacy NTD ID","All","A four-digit identifying number for each agency used in the legacy NTD system."]
["NTD ID","All","A five-digit identifying number for each agency used in the current NTD system."]
["Organization Type","All","Description of the agency's legal entity."]
["Reporter Type","All","The type of NTD report that the agency completed this year."]
["Primary UZA Population","DOES NOT APPLY TO: Rural General Public Transit Sub-recipients, Intercity Bus Sub-recipients","The population of the urbanized area primarily served by the agency."]
["Agency VOMS","DOES NOT APPLY TO: Building Reporters, Planning Reporters, Separate Service Reporters, Tribal Subsidy Reporters, Intercity Bus Sub-recipients","The number of revenue vehicles operated across the whole agency to meet the annual maximum service requirement. This is the revenue vehicle count during the peak season of the year; on the week and day that maximum service is provided. Vehicles operated in maximum service (VOMS) exclude atypical days and one-time special events."]
{"$rows_left_out":42}
{"sheet":"Breakdowns","index":2,"n_rows":1238,"n_cols":29,"rows_kept":1238,"cut":false,"hidden":false,"merged":[]}
["Agency","City","State","Legacy NTD ID","NTD ID","Organization Type","Reporter Type","Primary UZA Population","Agency VOMS","Mode","Type of Service","Mode VOMS","Major Mechanical Failures","Major Mechanical Failures Questionable","Other Mechanical Failures","Other Mechanical Failures Questionable","Total Mechanical Failures","Total Mechanical Failures Questionable","Vehicle/Passenger Car Miles","Vehicle/Passenger Car Miles Questionable","Vehicle/Passenger Car Revenue Miles","Vehicle/Passenger Car Revenue Miles Questionable","Train Miles","Train Miles Questionable","Train Revenue Miles","Train Revenue Miles Questionable","Any Data Questionable?",null,{"$f":"IF(AC4=1,1,0)","v":1}]
["MTA New York City Transit","New York","NY",2008,20008,"Subsidiary Unit of a Transit Agency, Reporting Separately","Full Reporter",18351295,11000,"HR","DO",5282,2631,"",10058,"",12689,"",356180741,"",345386041,"",39164971,"",37962110,"",{"$f":"IF(OR(Z2=\"Q\",X2=\"Q\",V2=\"Q\",T2=\"Q\",R2=\"Q\",P2=\"Q\",N2=\"Q\"),\"Yes\",\"No\")","v":"No"},null,"Hide Questionable Data Tags"]
["MTA New York City Transit","New York","NY",2008,20008,"Subsidiary Unit of a Transit Agency, Reporting Separately","Full Reporter",18351295,11000,"MB","DO",3314,11845,"",4192,"",16037,"",99825341,"",87657339,"","","","","","No",null,"Show Questionable Data Tags"]
["MTA New York City Transit","New York","NY",2008,20008,"Subsidiary Unit of a Transit Agency, Reporting Separately","Full Reporter",18351295,11000,"DR","PT",1840,2437,"",2453,"",4890,"",66019158,"",54071891,"","","","","","No",null,1]
["MTA New York City Transit","New York","NY",2008,20008,"Subsidiary Unit of a Transit Agency, Reporting Separately","Full Reporter",18351295,11000,"CB","DO",456,438,"",152,"",590,"",15676591,"",9258644,"","","","","","No"]
["MTA New York City Transit","New York","NY",2008,20008,"Subsidiary Unit of a Transit Agency, Reporting Separately","Full Reporter",18351295,11000,"RB","DO",108,253,"",92,"",345,"",1947786,"",1818831,"","","","","","No"]
["New Jersey Transit Corporation","Newark","NJ",2080,20080,"Other Publicly-Owned or Privately Chartered Corporation","Full Reporter",18351295,4020,"MB","DO",1870,6370,"",3293,"",9663,"",93927426,"",72336027,"","","","","","No"]
["New Jersey Transit Corporation","Newark","NJ",2080,20080,"Other Publicly-Owned or Privately Chartered Corporation","Full Reporter",18351295,4020,"CR","DO",1267,240,"",300,"",540,"",66758780,"",63090304,"",9878893,"",9305813,"","No"]
["New Jersey Transit Corporation","Newark","NJ",2080,20080,"Other Publicly-Owned or Privately Chartered Corporation","Full Reporter",18351295,4020,"DR","PT",432,265,"",70,"",335,"",16677181,"",13833948,"","","","","","No"]
["New Jersey Transit Corporation","Newark","NJ",2080,20080,"Other Publicly-Owned or Privately Chartered Corporation","Full Reporter",18351295,4020,"VP","PT",198,18,"",21,"",39,"",4543569,"",4543569,"","","","","","No"]
{"$rows_left_out":1229}
{"sheet":"Summary","index":3,"n_rows":121,"n_cols":22,"rows_kept":121,"cut":false,"hidden":false,"merged":[]}
["To bring up the accessible control panel, press ctrl + a. Some screen reading functionality will not work while the sheet is protected. To unprotect the sheet press alt h o p and enter the password ntd.",null,null,null,null,"National Totals",null,null,null,null,null,null,null,null,null,{"$f":"IF(P4=1,0,1)","v":0}]
[null,null,null,null,null,"VOMS","Major Mechanical Failures","Other Mechanical Failures","Total Mechanical Failures","Vehicle/Passenger Car Miles","Vehicle/Passenger Car Revenue Miles","Train Miles","Train Revenue Miles",null,null,"Include Questionable Data"]
[null,null,null,null,null,{"$f":"IF($P$1,SUMIFS(Breakdowns!L:L,Breakdowns!$AA:$AA,\"=No\"),SUM(Breakdowns!L:L))","v":105445},{"$f":"IF($P$1,SUMIFS(Breakdowns!M:M,Breakdowns!$AA:$AA,\"=No\"),SUM(Breakdowns!M:M))","v":253908},{"$f":"IF($P$1,SUMIFS(Breakdowns!O:O,Breakdowns!$AA:$AA,\"=No\"),SUM(Breakdowns!O:O))","v":264253},{"$f":"IF($P$1,SUMIFS(Breakdowns!Q:Q,Breakdowns!$AA:$AA,\"=No\"),SUM(Breakdowns!Q:Q))","v":518161},{"$f":"IF($P$1,SUMIFS(Breakdowns!S:S,Breakdowns!$AA:$AA,\"=No\"),SUM(Breakdowns!S:S))","v":4474007675},{"$f":"IF($P$1,SUMIFS(Breakdowns!U:U,Breakdowns!$AA:$AA,\"=No\"),SUM(Breakdowns!U:U))","v":3974001824},{"$f":"IF($P$1,SUMIFS(Breakdowns!W:W,Breakdowns!$AA:$AA,\"=No\"),SUM(Breakdowns!W:W))","v":218474633},{"$f":"IF($P$1,SUMIFS(Breakdowns!Y:Y,Breakdowns!$AA:$AA,\"=No\"),SUM(Breakdowns!Y:Y))","v":210428016},null,null,"Exclude Questionable Data"]
[null,null,null,null,null,null,null,null,null,null,null,null,null,null,null,1]
["By Urbanized Area Size"]
[null,null,null,"edit bins below","Column1","VOMS","Major Mechanical Failures","Other Mechanical Failures","Total Mechanical Failures","Vehicle/Passenger Car Miles","Vehicle/Passenger Car Revenue Miles","Train Miles","Train Revenue Miles",null,null,null,null,null,{"$f":"\"under \"&FIXED(B7,0,0)","v":"under 200,000"},{"$f":"IFERROR($K7/$G7,\"\")","v":18336.458586235876}]
["under",{"$f":"D7","v":200000},null,200000,{"$f":"A7&\" \"&FIXED(B7,0,0)","v":"under 200,000"},{"$f":"IF($P$1,SUMIFS(Breakdowns!L:L,Breakdowns!$H:$H,\"<\"&$D7,Breakdowns!$AA:$AA,\"=No\"),SUMIFS(Breakdowns!L:L,Breakdowns!$H:$H,\"<\"&$D7))","v":6859},{"$f":"IF($P$1,SUMIFS(Breakdowns!M:M,Breakdowns!$H:$H,\"<\"&$D7,Breakdowns!$AA:$AA,\"=No\"),SUMIFS(Breakdowns!M:M,Breakdowns!$H:$H,\"<\"&$D7))","v":10709},{"$f":"IF($P$1,SUMIFS(Breakdowns!O:O,Breakdowns!$H:$H,\"<\"&$D7,Breakdowns!$AA:$AA,\"=No\"),SUMIFS(Breakdowns!O:O,Breakdowns!$H:$H,\"<\"&$D7))","v":13288},{"$f":"IF($P$1,SUMIFS(Breakdowns!Q:Q,Breakdowns!$H:$H,\"<\"&$D7,Breakdowns!$AA:$AA,\"=No\"),SUMIFS(Breakdowns!Q:Q,Breakdowns!$H:$H,\"<\"&$D7))","v":23997},{"$f":"IF($P$1,SUMIFS(Breakdowns!S:S,Breakdowns!$H:$H,\"<\"&$D7,Breakdowns!$AA:$AA,\"=No\"),SUMIFS(Breakdowns!S:S,Breakdowns!$H:$H,\"<\"&$D7))","v":214058499},{"$f":"IF($P$1,SUMIFS(Breakdowns!U:U,Breakdowns!$H:$H,\"<\"&$D7,Breakdowns!$AA:$AA,\"=No\"),SUMIFS(Breakdowns!U:U,Breakdowns!$H:$H,\"<\"&$D7))","v":196365135},{"$f":"IF($P$1,SUMIFS(Breakdowns!W:W,Breakdowns!$H:$H,\"<\"&$D7,Breakdowns!$AA:$AA,\"=No\"),SUMIFS(Breakdowns!W:W,Breakdowns!$H:$H,\"<\"&$D7))","v":777947},{"$f":"IF($P$1,SUMIFS(Breakdowns!Y:Y,Breakdowns!$H:$H,\"<\"&$D7,Breakdowns!$AA:$AA,\"=No\"),SUMIFS(Breakdowns!Y:Y,Breakdowns!$H:$H,\"<\"&$D7))","v":755808},null,null,null,null,null,{"$f":"IFERROR(IF(A8=\"over\",\"over \"&FIXED(B8,0,0),FIXED(B8,0,0)&\" to \"&FIXED(D8,0,0)),\"\")","v":"200,000 to 1,000,000"},{"$f":"IFERROR($K8/$G8,\"\")","v":13743.00923209227}]
[{"$f":"IF(D8<>\"\",\"between\",\"over\")","v":"between"},{"$f":"D7","v":200000},{"$f":"IF(D8<>\"\",\"and\",\"\")","v":"and"},1000000,{"$f":"IFERROR(IF(A8=\"between\",A8&\" \"&FIXED(B8,0,0)&\" \"&C8&\" \"&FIXED(D8,0,0),A8&\" \"&FIXED(B8,0,0)),\"invalid bin\")","v":"between 200,000 and 1,000,000"},{"$f":"IF($P$1,IF($A8=\"between\",SUMIFS(Breakdowns!L:L,Breakdowns!$H:$H,\">=\"&$B8,Breakdowns!$H:$H,\"<\"&$D8,Breakdowns!$AA:$AA,\"=No\"),SUMIFS(Breakdowns!L:L,Breakdowns!$H:$H,\">=\"&$B8,Breakdowns!$AA:$AA,\"=No\")),IF($A8=\"between\",SUMIFS(Breakdowns!L:L,Breakdowns!$H:$H,\">=\"&$B8,Breakdowns!$H:$H,\"<\"&$D8),SUMIFS(Breakdowns!L:L,Breakdowns!$H:$H,\">=\"&$B8)))","v":16325},{"$f":"IF($P$1,IF($A8=\"between\",SUMIFS(Breakdowns!M:M,Breakdowns!$H:$H,\">=\"&$B8,Breakdowns!$H:$H,\"<\"&$D8,Breakdowns!$AA:$AA,\"=No\"),SUMIFS(Breakdowns!M:M,Breakdowns!$H:$H,\">=\"&$B8,Breakdowns!$AA:$AA,\"=No\")),IF($A8=\"between\",SUMIFS(Breakdowns!M:M,Breakdowns!$H:$H,\">=\"&$B8,Breakdowns!$H:$H,\"<\"&$D8),SUMIFS(Breakdowns!M:M,Breakdowns!$H:$H,\">=\"&$B8)))","v":39536},{"$f":"IF($P$1,IF($A8=\"between\",SUMIFS(Breakdowns!O:O,Breakdowns!$H:$H,\">=\"&$B8,Breakdowns!$H:$H,\"<\"&$D8,Breakdowns!$AA:$AA,\"=No\"),SUMIFS(Breakdowns!O:O,Breakdowns!$H:$H,\">=\"&$B8,Breakdowns!$AA:$AA,\"=No\")),IF($A8=\"between\",SUMIFS(Breakdowns!O:O,Breakdowns!$H:$H,\">=\"&$B8,Breakdowns!$H:$H,\"<\"&$D8),SUMIFS(Breakdowns!O:O,Breakdowns!$H:$H,\">=\"&$B8)))","v":57973},{"$f":"IF($P$1,IF($A8=\"between\",SUMIFS(Breakdowns!Q:Q,Breakdowns!$H:$H,\">=\"&$B8,Breakdowns!$H:$H,\"<\"&$D8,Breakdowns!$AA:$AA,\"=No\"),SUMIFS(Breakdowns!Q:Q,Breakdowns!$H:$H,\">=\"&$B8,Breakdowns!$AA:$AA,\"=No\")),IF($A8=\"between\",SUMIFS(Breakdowns!Q:Q,Breakdowns!$H:$H,\">=\"&$B8,Breakdowns!$H:$H,\"<\"&$D8),SUMIFS(Breakdowns!Q:Q,Breakdowns!$H:$H,\">=\"&$B8)))","v":97509},{"$f":"IF($P$1,IF($A8=\"between\",SUMIFS(Breakdowns!S:S,Breakdowns!$H:$H,\">=\"&$B8,Breakdowns!$H:$H,\"<\"&$D8,Breakdowns!$AA:$AA,\"=No\"),SUMIFS(Breakdowns!S:S,Breakdowns!$H:$H,\">=\"&$B8,Breakdowns!$AA:$AA,\"=No\")),IF($A8=\"between\",SUMIFS(Breakdowns!S:S,Breakdowns!$H:$H,\">=\"&$B8,Breakdowns!$H:$H,\"<\"&$D8),SUMIFS(Breakdowns!S:S,Breakdowns!$H:$H,\">=\"&$B8)))","v":604315856},{"$f":"IF($P$1,IF($A8=\"between\",SUMIFS(Breakdowns!U:U,Breakdowns!$H:$H,\">=\"&$B8,Breakdowns!$H:$H,\"<\"&$D8,Breakdowns!$AA:$AA,\"=No\"),SUMIFS(Breakdowns!U:U,Breakdowns!$H:$H,\">=\"&$B8,Breakdowns!$AA:$AA,\"=No\")),IF($A8=\"between\",SUMIFS(Breakdowns!U:U,Breakdowns!$H:$H,\">=\"&$B8,Breakdowns!$H:$H,\"<\"&$D8),SUMIFS(Breakdowns!U:U,Breakdowns!$H:$H,\">=\"&$B8)))","v":543343613},{"$f":"IF($P$1,IF($A8=\"between\",SUMIFS(Breakdowns!W:W,Breakdowns!$H:$H,\">=\"&$B8,Breakdowns!$H:$H,\"<\"&$D8,Breakdowns!$AA:$AA,\"=No\"),SUMIFS(Breakdowns!W:W,Breakdowns!$H:$H,\">=\"&$B8,Breakdowns!$AA:$AA,\"=No\")),IF($A8=\"between\",SUMIFS(Breakdowns!W:W,Breakdowns!$H:$H,\">=\"&$B8,Breakdowns!$H:$H,\"<\"&$D8),SUMIFS(Breakdowns!W:W,Breakdowns!$H:$H,\">=\"&$B8)))","v":3842026},{"$f":"IF($P$1,IF($A8=\"between\",SUMIFS(Breakdowns!Y:Y,Breakdowns!$H:$H,\">=\"&$B8,Breakdowns!$H:$H,\"<\"&$D8,Breakdowns!$AA:$AA,\"=No\"),SUMIFS(Breakdowns!Y:Y,Breakdowns!$H:$H,\">=\"&$B8,Breakdowns!$AA:$AA,\"=No\")),IF($A8=\"between\",SUMIFS(Breakdowns!Y:Y,Breakdowns!$H:$H,\">=\"&$B8,Breakdowns!$H:$H,\"<\"&$D8),SUMIFS(Breakdowns!Y:Y,Breakdowns!$H:$H,\">=\"&$B8)))","v":3644899},null,null,null,null,null,{"$f":"IFERROR(IF(A9=\"over\",\"over \"&FIXED(B9,0,0),FIXED(B9,0,0)&\" to \"&FIXED(D9,0,0)),\"\")","v":"over 1,000,000"},15880.611971737626]
[{"$f":"IF(OR(A8=\"over\",A8=\"\"),\"\",IF(D9=\"\",\"over\",\"between\"))","v":"over"},{"$f":"IF(D8=\"\",\"\",D8)","v":1000000},{"$f":"IF(D9<>\"\",\"and\",\"\")","v":""},null,{"$f":"IFERROR(IF(A9=\"between\",A9&\" \"&FIXED(B9,0,0)&\" \"&C9&\" \"&FIXED(D9,0,0),A9&\" \"&FIXED(B9,0,0)),\"invalid bin\")","v":"over 1,000,000"},{"$f":"IF($P$1,IF($A9=\"\",\"\",IF($A9=\"between\",SUMIFS(Breakdowns!L:L,Breakdowns!$H:$H,\">=\"&$B9,Breakdowns!$H:$H,\"<\"&$D9,Breakdowns!$AA:$AA,\"=No\"),SUMIFS(Breakdowns!L:L,Breakdowns!$H:$H,\">=\"&$B9,Breakdowns!$AA:$AA,\"=No\"))),IF($A9=\"\",\"\",IF($A9=\"between\",SUMIFS(Breakdowns!L:L,Breakdowns!$H:$H,\">=\"&$B9,Breakdowns!$H:$H,\"<\"&$D9),SUMIFS(Breakdowns!L:L,Breakdowns!$H:$H,\">=\"&$B9))))","v":82261},{"$f":"IF($P$1,IF($A9=\"\",\"\",IF($A9=\"between\",SUMIFS(Breakdowns!M:M,Breakdowns!$H:$H,\">=\"&$B9,Breakdowns!$H:$H,\"<\"&$D9,Breakdowns!$AA:$AA,\"=No\"),SUMIFS(Breakdowns!M:M,Breakdowns!$H:$H,\">=\"&$B9,Breakdowns!$AA:$AA,\"=No\"))),IF($A9=\"\",\"\",IF($A9=\"between\",SUMIFS(Breakdowns!M:M,Breakdowns!$H:$H,\">=\"&$B9,Breakdowns!$H:$H,\"<\"&$D9),SUMIFS(Breakdowns!M:M,Breakdowns!$H:$H,\">=\"&$B9))))","v":203663},{"$f":"IF($P$1,IF($A9=\"\",\"\",IF($A9=\"between\",SUMIFS(Breakdowns!O:O,Breakdowns!$H:$H,\">=\"&$B9,Breakdowns!$H:$H,\"<\"&$D9,Breakdowns!$AA:$AA,\"=No\"),SUMIFS(Breakdowns!O:O,Breakdowns!$H:$H,\">=\"&$B9,Breakdowns!$AA:$AA,\"=No\"))),IF($A9=\"\",\"\",IF($A9=\"between\",SUMIFS(Breakdowns!O:O,Breakdowns!$H:$H,\">=\"&$B9,Breakdowns!$H:$H,\"<\"&$D9),SUMIFS(Breakdowns!O:O,Breakdowns!$H:$H,\">=\"&$B9))))","v":192992},{"$f":"IF($P$1,IF($A9=\"\",\"\",IF($A9=\"between\",SUMIFS(Breakdowns!Q:Q,Breakdowns!$H:$H,\">=\"&$B9,Breakdowns!$H:$H,\"<\"&$D9,Breakdowns!$AA:$AA,\"=No\"),SUMIFS(Breakdowns!Q:Q,Breakdowns!$H:$H,\">=\"&$B9,Breakdowns!$AA:$AA,\"=No\"))),IF($A9=\"\",\"\",IF($A9=\"between\",SUMIFS(Breakdowns!Q:Q,Breakdowns!$H:$H,\">=\"&$B9,Breakdowns!$H:$H,\"<\"&$D9),SUMIFS(Breakdowns!Q:Q,Breakdowns!$H:$H,\">=\"&$B9))))","v":396655},{"$f":"IF($P$1,IF($A9=\"\",\"\",IF($A9=\"between\",SUMIFS(Breakdowns!S:S,Breakdowns!$H:$H,\">=\"&$B9,Breakdowns!$H:$H,\"<\"&$D9,Breakdowns!$AA:$AA,\"=No\"),SUMIFS(Breakdowns!S:S,Breakdowns!$H:$H,\">=\"&$B9,Breakdowns!$AA:$AA,\"=No\"))),IF($A9=\"\",\"\",IF($A9=\"between\",SUMIFS(Breakdowns!S:S,Breakdowns!$H:$H,\">=\"&$B9,Breakdowns!$H:$H,\"<\"&$D9),SUMIFS(Breakdowns!S:S,Breakdowns!$H:$H,\">=\"&$B9))))","v":3655633320},{"$f":"IF($P$1,IF($A9=\"\",\"\",IF($A9=\"between\",SUMIFS(Breakdowns!U:U,Breakdowns!$H:$H,\">=\"&$B9,Breakdowns!$H:$H,\"<\"&$D9,Breakdowns!$AA:$AA,\"=No\"),SUMIFS(Breakdowns!U:U,Breakdowns!$H:$H,\">=\"&$B9,Breakdowns!$AA:$AA,\"=No\"))),IF($A9=\"\",\"\",IF($A9=\"between\",SUMIFS(Breakdowns!U:U,Breakdowns!$H:$H,\">=\"&$B9,Breakdowns!$H:$H,\"<\"&$D9),SUMIFS(Breakdowns!U:U,Breakdowns!$H:$H,\">=\"&$B9))))","v":3234293076},{"$f":"IF($P$1,IF($A9=\"\",\"\",IF($A9=\"between\",SUMIFS(Breakdowns!W:W,Breakdowns!$H:$H,\">=\"&$B9,Breakdowns!$H:$H,\"<\"&$D9,Breakdowns!$AA:$AA,\"=No\"),SUMIFS(Breakdowns!W:W,Breakdowns!$H:$H,\">=\"&$B9,Breakdowns!$AA:$AA,\"=No\"))),IF($A9=\"\",\"\",IF($A9=\"between\",SUMIFS(Breakdowns!W:W,Breakdowns!$H:$H,\">=\"&$B9,Breakdowns!$H:$H,\"<\"&$D9),SUMIFS(Breakdowns!W:W,Breakdowns!$H:$H,\">=\"&$B9))))","v":213854660},{"$f":"IF($P$1,IF($A9=\"\",\"\",IF($A9=\"between\",SUMIFS(Breakdowns!Y:Y,Breakdowns!$H:$H,\">=\"&$B9,Breakdowns!$H:$H,\"<\"&$D9,Breakdowns!$AA:$AA,\"=No\"),SUMIFS(Breakdowns!Y:Y,Breakdowns!$H:$H,\">=\"&$B9,Breakdowns!$AA:$AA,\"=No\"))),IF($A9=\"\",\"\",IF($A9=\"between\",SUMIFS(Breakdowns!Y:Y,Breakdowns!$H:$H,\">=\"&$B9,Breakdowns!$H:$H,\"<\"&$D9),SUMIFS(Breakdowns!Y:Y,Breakdowns!$H:$H,\">=\"&$B9))))","v":206027309},null,null,null,null,null,"",""]
["","",{"$f":"IF(D10<>\"\",\"and\",\"\")","v":""},null,"invalid bin",{"$f":"IF($P$1,IF($A10=\"\",\"\",IF($A10=\"between\",SUMIFS(Breakdowns!L:L,Breakdowns!$H:$H,\">=\"&$B10,Breakdowns!$H:$H,\"<\"&$D10,Breakdowns!$AA:$AA,\"=No\"),SUMIFS(Breakdowns!L:L,Breakdowns!$H:$H,\">=\"&$B10,Breakdowns!$AA:$AA,\"=No\"))),IF($A10=\"\",\"\",IF($A10=\"between\",SUMIFS(Breakdowns!L:L,Breakdowns!$H:$H,\">=\"&$B10,Breakdowns!$H:$H,\"<\"&$D10),SUMIFS(Breakdowns!L:L,Breakdowns!$H:$H,\">=\"&$B10))))","v":""},{"$f":"IF($P$1,IF($A10=\"\",\"\",IF($A10=\"between\",SUMIFS(Breakdowns!M:M,Breakdowns!$H:$H,\">=\"&$B10,Breakdowns!$H:$H,\"<\"&$D10,Breakdowns!$AA:$AA,\"=No\"),SUMIFS(Breakdowns!M:M,Breakdowns!$H:$H,\">=\"&$B10,Breakdowns!$AA:$AA,\"=No\"))),IF($A10=\"\",\"\",IF($A10=\"between\",SUMIFS(Breakdowns!M:M,Breakdowns!$H:$H,\">=\"&$B10,Breakdowns!$H:$H,\"<\"&$D10),SUMIFS(Breakdowns!M:M,Breakdowns!$H:$H,\">=\"&$B10))))","v":""},{"$f":"IF($P$1,IF($A10=\"\",\"\",IF($A10=\"between\",SUMIFS(Breakdowns!O:O,Breakdowns!$H:$H,\">=\"&$B10,Breakdowns!$H:$H,\"<\"&$D10,Breakdowns!$AA:$AA,\"=No\"),SUMIFS(Breakdowns!O:O,Breakdowns!$H:$H,\">=\"&$B10,Breakdowns!$AA:$AA,\"=No\"))),IF($A10=\"\",\"\",IF($A10=\"between\",SUMIFS(Breakdowns!O:O,Breakdowns!$H:$H,\">=\"&$B10,Breakdowns!$H:$H,\"<\"&$D10),SUMIFS(Breakdowns!O:O,Breakdowns!$H:$H,\">=\"&$B10))))","v":""},{"$f":"IF($P$1,IF($A10=\"\",\"\",IF($A10=\"between\",SUMIFS(Breakdowns!Q:Q,Breakdowns!$H:$H,\">=\"&$B10,Breakdowns!$H:$H,\"<\"&$D10,Breakdowns!$AA:$AA,\"=No\"),SUMIFS(Breakdowns!Q:Q,Breakdowns!$H:$H,\">=\"&$B10,Breakdowns!$AA:$AA,\"=No\"))),IF($A10=\"\",\"\",IF($A10=\"between\",SUMIFS(Breakdowns!Q:Q,Breakdowns!$H:$H,\">=\"&$B10,Breakdowns!$H:$H,\"<\"&$D10),SUMIFS(Breakdowns!Q:Q,Breakdowns!$H:$H,\">=\"&$B10))))","v":""},{"$f":"IF($P$1,IF($A10=\"\",\"\",IF($A10=\"between\",SUMIFS(Breakdowns!S:S,Breakdowns!$H:$H,\">=\"&$B10,Breakdowns!$H:$H,\"<\"&$D10,Breakdowns!$AA:$AA,\"=No\"),SUMIFS(Breakdowns!S:S,Breakdowns!$H:$H,\">=\"&$B10,Breakdowns!$AA:$AA,\"=No\"))),IF($A10=\"\",\"\",IF($A10=\"between\",SUMIFS(Breakdowns!S:S,Breakdowns!$H:$H,\">=\"&$B10,Breakdowns!$H:$H,\"<\"&$D10),SUMIFS(Breakdowns!S:S,Breakdowns!$H:$H,\">=\"&$B10))))","v":""},{"$f":"IF($P$1,IF($A10=\"\",\"\",IF($A10=\"between\",SUMIFS(Breakdowns!U:U,Breakdowns!$H:$H,\">=\"&$B10,Breakdowns!$H:$H,\"<\"&$D10,Breakdowns!$AA:$AA,\"=No\"),SUMIFS(Breakdowns!U:U,Breakdowns!$H:$H,\">=\"&$B10,Breakdowns!$AA:$AA,\"=No\"))),IF($A10=\"\",\"\",IF($A10=\"between\",SUMIFS(Breakdowns!U:U,Breakdowns!$H:$H,\">=\"&$B10,Breakdowns!$H:$H,\"<\"&$D10),SUMIFS(Breakdowns!U:U,Breakdowns!$H:$H,\">=\"&$B10))))","v":""},{"$f":"IF($P$1,IF($A10=\"\",\"\",IF($A10=\"between\",SUMIFS(Breakdowns!W:W,Breakdowns!$H:$H,\">=\"&$B10,Breakdowns!$H:$H,\"<\"&$D10,Breakdowns!$AA:$AA,\"=No\"),SUMIFS(Breakdowns!W:W,Breakdowns!$H:$H,\">=\"&$B10,Breakdowns!$AA:$AA,\"=No\"))),IF($A10=\"\",\"\",IF($A10=\"between\",SUMIFS(Breakdowns!W:W,Breakdowns!$H:$H,\">=\"&$B10,Breakdowns!$H:$H,\"<\"&$D10),SUMIFS(Breakdowns!W:W,Breakdowns!$H:$H,\">=\"&$B10))))","v":""},{"$f":"IF($P$1,IF($A10=\"\",\"\",IF($A10=\"between\",SUMIFS(Breakdowns!Y:Y,Breakdowns!$H:$H,\">=\"&$B10,Breakdowns!$H:$H,\"<\"&$D10,Breakdowns!$AA:$AA,\"=No\"),SUMIFS(Breakdowns!Y:Y,Breakdowns!$H:$H,\">=\"&$B10,Breakdowns!$AA:$AA,\"=No\"))),IF($A10=\"\",\"\",IF($A10=\"between\",SUMIFS(Breakdowns!Y:Y,Breakdowns!$H:$H,\">=\"&$B10,Breakdowns!$H:$H,\"<\"&$D10),SUMIFS(Breakdowns!Y:Y,Breakdowns!$H:$H,\">=\"&$B10))))","v":""},null,null,null,null,null,"",""]
{"$rows_left_out":111}