{"text_format":"1","workbook":"xlsx","n_sheets":6,"sheets":["Read Me","Data Dictionary","Track by Mode","Roadway by Mode","Track and Roadway by Agency","Summary Tables"],"not_rendered":{"charts":4,"images":0,"macros":1,"external_links":0,"defined_names":18,"comments":0,"pivot_tables":0},"unopened":[],"bounds":{"document_bytes":16777216,"sheet_cells":100000,"rows_first":2000,"rows_last":500,"rows_between":2000,"halvings":0,"cell_chars":16384,"cell_head_chars":4096},"cells_cut":0,"cells_raw":0,"read":"whole","date_system":"1900"}

{"sheet":"Read Me","index":0,"n_rows":0,"n_cols":0,"rows_kept":0,"cut":false,"hidden":false,"merged":[]}

{"sheet":"Data Dictionary","index":1,"n_rows":56,"n_cols":3,"rows_kept":56,"cut":false,"hidden":false,"merged":[]}
["Term","Who reports it?","Definition"]
["Agency","All","The transit agency's name."]
["City","All","The city in which the agency is headquartered."]
["State","All","The state in which the agency is headquartered."]
["Legacy NTD ID","All","A four-digit identifying number for each agency used in the legacy NTD system."]
["NTD ID","All","A five-digit identifying number for each agency used in the current NTD system."]
["Organization Type","All","Description of the agency's legal entity."]
["Reporter Type","All","The type of NTD report that the agency completed this year."]
["Primary UZA Population","DOES NOT APPLY TO: Rural General Public Transit Sub-recipients, Intercity Bus Sub-recipients","The population of the urbanized area primarily served by the agency."]
["Agency VOMS","DOES NOT APPLY TO: Building Reporters, Planning Reporters, Separate Service Reporters, Tribal Subsidy Reporters, Intercity Bus Sub-recipients","The number of revenue vehicles operated across the whole agency to meet the annual maximum service requirement. This is the revenue vehicle count during the peak season of the year; on the week and day that maximum service is provided. Vehicles operated in maximum service (VOMS) exclude atypical days and one-time special events."]
["Mode","DOES NOT APPLY TO: Planning Reporters, Tribal Subsidy Reporters, Intercity Bus Sub-recipients","A system for carrying transit passengers described by specific right-of-way (ROW), technology and operational features."]
["Type of Service","DOES NOT APPLY TO: Planning Reporters, Tribal Subsidy Reporters, Intercity Bus Sub-recipients","Describes how public transportation services are provided by the transit agency: directly operated (DO) or purchased transportation (PT) services."]
["Mode VOMS","DOES NOT APPLY TO: Building Reporters, Planning Reporters, Separate Service Reporters, Tribal Subsidy Reporters, Intercity Bus Sub-recipients","The number of revenue vehicles operated by the given mode and type of service to meet the annual maximum service requirement. This is the revenue vehicle count during the peak season of the year; on the week and day that maximum service is provided. Vehicles operated in maximum service (VOMS) exclude atypical days and one-time special events."]
["Rural General Public Transit",null,"Reporter type for agencies that do not operate in an urban area and are not Tribes."]
["Intercity Bus",null,"Reporter type for private bus lines providing non-transit service connecting wide-ranging areas."]
["Building Reporter",null,"Reporter type for agencies that are building a new transit service but not yet operating it."]
["Planning Reporter",null,"Reporter type for entities that expend funds in planning transit but do not operate service."]
["Separate Service",null,"Reporter type for agencies that have a contractual relationship with another NTD reporter to provide service but do not report any service themselves."]
["Tribal Subsidy",null,"Reporter type for Tribes that subsidize service but do not operate service or pay the full cost of service."]
["Full Reporter",null,"Reporter type for agencies that operate urban service and complete the most detailed level of NTD report. Urban agencies that operate more than 30 vehicles or operate Fixed Guideway service are required to complete Full Reports; other urban agencies may do so if they wish."]
["Reduced Reporter",null,"Reporter type for agencies that operate urban service but complete a simplified NTD report. Urban agencies that operate 30 or fewer vehicles and do not operate Fixed Guideway service are eligible to complete Reduced Reports. This is sometimes called a Small Systems Report."]
["Urbanized Area (UZA)",null,"An area defined by the U. S. Census Bureau that includes: \n- One or more incorporated cities, villages, and towns (central place) \n- The adjacent densely settled surrounding territory (urban fringe) that together has a minimum of 50,000 persons \nThe urban fringe generally consists of contiguous territory having a density of at least 1,000 persons per square mile. Urbanized areas do not conform to congressional districts or any other political boundaries."]
["Alaska Railroad (AR)",null,"The passenger service portion of the Alaska Railroad Corporation. The service encompasses only car miles for passenger cars; car miles for freight cars are specifically excluded."]
["Bus (MB)",null,"A transit mode comprised of rubber-tired passenger vehicles operating on fixed routes and schedules over roadways. Vehicles are powered by: \n- Diesel \n- Gasoline \n- Battery \n- Alternative fuel engines contained within the vehicle"]
["Bus Rapid Transit (RB)",null,"Fixed-route bus mode: \n- In which the majority of each line operates in a separated right-of-way dedicated for public transportation use during peak periods; and \n- That includes features that emulate the services provided by rail fixed guideway public transportation systems, including: \n   o Defined stations \n   o Traffic signal priority for public transportation vehicles \n   o Short headway bidirectional services for a substantial part of weekdays and weekend days \n   o Pre-board ticketing, platform level boarding, and separate branding \nThis mode may include portions of service that are fixed-guideway and non-fixed-guideway."]
["Cable Car (CC)",null,"A transit mode that is an electric railway with individually controlled transit vehicles attached to a moving cable located below the street surface and powered by engines or motors at a central location, not onboard the vehicle."]
["Commuter Bus (CB)",null,"Fixed-route bus systems that are primarily connecting outlying areas with a central city through bus service that operates with at least five miles of continuous closed-door service. This service may operate motorcoaches (aka over-the-road buses), and usually features peak scheduling, multiple-trip tickets, and limited stops in the central city."]
["Commuter Rail (CR)",null,"A transit mode that is an electric or diesel propelled railway for urban passenger train service consisting of local short distance travel operating between a central city and adjacent suburbs. Service must be operated on a regular basis by or under contract with a transit operator for the purpose of transporting passengers within urbanized areas (UZAs), or between urbanized areas and outlying areas. \nSuch rail service, using either locomotive hauled or self-propelled railroad passenger cars, is generally characterized by: \n- Multi-trip tickets \n- Specific station to station fares \n- Railroad employment practices \n- Usually only one or two stations in the central business district \nIt does not include: \n- Heavy rail (HR) rapid transit \n- Light rail (LR)/streetcar transit service \nIntercity rail service is excluded, except for that portion of such service that is operated by or under contract with a public transit agency for predominantly commuter services. Predominantly commuter service means that for any given trip segment (i.e., distance between any two stations), more than 50 percent of the average daily ridership makes a return trip on the same day. Only the predominantly commuter service portion of an intercity route is eligible for inclusion when determining commuter rail (CR) route miles."]
["Demand Response (DR)",null,"A transit mode comprised of automobiles, vans or small buses operating in response to calls from passengers or their agents to the transit operator, who then dispatches a vehicle to pick up the passengers and transport them to their destinations. A demand response (DR) operation is characterized by the following: \n- The vehicles do not operate over a fixed route or on a fixed schedule except, perhaps, on a temporary basis to satisfy a special need; and \n- Typically, the vehicle may be dispatched to pick up several passengers at different pick-up points before taking them to their respective destinations and may even be interrupted en route to these destinations to pick up other passengers. \nThe following types of operations fall under the above definitions provided they are not on a scheduled fixed route basis: \n- Many origins—many destinations \n- Many origins—one destination \n- One origin—many destinations \n- One origin—one destination"]
["Demand Response Taxi (DT)",null,"A special form of the demand response mode operated through taxicab providers. The mode is always purchased transportation type of service. In order to be reportable, there must be a system in place through which passengers can share rides."]
["Ferryboat (FB)",null,"A transit mode comprised of vessels carrying passengers and/or vehicles over a body of water that are generally steam or diesel powered. Intercity ferryboat (FB) service is excluded, except for that portion of such service that is operated by or under contract with a public transit agency for predominantly commuter services. Predominantly commuter service means that for any given trip segment (i.e., distance between any two piers), more than 50 percent of the average daily ridership makes a return trip on the ferryboat on the same day. Only the predominantly commuter service portion of an intercity route is eligible for inclusion when determining ferryboat (FB) route miles."]
["Heavy Rail (HR)",null,"A transit mode that is an electric railway with the capacity for a heavy volume of traffic. It is characterized by: \n- High speed and rapid acceleration passenger rail cars operating singly or in multi-car trains on fixed rails \n- Separate rights-of-way (ROW) from which all other vehicular and foot traffic are excluded \n- Sophisticated signaling \n- Raised platform loading"]
["Hybrid Rail (YR)",null,"Rail systems primarily operating routes on the National system of railroads, but not operating with the characteristics of commuter rail. This service typically operates light rail-type vehicles as diesel multipleunit trains (DMU’s). These trains do not meet Federal Railroad Administration standards, and so must operate with temporal separation from freight rail traffic."]
["Inclined Plane (IP)",null,"A transit mode that is a railway operating over exclusive right-of-way (ROW) on steep grades (slopes) with powerless vehicles propelled by moving cables attached to the vehicles and powered by engines or motors at a central location not onboard the vehicle. The special tramway types of vehicles have passenger seats that remain horizontal while the undercarriage (truck) is angled parallel to the slope."]
["Light Rail (LR)",null,"A transit mode that is typically an electric railway with a light volume traffic capacity compared to heavy rail (HR). It is characterized by: \n- Passenger rail cars operating singly (or in short, usually two car, trains) on fixed rails in shared or exclusive right-of-way (ROW) \n- Low or high platform loading \n- Vehicle power drawn from an overhead electric line via a trolley or a pantograph"]
["Monorail/Automated Guideway (MG)",null,"Monorail and Automated Guideway modes operate on exclusive guideway without using steel wheels on rails."]
["Streetcar Rail (SR)",null,"This mode is for rail transit systems operating entire routes predominantly on streets in mixed-traffic. This service typically operates with single-car trains powered by overhead catenaries and with frequent stops."]
["Trolleybus (TB)",null,"A transit mode comprised of electric rubber-tired passenger vehicles, manually steered and operating singly on city streets. Vehicles are propelled by a motor drawing current through overhead wires via trolleys, from a central power source not onboard the vehicle."]
["Vanpool (VP)",null,"A transit mode comprised of vans, small buses and other vehicles operating as a ride sharing arrangement, providing transportation to a group of individuals traveling directly between their homes and a regular destination within the same geographical area."]
["Jitney (JT)",null,"A transit mode comprising passenger cars or vans operating on fixed routes (sometimes with minor deviations) as demand warrants without fixed schedules or fixed stops."]
["Aerial Tramway (TR)",null,"A transit mode that is an electric system of aerial cables with suspended powerless passenger vehicles. The vehicles are propelled by separate cables attached to the vehicle suspension system and powered by engines or motors at a central location not on-board the vehicle."]
["Publico (PB)",null,"A transit mode comprised of passenger vans or small buses operating with fixed routes but no fixed schedules in Puerto Rico. Publicos (PB) are a privately owned and operated public transit service which is market oriented and unsubsidized, but regulated through a public service commission, state or local government. Publicos (PB) are operated under franchise agreements, fares are regulated by route and there are special insurance requirements. Vehicle capacity varies from 8 to 24, and the vehicles may be owned or leased by the operator."]
["Questionable (Q)",null,"FTA marks a data point as Questionable when there is reason to believe it is incorrect, but the reporting agency has been unable to correct the data or offer an explanation for its anomalous appearance."]
["Waived (W)",null,"FTA marks a data point as Waived when the reporting agency has not reported the data point according to NTD reporting requirements, but has received a waiver to report the data as-is for one year."]
["Miles of Track/Roadway","ONLY APPLIES TO: Full Reporters","Miles of track/roadway are measured without regard to whether or not traffic can flow in both directions. Multiple tracks/lanes in the same right-of-way are counted individually. All track is counted, including yard track and sidings."]
["At Grade: Restricted Right-of-Way Miles","ONLY APPLIES TO: Full Reporters","Ground-level track that does not share its right-of-way with non-rail modes of transport, except possibly at a discrete number of grade crossings."]
["Street Running Miles","ONLY APPLIES TO: Full Reporters","Includes alignments where rail vehicles and rubber-tire vehicles travel in the same lanes and alignments where pedestrians may freely cross the tracks at any point."]
["Elevated on Structure","ONLY APPLIES TO: Full Reporters","Rail transit way above surface level on structures (e.g. bridges, overpasses). Transition segments above surface level on structures are included."]
["Elevated on Fill","ONLY APPLIES TO: Full Reporters","Rail transit way above surface level on fill (solid ground such as dirt or concrete). Transition segments above surface level on fill are included."]
["Open Cut","ONLY APPLIES TO: Full Reporters","Rail transit way below surface level in an excavated cut that has not had a covering constructed over it. Transition segments to open cut or subway tunnel/tube segments are included."]
["Subway","ONLY APPLIES TO: Full Reporters","Rail transit way below surface with a cover over the tunnel. Cut and cover, bored tunnel, underwater tubes, etc., are included."]
["At Grade: Restricted Right-of-Way Crossings","ONLY APPLIES TO: Full Reporters","An intersection between a roadway and a rail restricted right-of-way that cross each other at the same level (at grade)."]
["Street Running Crossings","ONLY APPLIES TO: Full Reporters","For street-running operations, each street intersection is considered a grade crossing (this excludes driveways and parking lot entrances)."]
["Permanent Busway","ONLY APPLIES TO: Full Reporters","Lanes that are reserved for the exclusive use of public transportation at all times."]
["Permanent HOV","ONLY APPLIES TO: Full Reporters","Lanes that are not open to general traffic at any time. This includes 24-hour High Occupancy Vehicle (HOV) or High Occupancy/Toll (HO/T) lanes, and lanes that are HOV or HO/T at some times and transit-exclusive at all other times."]
["Part-Time Busway or HOV","ONLY APPLIES TO: Full Reporters","Lanes that are sometimes restricted to transit vehicles or High Occupancy Vehicles (HOVs), and sometimes open to general traffic."]

{"sheet":"Track by Mode","index":2,"n_rows":95,"n_cols":39,"rows_kept":95,"cut":false,"hidden":false,"merged":[]}
["Name","City","State","Legacy NTD ID","NTD ID","Organization Type","Reporter Type","Primary UZA Population","Agency VOMS","Mode","TOS","Mode VOMS","Miles of Track:","At Grade: Restricted Right-of-Way","At Grade: Restricted Right-of-Way Questionable","Street Running","Street Running Questionable","Elevated on Structure","Elevated on Structure Questionable","Elevated on Fill","Elevated on Fill Questionable","Open Cut","Open Cut Questionable","Subway","Subway Questionable","Total Miles","Total Miles Questionable","Number of Crossings:","At Grade: Restricted Right-of-Way Crossings","At Grade: Restricted Right-of-Way Questionable","Street Running Crossings","Street Running Questionable","Total Crossings","Total Crossings Questionable","Any data questionable?",null,null,null,{"$f":"IF(AM4=1,1,0)","v":1}]
["MTA New York City Transit","New York","NY",2008,20008,"Subsidiary Unit of a Transit Agency, Reporting Separately","Full Reporter",18351295,11000,"HR","DO",5282,null,137.30000000000001,"",0,"",196.3,"",29,"",29.5,"",440.4,"",832.5,"",null,0,"",0,"",0,"",{"$f":"IF(OR(O2=\"Q\",Q2=\"Q\",S2=\"Q\",U2=\"Q\", W2=\"Q\", Y2=\"Q\",AA2=\"Q\",AD2=\"Q\", AF2=\"Q\",AH2=\"Q\"),\"Yes\",\"No\")","v":"No"},null,null,null,"Hide questionable data tags"]
["New Jersey Transit Corporation","Newark","NJ",2080,20080,"Other Publicly-Owned or Privately Chartered Corporation","Full Reporter",18351295,4020,"CR","DO",1267,null,812.59999999999991,"",0,"",10.4,"",28.4,"",8.6,"",8,"",867.99999999999989,"",null,328,"",0,"",328,"",{"$f":"IF(OR(O3=\"Q\",Q3=\"Q\",S3=\"Q\",U3=\"Q\", W3=\"Q\", Y3=\"Q\",AA3=\"Q\",AD3=\"Q\", AF3=\"Q\",AH3=\"Q\"),\"Yes\",\"No\")","v":"No"},null,null,null,"Show questionable data tags"]
["New Jersey Transit Corporation","Newark","NJ",2080,20080,"Other Publicly-Owned or Privately Chartered Corporation","Full Reporter",18351295,4020,"LR","PT",42,null,31.299999999999997,"",1.6,"",2.7,"",0.9,"",0,"",0,"",36.5,"",null,24,"",9,"",33,"","No",null,null,null,1]
["New Jersey Transit Corporation","Newark","NJ",2080,20080,"Other Publicly-Owned or Privately Chartered Corporation","Full Reporter",18351295,4020,"YR","PT",16,null,52.9,"",3.8,"",0,"",0,"",0,"",0,"",56.699999999999996,"",null,59,"",13,"",72,"","No"]
["New Jersey Transit Corporation","Newark","NJ",2080,20080,"Other Publicly-Owned or Privately Chartered Corporation","Full Reporter",18351295,4020,"LR","DO",14,null,9.1,"",1.5,"",0,"",0,"",0,"",3.3,"",13.899999999999999,"",null,5,"",10,"",15,"","No"]
["Los Angeles County Metropolitan Transportation Authority dba: Metro","Los Angeles","CA",9154,90154,"Independent Public Agency or Authority of Transit Service","Full Reporter",12150996,3516,"LR","DO",144,null,72,"",0,"",15.5,"",26,"",16.7,"",5.6,"",135.80000000000001,"",null,152,"",0,"",152,"","No"]
["Los Angeles County Metropolitan Transportation Authority dba: Metro","Los Angeles","CA",9154,90154,"Independent Public Agency or Authority of Transit Service","Full Reporter",12150996,3516,"HR","DO",70,null,1.3,"",0,"",0,"",0,"",0.2,"",32.6,"",34.1,"",null,0,"",0,"",0,"","No"]
["Washington Metropolitan Area Transit Authority","Washington","DC",3030,30030,"Independent Public Agency or Authority of Transit Service","Full Reporter",4586770,3200,"HR","DO",954,null,152.19999999999999,"",0,"",24.2,"",0.5,"",3.1,"",112.3,"",292.29999999999995,"",null,0,"",0,"",0,"","No"]
["King County Department of Transportation - Metro Transit Division","Seattle","WA",1,1,"City, County or Local Government Unit or Department of Transportation","Full Reporter",3059393,2875,"SR","DO",3,null,0.1,"",2.5,"",0,"",0,"",0,"",0,"",2.6,"",null,0,"",18,"",18,"","No"]
["Chicago Transit Authority","Chicago","IL",5066,50066,"Independent Public Agency or Authority of Transit Service","Full Reporter",8608208,2728,"HR","DO",1134,null,95.300000000000011,"",0,"",116.5,"",49.8,"",2.7,"",23.5,"",287.8,"",null,25,"",0,"",25,"","No"]
["Massachusetts Bay Transportation Authority","Boston","MA",1003,10003,"Independent Public Agency or Authority of Transit Service","Full Reporter",4181019,2344,"CR","PT",421,null,709,"",0,"",0,"",0,"",0,"",2.5,"",711.5,"",null,258,"",0,"",258,"","No"]
["Massachusetts Bay Transportation Authority","Boston","MA",1003,10003,"Independent Public Agency or Authority of Transit Service","Full Reporter",4181019,2344,"HR","DO",336,null,56,"",0,"",4,"",0,"",10,"",38,"",108,"",null,0,"",0,"",0,"","No"]
["Massachusetts Bay Transportation Authority","Boston","MA",1003,10003,"Independent Public Agency or Authority of Transit Service","Full Reporter",4181019,2344,"LR","DO",151,null,58,"",2,"",4,"",0,"",0,"",14,"",78,"",null,56,"",9,"",65,"","No"]
["Southeastern Pennsylvania Transportation Authority","Philadelphia","PA",3019,30019,"Independent Public Agency or Authority of Transit Service","Full Reporter",5441567,2340,"CR","DO",339,null,609.5,"",0,"",0,"",0,"",0,"",6,"",615.5,"",null,287,"",0,"",287,"","No"]
["Southeastern Pennsylvania Transportation Authority","Philadelphia","PA",3019,30019,"Independent Public Agency or Authority of Transit Service","Full Reporter",5441567,2340,"HR","DO",287,null,39,"",0,"",17,"",0,"",0,"",43.8,"",99.8,"",null,0,"",0,"",0,"","No"]
["Southeastern Pennsylvania Transportation Authority","Philadelphia","PA",3019,30019,"Independent Public Agency or Authority of Transit Service","Full Reporter",5441567,2340,"SR","DO",124,null,23.1,"",189.2,"",0,"",0,"",0,"",5,"",217.29999999999998,"",null,49,"",646,"",695,"","No"]
["Metropolitan Transit Authority of Harris County, Texas ","Houston","TX",6008,60008,"Independent Public Agency or Authority of Transit Service","Full Reporter",4944332,2240,"LR","DO",51,null,51,"",4.5999999999999996,"",2.8,"",0.4,"",0,"",0,"",58.8,"",null,127,"",34,"",161,"","No"]
["San Francisco Municipal Railway","San Francisco","CA",9015,90015,"City, County or Local Government Unit or Department of Transportation","Full Reporter",3281212,1524,"LR","DO",131,null,29.6,"",23.5,"",0,"",0,"",0.2,"",14.9,"",68.2,"",null,77,"",258,"",335,"","No"]
["San Francisco Municipal Railway","San Francisco","CA",9015,90015,"City, County or Local Government Unit or Department of Transportation","Full Reporter",3281212,1524,"CC","DO",27,null,0,"",8.8000000000000007,"",0,"",0,"",0,"",0,"",8.8000000000000007,"",null,0,"",77,"",77,"","No"]
["San Francisco Municipal Railway","San Francisco","CA",9015,90015,"City, County or Local Government Unit or Department of Transportation","Full Reporter",3281212,1524,"SR","DO",24,null,0,"",21.7,"",0,"",0,"",0,"",0,"",21.7,"",null,0,"",82,"",82,"","No"]
["Maryland Transit Administration","Baltimore","MD",3034,30034,"State Government Unit or Department of Transportation","Full Reporter",2203663,1491,"CR","PT",142,null,471,"",0,"",0,"",0,"",0,"",0,"",471,"",null,40,"",0,"",40,"","No"]
["Maryland Transit Administration","Baltimore","MD",3034,30034,"State Government Unit or Department of Transportation","Full Reporter",2203663,1491,"HR","DO",54,null,18,"",0,"",5,"",0,"",0,"",11,"",34,"",null,0,"",0,"",0,"","No"]
["Maryland Transit Administration","Baltimore","MD",3034,30034,"State Government Unit or Department of Transportation","Full Reporter",2203663,1491,"LR","DO",38,null,49.699999999999996,"",3,"",4.9000000000000004,"",0,"",0,"",0,"",57.599999999999994,"",null,35,"",17,"",52,"","No"]
["Denver Regional Transportation District","Denver","CO",8006,80006,"Independent Public Agency or Authority of Transit Service","Full Reporter",2374203,1395,"LR","DO",137,null,63.3,"",0,"",7.9,"",19.8,"",2.4,"",0.6,"",94,"",null,57,"",0,"",57,"","No"]
["Metro-North Commuter Railroad Company, dba: MTA Metro-North Railroad","New York","NY",2078,20078,"Subsidiary Unit of a Transit Agency, Reporting Separately","Full Reporter",18351295,1199,"CR","DO",1188,null,791.5,"",0,"",6.2,"",0,"",0,"",10.3,"",808,"",null,157,"",0,"",157,"","No"]
["Miami-Dade Transit","Miami","FL",4034,40034,"City, County or Local Government Unit or Department of Transportation","Full Reporter",5502379,1129,"HR","DO",80,null,9.9,"",0,"",46.8,"",1.6,"",0,"",0,"",58.3,"",null,0,"",0,"",0,"","No"]
["Miami-Dade Transit","Miami","FL",4034,40034,"City, County or Local Government Unit or Department of Transportation","Full Reporter",5502379,1129,"MG","DO",23,null,0,"",0,"",9.4,"",0,"",0,"",0,"",9.4,"",null,0,"",0,"",0,"","No"]
["Utah Transit Authority","Salt Lake City","UT",8001,80001,"Independent Public Agency or Authority of Transit Service","Full Reporter",1021243,1104,"LR","DO",91,null,102.8,"",1,"",1.6,"",2.7,"",0,"",0,"",108.1,"",null,68,"",76,"",144,"","No"]
["Utah Transit Authority","Salt Lake City","UT",8001,80001,"Independent Public Agency or Authority of Transit Service","Full Reporter",1021243,1104,"CR","DO",36,null,109.7,"",0,"",1.3,"",6.9,"",1.9,"",0,"",119.80000000000001,"",null,65,"",0,"",65,"","No"]
["Northeast Illinois Regional Commuter Railroad Corporation dba: Metra Rail","Chicago","IL",5118,50118,"Independent Public Agency or Authority of Transit Service","Full Reporter",8608208,1062,"CR","DO",1062,null,846.2,"",0,"",0,"",310.8,"",48.9,"",0,"",1205.9000000000001,"",null,568,"",0,"",568,"","No"]
["Dallas Area Rapid Transit","Dallas","TX",6056,60056,"Independent Public Agency or Authority of Transit Service","Full Reporter",5121892,1042,"LR","DO",105,null,122.6,"",3.6,"",68,"",0,"",2.2000000000000002,"",6.2,"",202.6,"",null,142,"",29,"",171,"","No"]
["Dallas Area Rapid Transit","Dallas","TX",6056,60056,"Independent Public Agency or Authority of Transit Service","Full Reporter",5121892,1042,"CR","PT",23,null,49.7,"",0,"",5.6,"",0,"",0,"",0,"",55.300000000000004,"",null,44,"",0,"",44,"","No"]
["Dallas Area Rapid Transit","Dallas","TX",6056,60056,"Independent Public Agency or Authority of Transit Service","Full Reporter",5121892,1042,"SR","DO",1,null,2.4,"",0,"",0,"",0,"",0,"",0,"",2.4,"",null,0,"",0,"",0,"","No"]
["MTA Long Island Rail Road","Jamaica","NY",2100,20100,"Subsidiary Unit of a Transit Agency, Reporting Separately","Full Reporter",18351295,1019,"CR","DO",1019,null,603,"",0,"",36.1,"",24,"",0,"",7.2,"",670.3,"",null,334,"",0,"",334,"","No"]
["Tri-County Metropolitan Transportation District of Oregon","Portland","OR",8,8,"Independent Public Agency or Authority of Transit Service","Full Reporter",1849898,918,"LR","DO",104,null,78.599999999999994,"",0,"",4.8,"",3.4,"",10.9,"",6.4,"",104.1,"",null,187,"",0,"",187,"","No"]
["Tri-County Metropolitan Transportation District of Oregon","Portland","OR",8,8,"Independent Public Agency or Authority of Transit Service","Full Reporter",1849898,918,"YR","PT",4,null,18.7,"",0,"",0.5,"",0,"",0,"",0,"",19.2,"",null,27,"",0,"",27,"","No"]
["Port Authority of Allegheny County","Pittsburgh","PA",3022,30022,"Independent Public Agency or Authority of Transit Service","Full Reporter",1733853,912,"LR","DO",56,null,34.9,"",6.7,"",3,"",0,"",0,"",6.6,"",51.2,"",null,37,"",5,"",42,"","No"]
["Port Authority of Allegheny County","Pittsburgh","PA",3022,30022,"Independent Public Agency or Authority of Transit Service","Full Reporter",1733853,912,"IP","DO",2,null,0.2,"",0,"",0,"",0,"",0,"",0,"",0.2,"",null,0,"",0,"",0,"","No"]
["Metro Transit ","Minneapolis","MN",5027,50027,"Subsidiary Unit of a Transit Agency, Reporting Separately","Full Reporter",2650890,885,"LR","DO",72,null,43.2,"",0,"",2.7,"",0.9,"",1,"",3.5,"",51.300000000000004,"",null,104,"",0,"",104,"","No"]
["Metro Transit ","Minneapolis","MN",5027,50027,"Subsidiary Unit of a Transit Agency, Reporting Separately","Full Reporter",2650890,885,"CR","PT",20,null,68.5,"",0,"",0.6,"",0,"",0,"",0,"",69.099999999999994,"",null,36,"",0,"",36,"","No"]
["Metropolitan Atlanta Rapid Transit Authority","Atlanta","GA",4022,40022,"Independent Public Agency or Authority of Transit Service","Full Reporter",4515419,838,"HR","DO",224,null,58.2,"",0,"",24.4,"",0,"",0,"",21.1,"",103.7,"",null,0,"",0,"",0,"","No"]
["San Diego Metropolitan Transit System","San Diego","CA",9026,90026,"Independent Public Agency or Authority of Transit Service","Full Reporter",2956746,732,"LR","DO",97,null,82.7,"",6.6,"",8.9,"",1.8,"",1.4,"",1.2,"",102.6,"",null,70,"",26,"",96,"","No"]
["Santa Clara Valley Transportation Authority","San Jose","CA",9013,90013,"Independent Public Agency or Authority of Transit Service","Full Reporter",1664496,679,"LR","DO",59,null,67.099999999999994,"",0,"",2.9,"",7.9,"",1.4,"",0.3,"",79.599999999999994,"",null,168,"",0,"",168,"","No"]
["Capital Metropolitan Transportation Authority","Austin","TX",6048,60048,"Independent Public Agency or Authority of Transit Service","Full Reporter",1362416,674,"YR","PT",4,null,63.6,"",0,"",1,"",0,"",0,"",0,"",64.599999999999994,"",null,79,"",0,"",79,"","No"]
["The Greater Cleveland Regional Transit Authority","Cleveland","OH",5015,50015,"Independent Public Agency or Authority of Transit Service","Full Reporter",1780673,547,"HR","DO",20,null,37.5,"",0,"",1.9,"",1.9,"",0,"",0.6,"",41.9,"",null,0,"",0,"",0,"","No"]
["The Greater Cleveland Regional Transit Authority","Cleveland","OH",5015,50015,"Independent Public Agency or Authority of Transit Service","Full Reporter",1780673,547,"LR","DO",14,null,27,"",0,"",0.9,"",2,"",3.1,"",0,"",33,"",null,22,"",0,"",22,"","No"]
["San Francisco Bay Area Rapid Transit District","Oakland","CA",9003,90003,"Independent Public Agency or Authority of Transit Service","Full Reporter",3281212,538,"HR","DO",534,null,154.4,"",0,"",57.1,"",0,"",0,"",56.1,"",267.60000000000002,"",null,0,"",0,"",0,"","No"]
["San Francisco Bay Area Rapid Transit District","Oakland","CA",9003,90003,"Independent Public Agency or Authority of Transit Service","Full Reporter",3281212,538,"MG","PT",4,null,0.3,"",0,"",2.5,"",0,"",0.3,"",0,"",3.0999999999999996,"",null,0,"",0,"",0,"","No"]
["Bi-State Development Agency of the Missouri-Illinois Metropolitan District, d.b.a.(St. Louis) Metro","St. Louis","MO",7006,70006,"Independent Public Agency or Authority of Transit Service","Full Reporter",2150706,473,"LR","DO",58,null,54.9,"",0,"",8.6,"",12.4,"",14.5,"",5.9,"",96.3,"",null,25,"",0,"",25,"","No"]
["Charlotte Area Transit System","Charlotte","NC",4008,40008,"City, County or Local Government Unit or Department of Transportation","Full Reporter",1249442,431,"LR","DO",14,null,6.6,"",0,"",0.9,"",1.8,"",0,"",0,"",9.3000000000000007,"",null,20,"",0,"",20,"","No"]
["Transportation District Commission of Hampton Roads","Hampton","VA",3083,30083,"Independent Public Agency or Authority of Transit Service","Full Reporter",1439666,368,"LR","DO",6,null,4.2,"",1.9,"",1.3,"",0,"",0,"",0,"",7.4,"",null,14,"",8,"",22,"","No"]
["Niagara Frontier Transportation Authority","Buffalo","NY",2004,20004,"Independent Public Agency or Authority of Transit Service","Full Reporter",935906,351,"LR","DO",23,null,3.3,"",0.4,"",0,"",0,"",0,"",10.4,"",14.100000000000001,"",null,0,"",8,"",8,"","No"]
["City of Tucson","Tucson   ","AZ",9033,90033,"City, County or Local Government Unit or Department of Transportation","Full Reporter",843168,338,"SR","DO",6,null,0.2,"",3.7,"",0,"",0,"",0,"",0,"",3.9000000000000004,"",null,2,"",40,"",42,"","No"]
["Central Puget Sound Regional Transit Authority","Seattle","WA",40,40,"Independent Public Agency or Authority of Transit Service","Full Reporter",3059393,336,"CR","PT",62,null,155.20000000000002,"",0,"",0.7,"",0,"",0.6,"",2.4,"",158.9,"",null,66,"",0,"",66,"","No"]
["Central Puget Sound Regional Transit Authority","Seattle","WA",40,40,"Independent Public Agency or Authority of Transit Service","Full Reporter",3059393,336,"LR","DO",34,null,20.7,"",0,"",12.7,"",0,"",0,"",5.0999999999999996,"",38.5,"",null,37,"",0,"",37,"","No"]
["Central Puget Sound Regional Transit Authority","Seattle","WA",40,40,"Independent Public Agency or Authority of Transit Service","Full Reporter",3059393,336,"SR","DO",2,null,1.7,"",1,"",0,"",0,"",0,"",0,"",2.7,"",null,10,"",4,"",14,"","No"]
["Port Authority Trans-Hudson Corporation","Jersey City","NJ",2098,20098,"Independent Public Agency or Authority of Transit Service","Full Reporter",18351295,304,"HR","DO",299,null,12.7,"",0,"",3.3,"",5,"",5.2,"",16.899999999999999,"",43.099999999999994,"",null,2,"",0,"",2,"","No"]
["Jacksonville Transportation Authority","Jacksonville","FL",4040,40040,"Independent Public Agency or Authority of Transit Service","Full Reporter",1065219,246,"MG","DO",5,null,0,"",0,"",5.4,"",0,"",0,"",0,"",5.4,"",null,0,"",0,"",0,"","No"]
["North County Transit District","Oceanside","CA",9030,90030,"Independent Public Agency or Authority of Transit Service","Full Reporter",2956746,230,"CR","PT",24,null,97.6,"",0,"",1.8,"",0,"",1.6,"",0,"",101,"",null,31,"",0,"",31,"","No"]
["North County Transit District","Oceanside","CA",9030,90030,"Independent Public Agency or Authority of Transit Service","Full Reporter",2956746,230,"YR","PT",8,null,31.7,"",0,"",0.8,"",0,"",0,"",0,"",32.5,"",null,47,"",0,"",47,"","No"]
["Sacramento Regional Transit District","Sacramento","CA",9019,90019,"Independent Public Agency or Authority of Transit Service","Full Reporter",1723634,222,"LR","DO",61,null,62.6,"",7.9,"",2.6,"",2,"",0,"",0,"",75.099999999999994,"",null,59,"",74,"",133,"","No"]
["Hillsborough Area Regional Transit Authority","Tampa","FL",4041,40041,"Independent Public Agency or Authority of Transit Service","Full Reporter",2441770,201,"SR","DO",3,null,3.5,"",0,"",0,"",0,"",0,"",0,"",3.5,"",null,23,"",0,"",23,"","No"]
["Southern California Regional Rail Authority dba: Metrolink","Los Angeles","CA",9151,90151,"Independent Public Agency or Authority of Transit Service","Full Reporter",12150996,192,"CR","PT",192,null,653.1,"",0,"",2.4,"",0.3,"",0,"",0,"",655.80000000000007,"",null,423,"",0,"",423,"","No"]
["New Orleans Regional Transit Authority","New Orleans","LA",6032,60032,"Independent Public Agency or Authority of Transit Service","Full Reporter",899703,178,"SR","PT",27,null,18.600000000000001,"",0,"",0,"",0,"",0,"",0,"",18.600000000000001,"",null,247,"",0,"",247,"","No"]
["Memphis Area Transit Authority","Memphis","TN",4003,40003,"City, County or Local Government Unit or Department of Transportation","Full Reporter",1060061,150,"SR","DO",0,null,3.2,"",7,"",0.1,"",0.2,"",0,"",0,"",10.5,"",null,0,"",0,"",0,"","No"]
["Peninsula Corridor Joint Powers Board dba: Caltrain","San Carlos","CA",9134,90134,"Independent Public Agency or Authority of Transit Service","Full Reporter",3281212,134,"CR","PT",105,null,127.7,"",0,"",4,"",4,"",1,"",0,"",136.69999999999999,"",null,54,"",0,"",54,"",{"$f":"IF(OR(O67=\"Q\",Q67=\"Q\",S67=\"Q\",U67=\"Q\", W67=\"Q\", Y67=\"Q\",AA67=\"Q\",AD67=\"Q\", AF67=\"Q\",AH67=\"Q\"),\"Yes\",\"No\")","v":"No"}]
["Denton County Transportation Authority","Lewisville","TX",6101,60101,"Independent Public Agency or Authority of Transit Service","Full Reporter",366174,94,"YR","PT",8,null,27.9,"",0,"",0.8,"",0,"",0,"",0,"",28.7,"",null,43,"",0,"",43,"","No"]
["Virginia Railway Express","Alexandria","VA",3073,30073,"Independent Public Agency or Authority of Transit Service","Full Reporter",4586770,90,"CR","PT",90,null,171.4,"",0,"",2.2000000000000002,"",0,"",0,"",0.9,"",174.5,"",null,20,"",0,"",20,"","No"]
["Rio Metro Regional Transit District","Albuquerque","NM",6111,60111,"Independent Public Agency or Authority of Transit Service","Full Reporter",741318,88,"CR","PT",25,null,103,"",0,"",0.8,"",7.1,"",0.2,"",0,"",111.1,"",null,86,"",0,"",86,"","No"]
["Port Authority Transit Corporation","Lindenwold","NJ",2075,20075,"Independent Public Agency or Authority of Transit Service","Full Reporter",5441567,78,"HR","DO",78,null,12.6,"",0,"",4.0999999999999996,"",13.6,"",2.2999999999999998,"",5.8,"",38.4,"",null,0,"",0,"",0,"","No"]
["Regional Transportation Authority","Nashville","TN",4159,40159,"Independent Public Agency or Authority of Transit Service","Full Reporter",969587,74,"CR","PT",7,null,33,"",0,"",0,"",0,"",0,"",0,"",33,"",null,35,"",0,"",35,"","No"]
["Central Arkansas Transit Authority","North Little Rock","AR",6033,60033,"Independent Public Agency or Authority of Transit Service","Full Reporter",431388,72,"SR","DO",3,null,0,"",3,"",0.5,"",0,"",0,"",0,"",3.5,"",null,0,"",24,"",24,"","No"]
["Chattanooga Area Regional Transportation Authority","Chattanooga","TN",4001,40001,"City, County or Local Government Unit or Department of Transportation","Full Reporter",381112,71,"IP","DO",2,null,1,"",0,"",0,"",0,"",0,"",0,"",1,"",null,0,"",0,"",0,"","No"]
["Northern Indiana Commuter Transportation District","Chesterton","IN",5104,50104,"Independent Public Agency or Authority of Transit Service","Full Reporter",8608208,70,"CR","DO",70,null,95.6,"",2,"",0,"",32.799999999999997,"",0,"",0,"",130.39999999999998,"",null,85,"",32,"",117,"","No"]
["South Florida Regional Transportation Authority","Pompano Beach","FL",4077,40077,"Independent Public Agency or Authority of Transit Service","Full Reporter",5502379,65,"CR","PT",42,null,152.19999999999999,"",0,"",0,"",0,"",0,"",0,"",152.19999999999999,"",null,73,"",0,"",73,"","No"]
["West Virginia University - Morgantown Personal Rapid Transit","Morgantown","WV",3107,30107,"University","Full Reporter",70350,64,"MG","DO",64,null,4,"",0,"",4.7,"",0,"",0,"",0,"",8.6999999999999993,"",null,0,"",0,"",0,"","No"]
["Cambria County Transit Authority","Johnstown","PA",3012,30012,"Independent Public Agency or Authority of Transit Service","Full Reporter",69014,54,"IP","DO",2,null,0.3,"",0,"",0,"",0,"",0,"",0,"",0.3,"",null,0,"",0,"",0,"","No"]
["Alternativa de Transporte Integrado -ATI","San Juan","PR",4094,40094,"State Government Unit or Department of Transportation","Full Reporter",2148346,53,"HR","PT",32,null,10.199999999999999,"",0,"",12.2,"",0,"",1.4,"",1.7,"",25.5,"",null,0,"",0,"",0,"","No"]
["Las Vegas Monorail Company","Las Vegas","NV",9242,90242,"Private-Non-Profit Corporation","Full Reporter",1886011,48,"MG","DO",24,null,0,"",0,"",7.7,"",0,"",0,"",0,"",7.7,"",null,0,"",0,"",0,"","No"]
["Las Vegas Monorail Company","Las Vegas","NV",9242,90242,"Private-Non-Profit Corporation","Full Reporter",1886011,48,"MG","PT",24,null,0,"",0,"",7.7,"",0,"",0,"",0,"",7.7,"",null,0,"",0,"",0,"","No"]
["Kenosha Transit","Kenosha","WI",5003,50003,"City, County or Local Government Unit or Department of Transportation","Full Reporter",124064,47,"SR","DO",1,null,2,"",0,"",0,"",0,"",0,"",0,"",2,"",null,14,"",0,"",14,"","No"]
["Staten Island Rapid Transit Operating Authority, dba: MTA Staten Island Railway","Staten Island","NY",2099,20099,"Independent Public Agency or Authority of Transit Service","Full Reporter",18351295,44,"HR","DO",44,null,3,"",0,"",2,"",12,"",14.5,"",0.2,"",31.7,"",null,0,"",0,"",0,"","No"]
["Connecticut Department of Transportation","Newington","CT",1102,10102,"State Government Unit or Department of Transportation","Full Reporter",924859,43,"CR","PT",28,null,50.7,"",0,"",3.2,"",43.1,"",11.1,"",1,"",109.10000000000001,"",null,0,"",0,"",0,"","No"]
["Pennsylvania Department of Transportation","Harrisburg","PA",3057,30057,"State Government Unit or Department of Transportation","Full Reporter",5441567,40,"CR","PT",40,null,137.80000000000001,"",0,"",6.6,"",0,"",0,"",0,"",144.4,"",null,1,"",0,"",1,"","No"]
["Alaska Railroad Corporation","Anchorage","AK",41,41,"State Government Unit or Department of Transportation","Full Reporter",251243,39,"AR","DO",39,null,676.1,"",2.6,"",0,"",0,"",0,"",4.0999999999999996,"",682.80000000000007,"",null,132,"",1,"",133,"","No"]
["Central Florida Commuter Rail","Sanford","FL",4232,40232,"State Government Unit or Department of Transportation","Full Reporter",1510516,30,"CR","PT",30,null,33.5,"",0,"",0.2,"",0,"",0,"",0,"",33.700000000000003,"",null,91,"",0,"",91,"","No"]
["Valley Metro Rail, Inc.","Phoenix","AZ",9209,90209,"Other Publicly-Owned or Privately Chartered Corporation","Full Reporter",3629114,28,"LR","PT",28,null,42.199999999999996,"",0.1,"",0.7,"",0,"",0,"",0,"",42.999999999999993,"",null,139,"",1,"",140,"","No"]
["Altamont Corridor Express","Stockton","CA",9182,90182,"Independent Public Agency or Authority of Transit Service","Full Reporter",370583,26,"CR","PT",26,null,77.5,"",0,"",0.5,"",9.5,"",2,"",0.5,"",90,"",null,127,"",0,"",127,"","No"]
["Northern New England Passenger Rail Authority","Portland","ME",1115,10115,"Independent Public Agency or Authority of Transit Service","Full Reporter",203914,20,"CR","PT",20,null,142.6,"",0,"",0,"",0,"",0,"",0,"",142.6,"",null,103,"",0,"",103,"","No"]
["City of Portland","Portland","OR",58,58,"City, County or Local Government Unit or Department of Transportation","Full Reporter",1849898,14,"SR","PT",12,null,0,"",14.8,"",0,"",0,"",0,"",0,"",14.8,"",null,0,"",191,"",191,"","No"]
["Detroit Transportation Corporation","Detroit","MI",5141,50141,"Independent Public Agency or Authority of Transit Service","Full Reporter",3734090,10,"MG","DO",10,null,0,"",0,"",2.9,"",0,"",0,"",0,"",2.9,"",null,0,"",0,"",0,"","No"]
["City of Seattle - Seattle Center Monorail Transit","Seattle","WA",23,23,"City, County or Local Government Unit or Department of Transportation","Full Reporter",3059393,8,"MG","PT",8,null,0,"",0,"",1.8,"",0,"",0,"",0,"",1.8,"",null,0,"",0,"",0,"","No"]
["City of Atlanta - Department of Public Works - Transit Division","Atlanta","GA",4230,40230,"City, County or Local Government Unit or Department of Transportation","Full Reporter",4515419,3,"SR","DO",3,null,0.1,"",2.6,"",0,"",0,"",0,"",0,"",2.7,"",null,0,"",33,"",33,"","No"]
["McKinney Avenue Transit Authority","Dallas","TX",6133,60133,"Private-Non-Profit Corporation","Full Reporter",5121892,3,"SR","DO",3,null,0,"",4.5,"",0,"",0,"",0,"",0,"",4.5,"",null,0,"",55,"",55,"","No"]

{"sheet":"Roadway by Mode","index":3,"n_rows":590,"n_cols":26,"rows_kept":590,"cut":false,"hidden":false,"merged":[]}
["Name","City","State","Legacy NTD ID","NTD ID","Organization Type","Reporter Type","Primary UZA Population","Agency VOMS","Mode","TOS","Mode VOMS","Miles of Roadway:","Permanent Busway","Permanent Busway Questionable","Permanent HOV","Permanent HOV Questionable","Part-Time Busway or HOV","Part-Time Busway or HOV Questionable","Total Miles","Total Miles Questionable","Any data questionable?",null,null,null,{"$f":"IF(Z4=1,1,0)","v":1}]
["MTA New York City Transit","New York","NY",2008,20008,"Subsidiary Unit of a Transit Agency, Reporting Separately","Full Reporter",18351295,11000,"MB","DO",3314,null,24.3,"",0,"",62.4,"",86.7,"",{"$f":"IF(OR(O2=\"Q\",Q2=\"Q\",S2=\"Q\",U2=\"Q\"),\"Yes\",\"No\")","v":"No"},null,null,null,"Hide questionable data tags"]
["MTA New York City Transit","New York","NY",2008,20008,"Subsidiary Unit of a Transit Agency, Reporting Separately","Full Reporter",18351295,11000,"CB","DO",456,null,5.9,"",9.6,"",25.9,"",41.4,"","No",null,null,null,"Show questionable data tags"]
["MTA New York City Transit","New York","NY",2008,20008,"Subsidiary Unit of a Transit Agency, Reporting Separately","Full Reporter",18351295,11000,"RB","DO",108,null,52.6,"",0,"",0,"",52.6,"","No",null,null,null,1]
["New Jersey Transit Corporation","Newark","NJ",2080,20080,"Other Publicly-Owned or Privately Chartered Corporation","Full Reporter",18351295,4020,"MB","DO",1870,null,0.5,"",0,"",35.799999999999997,"",36.299999999999997,"","No"]
["New Jersey Transit Corporation","Newark","NJ",2080,20080,"Other Publicly-Owned or Privately Chartered Corporation","Full Reporter",18351295,4020,"MB","PT",181,null,"","","","","","",0,"","No"]
["Los Angeles County Metropolitan Transportation Authority dba: Metro","Los Angeles","CA",9154,90154,"Independent Public Agency or Authority of Transit Service","Full Reporter",12150996,3516,"MB","DO",1766,null,2.5,"",34.1,"",0,"",36.6,"","No"]
["Los Angeles County Metropolitan Transportation Authority dba: Metro","Los Angeles","CA",9154,90154,"Independent Public Agency or Authority of Transit Service","Full Reporter",12150996,3516,"MB","PT",125,null,2.5,"",38.4,"",0,"",40.9,"","No"]
["Los Angeles County Metropolitan Transportation Authority dba: Metro","Los Angeles","CA",9154,90154,"Independent Public Agency or Authority of Transit Service","Full Reporter",12150996,3516,"RB","DO",33,null,35.4,"",0,"",0,"",35.4,"","No"]
["Washington Metropolitan Area Transit Authority","Washington","DC",3030,30030,"Independent Public Agency or Authority of Transit Service","Full Reporter",4586770,3200,"MB","DO",1300,null,1.3,"",10.4,"",61.8,"",73.5,"","No"]
["Washington Metropolitan Area Transit Authority","Washington","DC",3030,30030,"Independent Public Agency or Authority of Transit Service","Full Reporter",4586770,3200,"MB","PT",44,null,"","","","","","",0,"","No"]
["King County Department of Transportation - Metro Transit Division","Seattle","WA",1,1,"City, County or Local Government Unit or Department of Transportation","Full Reporter",3059393,2875,"MB","DO",871,null,8.6999999999999993,"",149.4,"",97.4,"",255.5,"","No"]
["King County Department of Transportation - Metro Transit Division","Seattle","WA",1,1,"City, County or Local Government Unit or Department of Transportation","Full Reporter",3059393,2875,"TB","DO",129,null,116.9,"",0,"",0,"",116.9,"","No"]
["King County Department of Transportation - Metro Transit Division","Seattle","WA",1,1,"City, County or Local Government Unit or Department of Transportation","Full Reporter",3059393,2875,"MB","PT",30,null,"","","","","","",0,"","No"]
["Chicago Transit Authority","Chicago","IL",5066,50066,"Independent Public Agency or Authority of Transit Service","Full Reporter",8608208,2728,"MB","DO",1594,null,3.8,"",0,"",0,"",3.8,"","No"]
["Massachusetts Bay Transportation Authority","Boston","MA",1003,10003,"Independent Public Agency or Authority of Transit Service","Full Reporter",4181019,2344,"MB","DO",790,null,0.9,"",0,"",1.6,"",2.5,"","No"]
["Massachusetts Bay Transportation Authority","Boston","MA",1003,10003,"Independent Public Agency or Authority of Transit Service","Full Reporter",4181019,2344,"RB","DO",30,null,9.9,"",0,"",0,"",9.9,"","No"]
["Massachusetts Bay Transportation Authority","Boston","MA",1003,10003,"Independent Public Agency or Authority of Transit Service","Full Reporter",4181019,2344,"TB","DO",10,null,0.6,"",0,"",0,"",0.6,"","No"]
["Massachusetts Bay Transportation Authority","Boston","MA",1003,10003,"Independent Public Agency or Authority of Transit Service","Full Reporter",4181019,2344,"MB","PT",8,null,"","","","","","",0,"","No"]
["Southeastern Pennsylvania Transportation Authority","Philadelphia","PA",3019,30019,"Independent Public Agency or Authority of Transit Service","Full Reporter",5441567,2340,"MB","DO",1172,null,2.4,"",0,"",0,"",2.4,"","No"]
["Southeastern Pennsylvania Transportation Authority","Philadelphia","PA",3019,30019,"Independent Public Agency or Authority of Transit Service","Full Reporter",5441567,2340,"TB","DO",30,null,30.6,"",0,"",0,"",30.6,"","No"]
["Metropolitan Transit Authority of Harris County, Texas ","Houston","TX",6008,60008,"Independent Public Agency or Authority of Transit Service","Full Reporter",4944332,2240,"MB","DO",610,null,0,"",4.5999999999999996,"",21.1,"",25.700000000000003,"","No"]
["Metropolitan Transit Authority of Harris County, Texas ","Houston","TX",6008,60008,"Independent Public Agency or Authority of Transit Service","Full Reporter",4944332,2240,"CB","DO",232,null,0,"",17.8,"",16,"",33.799999999999997,"","No"]
["Metropolitan Transit Authority of Harris County, Texas ","Houston","TX",6008,60008,"Independent Public Agency or Authority of Transit Service","Full Reporter",4944332,2240,"MB","PT",143,null,0,"",4.5999999999999996,"",19.600000000000001,"",24.200000000000003,"","No"]
["Metropolitan Transit Authority of Harris County, Texas ","Houston","TX",6008,60008,"Independent Public Agency or Authority of Transit Service","Full Reporter",4944332,2240,"CB","PT",60,null,0,"",30,"",4.3,"",34.299999999999997,"","No"]
["Pace - Suburban Bus Division","Arlington Heights","IL",5113,50113,"Independent Public Agency or Authority of Transit Service","Full Reporter",8608208,1638,"MB","DO",520,null,"","","","","","",0,"","No"]
["Pace - Suburban Bus Division","Arlington Heights","IL",5113,50113,"Independent Public Agency or Authority of Transit Service","Full Reporter",8608208,1638,"MB","PT",93,null,"","","","","","",0,"","No"]
["Orange County Transportation Authority","Orange","CA",9036,90036,"Independent Public Agency or Authority of Transit Service","Full Reporter",12150996,1528,"MB","DO",293,null,0,"",0,"",21.9,"",21.9,"","No"]
["Orange County Transportation Authority","Orange","CA",9036,90036,"Independent Public Agency or Authority of Transit Service","Full Reporter",12150996,1528,"MB","PT",158,null,"","","","","","",0,"","No"]
["Orange County Transportation Authority","Orange","CA",9036,90036,"Independent Public Agency or Authority of Transit Service","Full Reporter",12150996,1528,"CB","PT",23,null,0,"",0,"",124.8,"",124.8,"","No"]
["Orange County Transportation Authority","Orange","CA",9036,90036,"Independent Public Agency or Authority of Transit Service","Full Reporter",12150996,1528,"CB","DO",6,null,0,"",0,"",83.9,"",83.9,"","No"]
["San Francisco Municipal Railway","San Francisco","CA",9015,90015,"City, County or Local Government Unit or Department of Transportation","Full Reporter",3281212,1524,"MB","DO",430,null,0.1,"",12.6,"",6.7,"",19.400000000000002,"","No"]
["San Francisco Municipal Railway","San Francisco","CA",9015,90015,"City, County or Local Government Unit or Department of Transportation","Full Reporter",3281212,1524,"TB","DO",196,null,163.30000000000001,"",0,"",0,"",163.30000000000001,"","No"]
["Maryland Transit Administration","Baltimore","MD",3034,30034,"State Government Unit or Department of Transportation","Full Reporter",2203663,1491,"MB","DO",620,null,"","","","","","",0,"","No"]
["Maryland Transit Administration","Baltimore","MD",3034,30034,"State Government Unit or Department of Transportation","Full Reporter",2203663,1491,"CB","PT",192,null,14.8,"",0,"",17,"",31.8,"","No"]
["Denver Regional Transportation District","Denver","CO",8006,80006,"Independent Public Agency or Authority of Transit Service","Full Reporter",2374203,1395,"MB","DO",482,null,1.9,"",0,"",25.3,"",27.2,"","No"]
["Denver Regional Transportation District","Denver","CO",8006,80006,"Independent Public Agency or Authority of Transit Service","Full Reporter",2374203,1395,"MB","PT",372,null,0,"",0,"",25.3,"",25.3,"","No"]
["Metro-North Commuter Railroad Company, dba: MTA Metro-North Railroad","New York","NY",2078,20078,"Subsidiary Unit of a Transit Agency, Reporting Separately","Full Reporter",18351295,1199,"MB","PT",9,null,"","","","","","",0,"","No"]
["Miami-Dade Transit","Miami","FL",4034,40034,"City, County or Local Government Unit or Department of Transportation","Full Reporter",5502379,1129,"MB","DO",672,null,39.799999999999997,"",0,"",52.4,"",92.199999999999989,"","No"]
["Miami-Dade Transit","Miami","FL",4034,40034,"City, County or Local Government Unit or Department of Transportation","Full Reporter",5502379,1129,"CB","PT",7,null,"","","","","","",0,"","No"]
["Utah Transit Authority","Salt Lake City","UT",8001,80001,"Independent Public Agency or Authority of Transit Service","Full Reporter",1021243,1104,"MB","DO",401,null,2.1,"",12.7,"",0,"",14.799999999999999,"","No"]
["Utah Transit Authority","Salt Lake City","UT",8001,80001,"Independent Public Agency or Authority of Transit Service","Full Reporter",1021243,1104,"CB","DO",42,null,"","","","","","",0,"","No"]
["Utah Transit Authority","Salt Lake City","UT",8001,80001,"Independent Public Agency or Authority of Transit Service","Full Reporter",1021243,1104,"MB","PT",5,null,"","","","","","",0,"","No"]
["MTA Bus Company","New York","NY",2188,20188,"Subsidiary Unit of a Transit Agency, Reporting Separately","Full Reporter",18351295,1091,"MB","DO",1091,null,0.3,"",0,"",14.6,"",14.9,"","No"]
["Dallas Area Rapid Transit","Dallas","TX",6056,60056,"Independent Public Agency or Authority of Transit Service","Full Reporter",5121892,1042,"MB","DO",535,null,0,"",75.3,"",46.9,"",122.19999999999999,"","No"]
["Tri-County Metropolitan Transportation District of Oregon","Portland","OR",8,8,"Independent Public Agency or Authority of Transit Service","Full Reporter",1849898,918,"MB","DO",534,null,3.3,"",0,"",0.6,"",3.9,"","No"]
["Port Authority of Allegheny County","Pittsburgh","PA",3022,30022,"Independent Public Agency or Authority of Transit Service","Full Reporter",1733853,912,"MB","DO",575,null,43.1,"",13.4,"",0,"",56.5,"","No"]
["Metro Transit ","Minneapolis","MN",5027,50027,"Subsidiary Unit of a Transit Agency, Reporting Separately","Full Reporter",2650890,885,"MB","DO",793,null,10.1,"",0,"",0,"",10.1,"","No"]
["Metropolitan Atlanta Rapid Transit Authority","Atlanta","GA",4022,40022,"Independent Public Agency or Authority of Transit Service","Full Reporter",4515419,838,"MB","DO",451,null,0.2,"",0,"",13.5,"",13.7,"","No"]
["City and County of Honolulu Department of Transportation Services","Honolulu","HI",9002,90002,"City, County or Local Government Unit or Department of Transportation","Full Reporter",802459,799,"MB","PT",442,null,1.2,"",0,"",34.700000000000003,"",35.900000000000006,"","No"]
["VIA Metropolitan Transit","San Antonio","TX",6011,60011,"Independent Public Agency or Authority of Transit Service","Full Reporter",1758210,786,"MB","DO",372,null,"","","","","","",0,"","No"]
["San Diego Metropolitan Transit System","San Diego","CA",9026,90026,"Independent Public Agency or Authority of Transit Service","Full Reporter",2956746,732,"MB","PT",255,null,0.8,"",0,"",0,"",0.8,"","No"]
["San Diego Metropolitan Transit System","San Diego","CA",9026,90026,"Independent Public Agency or Authority of Transit Service","Full Reporter",2956746,732,"MB","DO",215,null,1.8,"",15.4,"",0,"",17.2,"","No"]
["San Diego Metropolitan Transit System","San Diego","CA",9026,90026,"Independent Public Agency or Authority of Transit Service","Full Reporter",2956746,732,"CB","PT",18,null,0.5,"",15.4,"",0,"",15.9,"","No"]
["Santa Clara Valley Transportation Authority","San Jose","CA",9013,90013,"Independent Public Agency or Authority of Transit Service","Full Reporter",1664496,679,"MB","DO",384,null,1.1000000000000001,"",214.7,"",0,"",215.79999999999998,"","No"]
["Santa Clara Valley Transportation Authority","San Jose","CA",9013,90013,"Independent Public Agency or Authority of Transit Service","Full Reporter",1664496,679,"MB","PT",11,null,0,"",33.1,"",0,"",33.1,"","No"]
["Capital Metropolitan Transportation Authority","Austin","TX",6048,60048,"Independent Public Agency or Authority of Transit Service","Full Reporter",1362416,674,"MB","PT",301,null,"","","","","","",0,"","No"]
["Capital Metropolitan Transportation Authority","Austin","TX",6048,60048,"Independent Public Agency or Authority of Transit Service","Full Reporter",1362416,674,"CB","PT",35,null,"","","","","","",0,"","No"]
["Alameda-Contra Costa Transit District","Oakland","CA",9014,90014,"Independent Public Agency or Authority of Transit Service","Full Reporter",3281212,667,"MB","DO",362,null,0,"",0.3,"",0,"",0.3,"","No"]
["Alameda-Contra Costa Transit District","Oakland","CA",9014,90014,"Independent Public Agency or Authority of Transit Service","Full Reporter",3281212,667,"CB","DO",104,null,0,"",53.9,"",0,"",53.9,"","No"]
["Alameda-Contra Costa Transit District","Oakland","CA",9014,90014,"Independent Public Agency or Authority of Transit Service","Full Reporter",3281212,667,"MB","PT",14,null,"","","","","","",0,"","No"]
["Regional Transportation Commission of Southern Nevada","Las Vegas","NV",9045,90045,"Independent Public Agency or Authority of Transit Service","Full Reporter",1886011,660,"MB","PT",300,null,23.2,"",0,"",9.1999999999999993,"",32.4,"","No"]
["Regional Transportation Commission of Southern Nevada","Las Vegas","NV",9045,90045,"Independent Public Agency or Authority of Transit Service","Full Reporter",1886011,660,"RB","PT",33,null,41.6,"",0,"",0,"",41.6,"","No"]
["Snohomish County Public Transportation Benefit Area Corporation","Everett","WA",29,29,"Independent Public Agency or Authority of Transit Service","Full Reporter",3059393,608,"MB","DO",93,null,0,"",19.8,"",2.7,"",22.5,"","No"]
["Snohomish County Public Transportation Benefit Area Corporation","Everett","WA",29,29,"Independent Public Agency or Authority of Transit Service","Full Reporter",3059393,608,"CB","PT",53,null,2,"",51.7,"",0.3,"",54,"","No"]
["Snohomish County Public Transportation Benefit Area Corporation","Everett","WA",29,29,"Independent Public Agency or Authority of Transit Service","Full Reporter",3059393,608,"CB","DO",49,null,2,"",74.900000000000006,"",0.9,"",77.800000000000011,"",{"$f":"IF(OR(O66=\"Q\",Q66=\"Q\",S66=\"Q\",U66=\"Q\"),\"Yes\",\"No\")","v":"No"}]
["City of Phoenix Public Transit Department dba Valley Metro","Phoenix","AZ",9032,90032,"City, County or Local Government Unit or Department of Transportation","Full Reporter",3629114,571,"MB","PT",447,null,0,"",0,"",117.7,"",117.7,"","No"]
["Central Florida Regional Transportation Authority","Orlando","FL",4035,40035,"Independent Public Agency or Authority of Transit Service","Full Reporter",1510516,560,"MB","DO",238,null,0.7,"",0,"",0,"",0.7,"","No"]
["Central Florida Regional Transportation Authority","Orlando","FL",4035,40035,"Independent Public Agency or Authority of Transit Service","Full Reporter",1510516,560,"MB","PT",15,null,"","","","","","",0,"","No"]
["Central Florida Regional Transportation Authority","Orlando","FL",4035,40035,"Independent Public Agency or Authority of Transit Service","Full Reporter",1510516,560,"RB","DO",12,null,3.4,"",0,"",0,"",3.4,"","No"]
["Central Florida Regional Transportation Authority","Orlando","FL",4035,40035,"Independent Public Agency or Authority of Transit Service","Full Reporter",1510516,560,"CB","PT",2,null,"","","","","","",0,"","No"]
["The Greater Cleveland Regional Transit Authority","Cleveland","OH",5015,50015,"Independent Public Agency or Authority of Transit Service","Full Reporter",1780673,547,"MB","DO",350,null,3.2,"",0,"",0,"",3.2,"","No"]
["The Greater Cleveland Regional Transit Authority","Cleveland","OH",5015,50015,"Independent Public Agency or Authority of Transit Service","Full Reporter",1780673,547,"RB","DO",16,null,8.6999999999999993,"",0,"",5.4,"",14.1,"","No"]
["Pierce County Transportation Benefit Area Authority","Tacoma","WA",3,3,"Independent Public Agency or Authority of Transit Service","Full Reporter",3059393,507,"MB","DO",116,null,0,"",16.899999999999999,"",0,"",16.899999999999999,"","No"]
["Broward County Transit Division","Plantation","FL",4029,40029,"City, County or Local Government Unit or Department of Transportation","Full Reporter",5502379,474,"MB","DO",274,null,0,"",0,"",24.6,"",24.6,"","No"]
["Broward County Transit Division","Plantation","FL",4029,40029,"City, County or Local Government Unit or Department of Transportation","Full Reporter",5502379,474,"MB","PT",7,null,"","","","","","",0,"","No"]
["Bi-State Development Agency of the Missouri-Illinois Metropolitan District, d.b.a.(St. Louis) Metro","St. Louis","MO",7006,70006,"Independent Public Agency or Authority of Transit Service","Full Reporter",2150706,473,"MB","DO",317,null,"","","","","","",0,"","No"]
["Potomac and Rappahannock Transportation Commission","Woodbridge","VA",3070,30070,"Independent Public Agency or Authority of Transit Service","Full Reporter",4586770,473,"CB","PT",86,null,0,"",0,"",63.4,"",63.4,"","No"]
["Potomac and Rappahannock Transportation Commission","Woodbridge","VA",3070,30070,"Independent Public Agency or Authority of Transit Service","Full Reporter",4586770,473,"MB","PT",36,null,0,"",0,"",59,"",59,"","No"]
["LACMTA - Small Operators","Los Angeles","CA",9166,90166,"Other","Full Reporter",12150996,462,"MB","PT",195,null,"","","","","","",0,"","No"]
["City of Detroit Department of Transportation","Detroit","MI",5119,50119,"City, County or Local Government Unit or Department of Transportation","Full Reporter",3734090,454,"MB","DO",229,null,"","","","","","",0,"","No"]
["Board of County Commissioners, Palm Beach County, PalmTran, Inc.","West Palm Beach","FL",4037,40037,"City, County or Local Government Unit or Department of Transportation","Full Reporter",5502379,450,"MB","DO",131,null,"","","","","","",0,"","No"]
["Delaware Transit Corporation","Dover","DE",3075,30075,"Independent Public Agency or Authority of Transit Service","Full Reporter",5441567,445,"MB","DO",173,null,"","","","","","",0,"","No"]
["Delaware Transit Corporation","Dover","DE",3075,30075,"Independent Public Agency or Authority of Transit Service","Full Reporter",5441567,445,"MB","PT",23,null,"","","","","","",0,"","No"]
["Ben Franklin Transit","Richland","WA",18,18,"Independent Public Agency or Authority of Transit Service","Full Reporter",210975,440,"MB","DO",52,null,"","","","","","",0,"","No"]
["Milwaukee County Transit System","Milwaukee","WI",5008,50008,"City, County or Local Government Unit or Department of Transportation","Full Reporter",1376476,433,"MB","DO",343,null,"","","","","","",0,"","No"]
["Charlotte Area Transit System","Charlotte","NC",4008,40008,"City, County or Local Government Unit or Department of Transportation","Full Reporter",1249442,431,"MB","DO",196,null,7.7,"",14.4,"",0,"",22.1,"","No"]
["Charlotte Area Transit System","Charlotte","NC",4008,40008,"City, County or Local Government Unit or Department of Transportation","Full Reporter",1249442,431,"CB","DO",69,null,7.7,"",14.4,"",0,"",22.1,"","No"]
["Regional Public Transportation Authority, dba: Valley Metro","Phoenix","AZ",9136,90136,"Independent Public Agency or Authority of Transit Service","Full Reporter",3629114,403,"MB","PT",282,null,0,"",0,"",227.4,"",227.4,"","No"]
["City of Los Angeles Department of Transportation","Los Angeles","CA",9147,90147,"City, County or Local Government Unit or Department of Transportation","Full Reporter",12150996,369,"MB","PT",173,null,"","","","","","",0,"","No"]
["City of Los Angeles Department of Transportation","Los Angeles","CA",9147,90147,"City, County or Local Government Unit or Department of Transportation","Full Reporter",12150996,369,"CB","PT",93,null,0,"",35.1,"",0,"",35.1,"","No"]
["Transportation District Commission of Hampton Roads","Hampton","VA",3083,30083,"Independent Public Agency or Authority of Transit Service","Full Reporter",1439666,368,"MB","DO",236,null,0,"",0,"",72.8,"",72.8,"","No"]
["San Mateo County Transit District","San Carlos","CA",9009,90009,"Independent Public Agency or Authority of Transit Service","Full Reporter",3281212,363,"MB","DO",192,null,"","","","","","",0,"","No"]
["San Mateo County Transit District","San Carlos","CA",9009,90009,"Independent Public Agency or Authority of Transit Service","Full Reporter",3281212,363,"MB","PT",79,null,"","","","","","",0,"","No"]
["Central Ohio Transit Authority","Columbus","OH",5016,50016,"Independent Public Agency or Authority of Transit Service","Full Reporter",1368035,361,"MB","DO",284,null,"","","","","","",0,"","No"]
["Nassau Inter County Express","Garden City","NY",2206,20206,"City, County or Local Government Unit or Department of Transportation","Full Reporter",18351295,353,"MB","PT",255,null,"","","","","","",0,"","No"]
["Niagara Frontier Transportation Authority","Buffalo","NY",2004,20004,"Independent Public Agency or Authority of Transit Service","Full Reporter",935906,351,"MB","DO",264,null,"","","","","","",0,"","No"]
["Southwest Ohio Regional Transit Authority","Cincinnati","OH",5012,50012,"City, County or Local Government Unit or Department of Transportation","Full Reporter",1624827,346,"MB","DO",298,null,0.1,"",0,"",0,"",0.1,"","No"]
["Westchester County Bee-Line System","Mount Vernon","NY",2076,20076,"City, County or Local Government Unit or Department of Transportation","Full Reporter",18351295,343,"MB","PT",276,null,"","","","","","",0,"","No"]
["City of Tucson","Tucson   ","AZ",9033,90033,"City, County or Local Government Unit or Department of Transportation","Full Reporter",843168,338,"MB","DO",212,null,"","","","","","",0,"","No"]
["Central Puget Sound Regional Transit Authority","Seattle","WA",40,40,"Independent Public Agency or Authority of Transit Service","Full Reporter",3059393,336,"CB","DO",190,null,4.0999999999999996,"",137,"",57.7,"",198.79999999999998,"","No"]
["Central Puget Sound Regional Transit Authority","Seattle","WA",40,40,"Independent Public Agency or Authority of Transit Service","Full Reporter",3059393,336,"CB","PT",48,null,0,"",44.6,"",33.6,"",78.2,"","No"]
["Cape Cod Regional Transit Authority","Hyannis","MA",1105,10105,"Independent Public Agency or Authority of Transit Service","Full Reporter",246695,335,"MB","PT",47,null,"","","","","","",0,"","No"]
["Cape Cod Regional Transit Authority","Hyannis","MA",1105,10105,"Independent Public Agency or Authority of Transit Service","Full Reporter",246695,335,"CB","PT",2,null,"","","","","","",0,"","No"]
["Greater Richmond Transit Company","Richmond","VA",3006,30006,"Other Publicly-Owned or Privately Chartered Corporation","Full Reporter",953556,328,"MB","DO",118,null,"","","","","","",0,"","No"]
["Lane Transit District","Eugene","OR",7,7,"Independent Public Agency or Authority of Transit Service","Full Reporter",247421,325,"MB","DO",71,null,"","","","","","",0,"","No"]
["Lane Transit District","Eugene","OR",7,7,"Independent Public Agency or Authority of Transit Service","Full Reporter",247421,325,"RB","DO",8,null,10.1,"",0,"",0,"",10.1,"","No"]
["Lane Transit District","Eugene","OR",7,7,"Independent Public Agency or Authority of Transit Service","Full Reporter",247421,325,"MB","PT",1,null,"","","","","","",0,"","No"]
["Suburban Mobility Authority for Regional Transportation","Detroit","MI",5031,50031,"Independent Public Agency or Authority of Transit Service","Full Reporter",3734090,317,"MB","DO",195,null,"","","","","","",0,"","No"]
["Suburban Mobility Authority for Regional Transportation","Detroit","MI",5031,50031,"Independent Public Agency or Authority of Transit Service","Full Reporter",3734090,317,"MB","PT",8,null,"","","","","","",0,"","No"]
["Transit Authority of River City","Louisville","KY",4018,40018,"Independent Public Agency or Authority of Transit Service","Full Reporter",972546,315,"MB","DO",173,null,"","","","","","",0,"","No"]
["Transit Authority of River City","Louisville","KY",4018,40018,"Independent Public Agency or Authority of Transit Service","Full Reporter",972546,315,"MB","PT",1,null,"","","","","","",0,"","No"]
["Spokane Transit Authority","Spokane","WA",2,2,"Independent Public Agency or Authority of Transit Service","Full Reporter",387847,311,"MB","DO",110,null,"","","","","","",0,"","No"]
["Intercity Transit","Olympia","WA",19,19,"Independent Public Agency or Authority of Transit Service","Full Reporter",176617,310,"MB","DO",50,null,"","","","","","",0,"","No"]
["Intercity Transit","Olympia","WA",19,19,"Independent Public Agency or Authority of Transit Service","Full Reporter",176617,310,"CB","DO",9,null,"","","","","","",0,"","No"]
["Pinellas Suncoast Transit Authority","St. Petersburg","FL",4027,40027,"Independent Public Agency or Authority of Transit Service","Full Reporter",2441770,308,"MB","DO",160,null,"","","","","","",0,"","No"]
["Pinellas Suncoast Transit Authority","St. Petersburg","FL",4027,40027,"Independent Public Agency or Authority of Transit Service","Full Reporter",2441770,308,"MB","PT",18,null,"","","","","","",0,"","No"]
["Pinellas Suncoast Transit Authority","St. Petersburg","FL",4027,40027,"Independent Public Agency or Authority of Transit Service","Full Reporter",2441770,308,"CB","DO",7,null,0,"",0,"",1.1000000000000001,"",1.1000000000000001,"","No"]
["Rhode Island Public Transit Authority","Providence","RI",1001,10001,"Independent Public Agency or Authority of Transit Service","Full Reporter",1190956,304,"MB","DO",196,null,1.6,"",0,"",0,"",1.6,"","No"]
["Capital Area Transit","Raleigh","NC",4007,40007,"City, County or Local Government Unit or Department of Transportation","Full Reporter",884891,298,"MB","DO",65,null,"","","","","","",0,"","No"]
["Kansas City Area Transportation Authority","Kansas City","MO",7005,70005,"Independent Public Agency or Authority of Transit Service","Full Reporter",1519417,295,"MB","DO",168,null,0.5,"",0,"",3,"",3.5,"","No"]
["Kansas City Area Transportation Authority","Kansas City","MO",7005,70005,"Independent Public Agency or Authority of Transit Service","Full Reporter",1519417,295,"RB","DO",11,null,0.5,"",0,"",11.1,"",11.6,"","No"]
["Suffolk County Department of Public Works - Transportation Division","Yaphank","NY",2072,20072,"City, County or Local Government Unit or Department of Transportation","Full Reporter",18351295,291,"MB","PT",128,null,0,"",0,"",46.9,"",46.9,"","No"]
["Ride-On Montgomery County Transit","Rockville","MD",3051,30051,"City, County or Local Government Unit or Department of Transportation","Full Reporter",4586770,282,"MB","DO",282,null,"","","","","","",0,"","No"]
["Foothill Transit","West Covina","CA",9146,90146,"Independent Public Agency or Authority of Transit Service","Full Reporter",12150996,278,"MB","PT",278,null,1.5,"",0,"",62.3,"",63.8,"","No"]
["Metropolitan Transit Authority","Nashville","TN",4004,40004,"Independent Public Agency or Authority of Transit Service","Full Reporter",969587,269,"MB","DO",120,null,"","","","","","",0,"","No"]
["Salem Area Mass Transit District","Salem","OR",25,25,"Independent Public Agency or Authority of Transit Service","Full Reporter",236632,269,"MB","DO",53,null,"","","","","","",0,"","No"]
["Metropolitan Transit Authority","Nashville","TN",4004,40004,"Independent Public Agency or Authority of Transit Service","Full Reporter",969587,269,"CB","DO",23,null,"","","","","","",0,"","No"]
["Kitsap Transit","Bremerton","WA",20,20,"Independent Public Agency or Authority of Transit Service","Full Reporter",198979,266,"MB","DO",89,null,"","","","","","",0,"","No"]
["Riverside Transit Agency","Riverside","CA",9031,90031,"Independent Public Agency or Authority of Transit Service","Full Reporter",1932666,260,"MB","DO",77,null,"","","","","","",0,"",{"$f":"IF(OR(O130=\"Q\",Q130=\"Q\",S130=\"Q\",U130=\"Q\"),\"Yes\",\"No\")","v":"No"}]
["Riverside Transit Agency","Riverside","CA",9031,90031,"Independent Public Agency or Authority of Transit Service","Full Reporter",1932666,260,"MB","PT",51,null,"","","","","","",0,"","No"]
["Riverside Transit Agency","Riverside","CA",9031,90031,"Independent Public Agency or Authority of Transit Service","Full Reporter",1932666,260,"CB","PT",16,null,"","","","","","",0,"","No"]
["Riverside Transit Agency","Riverside","CA",9031,90031,"Independent Public Agency or Authority of Transit Service","Full Reporter",1932666,260,"CB","DO",15,null,"","","","","","",0,"","No"]
["Regional Transit Service, Inc. and Lift Line, Inc.","Rochester","NY",2113,20113,"Independent Public Agency or Authority of Transit Service","Full Reporter",720572,256,"MB","DO",217,null,"","","","","","",0,"","No"]
["Metro Transit System","Madison","WI",5005,50005,"City, County or Local Government Unit or Department of Transportation","Full Reporter",401661,254,"MB","DO",182,null,12.5,"",0,"",0,"",12.5,"","No"]
["Pioneer Valley Transit Authority","Springfield","MA",1008,10008,"Independent Public Agency or Authority of Transit Service","Full Reporter",621300,254,"MB","PT",147,null,"","","","","","",0,"","No"]
["Omnitrans","San Bernardino","CA",9029,90029,"Independent Public Agency or Authority of Transit Service","Full Reporter",1932666,248,"MB","DO",145,null,5.4,"",0,"",0,"",5.4,"","No"]
["Omnitrans","San Bernardino","CA",9029,90029,"Independent Public Agency or Authority of Transit Service","Full Reporter",1932666,248,"MB","PT",7,null,"","","","","","",0,"","No"]
["Jacksonville Transportation Authority","Jacksonville","FL",4040,40040,"Independent Public Agency or Authority of Transit Service","Full Reporter",1065219,246,"MB","DO",150,null,"","","","","","",0,"","No"]
["Interurban Transit Partnership","Grand Rapids","MI",5033,50033,"Independent Public Agency or Authority of Transit Service","Full Reporter",569935,246,"MB","DO",125,null,"","","","","","",0,"","No"]
["Interurban Transit Partnership","Grand Rapids","MI",5033,50033,"Independent Public Agency or Authority of Transit Service","Full Reporter",569935,246,"RB","DO",8,null,9.5,"",0,"",0,"",9.5,"","No"]
["Victor Valley Transit Authority","Hesperia","CA",9148,90148,"Independent Public Agency or Authority of Transit Service","Full Reporter",328454,245,"MB","PT",34,null,"","","","","","",0,"","No"]
["Victor Valley Transit Authority","Hesperia","CA",9148,90148,"Independent Public Agency or Authority of Transit Service","Full Reporter",328454,245,"CB","PT",7,null,"","","","","","",0,"","No"]
["Capital District Transportation Authority","Albany","NY",2002,20002,"Independent Public Agency or Authority of Transit Service","Full Reporter",594962,239,"MB","DO",170,null,"","","","","","",0,"","No"]
["Capital District Transportation Authority","Albany","NY",2002,20002,"Independent Public Agency or Authority of Transit Service","Full Reporter",594962,239,"CB","PT",10,null,"","","","","","",0,"","No"]
["Connecticut Department of Transportation - CTTRANSIT - Hartford Division","Hartford","CT",1048,10048,"State Government Unit or Department of Transportation","Full Reporter",924859,233,"MB","DO",224,null,18.2,"",28.8,"",0,"",47,"","No"]
["Connecticut Department of Transportation - CTTRANSIT - Hartford Division","Hartford","CT",1048,10048,"State Government Unit or Department of Transportation","Full Reporter",924859,233,"RB","DO",9,null,18.2,"",0,"",0,"",18.2,"","No"]
["Des Moines Area Regional Transit Authority","Des Moines","IA",7010,70010,"Independent Public Agency or Authority of Transit Service","Full Reporter",450070,231,"MB","DO",113,null,"","","","","","",0,"","No"]
["North County Transit District","Oceanside","CA",9030,90030,"Independent Public Agency or Authority of Transit Service","Full Reporter",2956746,230,"MB","PT",137,null,"","","","","","",0,"","No"]
["Academy Lines, Inc.","Hoboken","NJ",2122,20122,"Private-For-Profit Corporation","Full Reporter",18351295,225,"CB","DO",225,null,0,"",0,"",2.9,"",2.9,"","No"]
["Metropolitan Council","St. Paul","MN",5154,50154,"City, County or Local Government Unit or Department of Transportation","Full Reporter",2650890,223,"MB","PT",64,null,1.4,"",26.5,"",17.600000000000001,"",45.5,"","No"]
["Sacramento Regional Transit District","Sacramento","CA",9019,90019,"Independent Public Agency or Authority of Transit Service","Full Reporter",1723634,222,"MB","DO",159,null,"","","","","","",0,"","No"]
["Fairfax Connector Bus System","Fairfax","VA",3068,30068,"City, County or Local Government Unit or Department of Transportation","Full Reporter",4586770,221,"MB","PT",221,null,0,"",0,"",69.5,"",69.5,"","No"]
["METRO Regional Transit Authority ","Akron","OH",5010,50010,"Independent Public Agency or Authority of Transit Service","Full Reporter",569499,209,"MB","DO",111,null,"","","","","","",0,"","No"]
["Blue Water Area Transportation Commission","Port Huron","MI",5148,50148,"Independent Public Agency or Authority of Transit Service","Full Reporter",87106,209,"MB","DO",9,null,"","","","","","",0,"","No"]
["METRO Regional Transit Authority ","Akron","OH",5010,50010,"Independent Public Agency or Authority of Transit Service","Full Reporter",569499,209,"CB","DO",7,null,"","","","","","",0,"","No"]
["Blue Water Area Transportation Commission","Port Huron","MI",5148,50148,"Independent Public Agency or Authority of Transit Service","Full Reporter",87106,209,"CB","DO",3,null,"","","","","","",0,"","No"]
["Fort Worth Transportation Authority","Fort Worth","TX",6007,60007,"Independent Public Agency or Authority of Transit Service","Full Reporter",5121892,207,"MB","DO",118,null,"","","","","","",0,"","No"]
["Fort Worth Transportation Authority","Fort Worth","TX",6007,60007,"Independent Public Agency or Authority of Transit Service","Full Reporter",5121892,207,"MB","PT",4,null,"","","","","","",0,"","No"]
["Long Beach Transit","Long Beach","CA",9023,90023,"Other Publicly-Owned or Privately Chartered Corporation","Full Reporter",12150996,202,"MB","DO",187,null,0.5,"",0,"",0,"",0.5,"","No"]
["Hillsborough Area Regional Transit Authority","Tampa","FL",4041,40041,"Independent Public Agency or Authority of Transit Service","Full Reporter",2441770,201,"MB","DO",162,null,0,"",0,"",1.1000000000000001,"",1.1000000000000001,"","No"]
["Indianapolis and Marion County Public Transportation","Indianapolis","IN",5050,50050,"Independent Public Agency or Authority of Transit Service","Full Reporter",1487483,194,"MB","DO",133,null,"","","","","","",0,"","No"]
["City of Albuquerque Transit Department","Albuquerque","NM",6019,60019,"City, County or Local Government Unit or Department of Transportation","Full Reporter",741318,187,"MB","DO",131,null,"","","","","","",0,"","No"]
["Mass Transit Department - City of El Paso","El Paso","TX",6006,60006,"City, County or Local Government Unit or Department of Transportation","Full Reporter",803086,187,"MB","DO",124,null,"","","","","","",0,"","No"]
["Mass Transportation Authority ","Flint","MI",5032,50032,"Independent Public Agency or Authority of Transit Service","Full Reporter",356218,185,"MB","DO",99,null,"","","","","","",0,"","No"]
["Regional Transportation Commission of Washoe County","Reno","NV",9001,90001,"Independent Public Agency or Authority of Transit Service","Full Reporter",392141,181,"MB","PT",54,null,0.5,"",0,"",0,"",0.5,"","No"]
["Regional Transportation Commission of Washoe County","Reno","NV",9001,90001,"Independent Public Agency or Authority of Transit Service","Full Reporter",392141,181,"CB","PT",3,null,"","","","","","",0,"","No"]
["New Orleans Regional Transit Authority","New Orleans","LA",6032,60032,"Independent Public Agency or Authority of Transit Service","Full Reporter",899703,178,"MB","PT",110,null,0,"",7,"",0,"",7,"","No"]
["Greater Dayton Regional Transit Authority","Dayton","OH",5017,50017,"Independent Public Agency or Authority of Transit Service","Full Reporter",724091,178,"MB","DO",96,null,"","","","","","",0,"","No"]
["Greater Dayton Regional Transit Authority","Dayton","OH",5017,50017,"Independent Public Agency or Authority of Transit Service","Full Reporter",724091,178,"TB","DO",26,null,125.7,"",0,"",0,"",125.7,"","No"]
["Toledo Area Regional Transit Authority","Toledo","OH",5022,50022,"Independent Public Agency or Authority of Transit Service","Full Reporter",507643,177,"MB","DO",100,null,0,"",0,"",1,"",1,"","No"]
["Capital Area Transportation Authority","Lansing","MI",5036,50036,"Independent Public Agency or Authority of Transit Service","Full Reporter",313532,172,"MB","DO",78,null,"","","","","","",0,"","No"]
["Clark County Public Transportation Benefit Area Authority","Vancouver","WA",24,24,"Independent Public Agency or Authority of Transit Service","Full Reporter",1849898,171,"MB","DO",54,null,"","","","","","",0,"","No"]
["Clark County Public Transportation Benefit Area Authority","Vancouver","WA",24,24,"Independent Public Agency or Authority of Transit Service","Full Reporter",1849898,171,"CB","DO",40,null,0,"",0,"",3.4,"",3.4,"","No"]
["Montachusett Regional Transit Authority","Fitchburg","MA",1061,10061,"Independent Public Agency or Authority of Transit Service","Full Reporter",116960,169,"MB","PT",19,null,"","","","","","",0,"","No"]
["Lehigh and Northampton Transportation Authority","Allentown","PA",3010,30010,"Independent Public Agency or Authority of Transit Service","Full Reporter",664651,165,"MB","DO",70,null,"","","","","","",0,"","No"]
["Research Triangle Regional Public Transportation Authority","Research Triangle Park","NC",4108,40108,"Independent Public Agency or Authority of Transit Service","Full Reporter",347602,164,"MB","DO",58,null,"","","","","","",0,"","No"]
["Research Triangle Regional Public Transportation Authority","Research Triangle Park","NC",4108,40108,"Independent Public Agency or Authority of Transit Service","Full Reporter",347602,164,"MB","PT",22,null,"","","","","","",0,"","No"]
["Santa Monica's Big Blue Bus","Santa Monica","CA",9008,90008,"City, County or Local Government Unit or Department of Transportation","Full Reporter",12150996,163,"MB","DO",157,null,0.6,"",0,"",0,"",0.6,"","No"]
["CNY Centro, Inc. ","Syracuse","NY",2018,20018,"Subsidiary Unit of a Transit Agency, Reporting Separately","Full Reporter",412317,162,"MB","DO",121,null,"","","","","","",0,"","No"]
["Hudson Transit Lines, Inc.","Mahwah","NJ",2126,20126,"Private-For-Profit Corporation","Full Reporter",18351295,161,"CB","DO",161,null,0,"",0,"",2.9,"",2.9,"","No"]
["Mountain Metropolitan Transit","Colorado Springs","CO",8005,80005,"City, County or Local Government Unit or Department of Transportation","Full Reporter",559409,161,"MB","PT",35,null,"","","","","","",0,"","No"]
["Madison County Transit District","Granite City","IL",5146,50146,"Independent Public Agency or Authority of Transit Service","Full Reporter",2150706,157,"MB","PT",74,null,"","","","","","",0,"","No"]
["Wichita Transit","Wichita","KS",7015,70015,"City, County or Local Government Unit or Department of Transportation","Full Reporter",472870,156,"MB","DO",38,null,"","","","","","",0,"","No"]
["Ann Arbor Area Transportation Authority","Ann Arbor","MI",5040,50040,"Independent Public Agency or Authority of Transit Service","Full Reporter",306022,154,"MB","DO",69,null,"","","","","","",0,"","No"]
["Space Coast Area Transit","Cocoa","FL",4063,40063,"City, County or Local Government Unit or Department of Transportation","Full Reporter",452791,154,"MB","DO",29,null,"","","","","","",0,"","No"]
["Ann Arbor Area Transportation Authority","Ann Arbor","MI",5040,50040,"Independent Public Agency or Authority of Transit Service","Full Reporter",306022,154,"CB","DO",2,null,"","","","","","",0,"","No"]
["Ann Arbor Area Transportation Authority","Ann Arbor","MI",5040,50040,"Independent Public Agency or Authority of Transit Service","Full Reporter",306022,154,"CB","PT",2,null,"","","","","","",0,"","No"]
["Memphis Area Transit Authority","Memphis","TN",4003,40003,"City, County or Local Government Unit or Department of Transportation","Full Reporter",1060061,150,"MB","DO",108,null,0,"",0,"",0,"",0,"","No"]
["Central Contra Costa Transit Authority","Concord","CA",9078,90078,"Independent Public Agency or Authority of Transit Service","Full Reporter",615968,143,"MB","DO",93,null,"","","","","","",0,"","No"]
["Gainesville Regional Transit System","Gainesville","FL",4030,40030,"City, County or Local Government Unit or Department of Transportation","Full Reporter",187781,142,"MB","DO",107,null,"","","","","","",0,"","No"]
["Golden Gate Bridge, Highway and Transportation District","San Francisco","CA",9016,90016,"Independent Public Agency or Authority of Transit Service","Full Reporter",3281212,141,"MB","DO",127,null,0,"",0,"",58.1,"",58.1,"","No"]
["York County Transportation Authority","York","PA",3027,30027,"Independent Public Agency or Authority of Transit Service","Full Reporter",232045,135,"MB","DO",44,null,"","","","","","",0,"","No"]
["York County Transportation Authority","York","PA",3027,30027,"Independent Public Agency or Authority of Transit Service","Full Reporter",232045,135,"CB","DO",9,null,"","","","","","",0,"",{"$f":"IF(OR(O194=\"Q\",Q194=\"Q\",S194=\"Q\",U194=\"Q\"),\"Yes\",\"No\")","v":"No"}]
["Peninsula Corridor Joint Powers Board dba: Caltrain","San Carlos","CA",9134,90134,"Independent Public Agency or Authority of Transit Service","Full Reporter",3281212,134,"MB","PT",29,null,"","","","","","",0,"","No"]
["Fresno Area Express","Fresno","CA",9027,90027,"City, County or Local Government Unit or Department of Transportation","Full Reporter",654628,130,"MB","DO",80,null,"","","","","","",0,"","No"]
["Minnesota Valley Transit Authority","Burnsville","MN",5222,50519,"Independent Public Agency or Authority of Transit Service","Full Reporter",2650890,127,"MB","PT",127,null,2.5,"",43,"",45,"",90.5,"","No"]
["Transit Authority of Omaha","Omaha","NE",7002,70002,"Independent Public Agency or Authority of Transit Service","Full Reporter",725008,125,"MB","DO",98,null,"","","","","","",0,"","No"]
["Metropolitan Bus Authority","San Juan","PR",4086,40086,"Independent Public Agency or Authority of Transit Service","Full Reporter",2148346,125,"MB","DO",97,null,17.100000000000001,"",0,"",0,"",17.100000000000001,"","No"]
["County of Volusia, dba: VOTRAN","South Daytona","FL",4032,40032,"City, County or Local Government Unit or Department of Transportation","Full Reporter",349064,125,"MB","DO",51,null,"","","","","","",0,"","No"]
["Lexington Transit Authority","Lexington","KY",4017,40017,"Independent Public Agency or Authority of Transit Service","Full Reporter",290263,120,"MB","DO",54,null,"","","","","","",0,"","No"]
["Champaign-Urbana Mass Transit District","Urbana","IL",5060,50060,"Independent Public Agency or Authority of Transit Service","Full Reporter",145361,119,"MB","DO",95,null,"","","","","","",0,"","No"]
["Santa Cruz Metropolitan Transit District","Santa Cruz","CA",9006,90006,"Independent Public Agency or Authority of Transit Service","Full Reporter",163703,118,"MB","DO",68,null,"","","","","","",0,"","No"]
["Cobb County Department of Transportation Authority","Marietta","GA",4078,40078,"City, County or Local Government Unit or Department of Transportation","Full Reporter",4515419,118,"MB","PT",56,null,"","","","","","",0,"","No"]
["Cobb County Department of Transportation Authority","Marietta","GA",4078,40078,"City, County or Local Government Unit or Department of Transportation","Full Reporter",4515419,118,"CB","PT",38,null,0,"",0,"",19.5,"",19.5,"","No"]
["Brazos Transit District","Bryan","TX",6059,60059,"Independent Public Agency or Authority of Transit Service","Full Reporter",171345,118,"MB","DO",38,null,"","","","","","",0,"","No"]
["Brazos Transit District","Bryan","TX",6059,60059,"Independent Public Agency or Authority of Transit Service","Full Reporter",171345,118,"CB","PT",32,null,"","","","","","",0,"","No"]
["Santa Cruz Metropolitan Transit District","Santa Cruz","CA",9006,90006,"Independent Public Agency or Authority of Transit Service","Full Reporter",163703,118,"CB","DO",15,null,"","","","","","",0,"","No"]
["Rides Mass Transit District","Harrisburg","IL",5211,50211,"Independent Public Agency or Authority of Transit Service","Full Reporter",67821,117,"MB","DO",117,null,"","","","","","",0,"","No"]
["Prince George's County Transit","Largo","MD",3085,30085,"City, County or Local Government Unit or Department of Transportation","Full Reporter",4586770,116,"MB","PT",76,null,"","","","","","",0,"","No"]
["Erie Metropolitan Transit Authority","Erie","PA",3013,30013,"Independent Public Agency or Authority of Transit Service","Full Reporter",196611,116,"MB","DO",60,null,"","","","","","",0,"","No"]
["Hill Country Transit District","San Saba","TX",6091,60091,"Independent Public Agency or Authority of Transit Service","Full Reporter",217630,115,"MB","DO",14,null,"","","","","","",0,"","No"]
["Cumberland Dauphin-Harrisburg Transit Authority","Harrisburg","PA",3014,30014,"Independent Public Agency or Authority of Transit Service","Full Reporter",444474,113,"MB","DO",65,null,"","","","","","",0,"","No"]
["Centre Area Transportation Authority","State College","PA",3054,30054,"Independent Public Agency or Authority of Transit Service","Full Reporter",87454,113,"MB","DO",59,null,"","","","","","",0,"","No"]
["Greater Attleboro-Taunton Regional Transit Authority","Taunton","MA",1064,10064,"Independent Public Agency or Authority of Transit Service","Full Reporter",1190956,113,"MB","PT",40,null,"","","","","","",0,"","No"]
["Greater Attleboro-Taunton Regional Transit Authority","Taunton","MA",1064,10064,"Independent Public Agency or Authority of Transit Service","Full Reporter",1190956,113,"CB","PT",3,null,"","","","","","",0,"","No"]
["Cumberland Dauphin-Harrisburg Transit Authority","Harrisburg","PA",3014,30014,"Independent Public Agency or Authority of Transit Service","Full Reporter",444474,113,"MB","PT",2,null,"","","","","","",0,"","No"]
["Transit Authority of Northern Kentucky","Fort Wright","KY",4019,40019,"Independent Public Agency or Authority of Transit Service","Full Reporter",1624827,109,"MB","DO",87,null,"","","","","","",0,"","No"]
["Marin County Transit District","San Rafael","CA",9234,90234,"Independent Public Agency or Authority of Transit Service","Full Reporter",3281212,107,"MB","PT",69,null,"","","","","","",0,"","No"]
["Whatcom Transportation Authority","Bellingham","WA",21,21,"Independent Public Agency or Authority of Transit Service","Full Reporter",114473,107,"MB","DO",44,null,"","","","","","",0,"","No"]
["Montebello Bus Lines","Montebello","CA",9041,90041,"City, County or Local Government Unit or Department of Transportation","Full Reporter",12150996,104,"MB","DO",59,null,"","","","","","",0,"","No"]
["Lee County Transit","Fort Myers","FL",4028,40028,"City, County or Local Government Unit or Department of Transportation","Full Reporter",530290,104,"MB","DO",48,null,"","","","","","",0,"","No"]
["Montebello Bus Lines","Montebello","CA",9041,90041,"City, County or Local Government Unit or Department of Transportation","Full Reporter",12150996,104,"MB","PT",5,null,"","","","","","",0,"","No"]
["Monterey-Salinas Transit","Monterey","CA",9062,90062,"Independent Public Agency or Authority of Transit Service","Full Reporter",114237,103,"MB","DO",47,null,"","","","","","",0,"","No"]
["Westmoreland County Transit Authority","Greensburg","PA",3044,30044,"City, County or Local Government Unit or Department of Transportation","Full Reporter",1733853,103,"MB","PT",31,null,13.6,"",0,"",0,"",13.6,"","No"]
["Monterey-Salinas Transit","Monterey","CA",9062,90062,"Independent Public Agency or Authority of Transit Service","Full Reporter",114237,103,"MB","PT",21,null,"","","","","","",0,"","No"]
["Monterey-Salinas Transit","Monterey","CA",9062,90062,"Independent Public Agency or Authority of Transit Service","Full Reporter",114237,103,"CB","DO",7,null,"","","","","","",0,"","No"]
["Corpus Christi Regional Transportation Authority","Corpus Christi","TX",6051,60051,"Independent Public Agency or Authority of Transit Service","Full Reporter",320069,102,"MB","DO",59,null,"","","","","","",0,"","No"]
["San Joaquin Regional Transit District","Stockton","CA",9012,90012,"Independent Public Agency or Authority of Transit Service","Full Reporter",370583,102,"MB","DO",47,null,"","","","","","",0,"","No"]
["San Joaquin Regional Transit District","Stockton","CA",9012,90012,"Independent Public Agency or Authority of Transit Service","Full Reporter",370583,102,"MB","PT",21,null,"","","","","","",0,"","No"]
["San Joaquin Regional Transit District","Stockton","CA",9012,90012,"Independent Public Agency or Authority of Transit Service","Full Reporter",370583,102,"CB","PT",14,null,"","","","","","",0,"","No"]
["Corpus Christi Regional Transportation Authority","Corpus Christi","TX",6051,60051,"Independent Public Agency or Authority of Transit Service","Full Reporter",320069,102,"MB","PT",7,null,"","","","","","",0,"","No"]
["Georgia Regional Transportation Authority","Atlanta","GA",4135,40135,"State Government Unit or Department of Transportation","Full Reporter",4515419,101,"CB","PT",101,null,0,"",91.2,"",0,"",91.2,"","No"]
["Charleston Area Regional Transportation Authority","Charleston","SC",4110,40110,"Independent Public Agency or Authority of Transit Service","Full Reporter",548404,100,"MB","PT",73,null,"","","","","","",0,"","No"]
["Sarasota County Area Transit","Sarasota","FL",4046,40046,"City, County or Local Government Unit or Department of Transportation","Full Reporter",643260,100,"MB","DO",48,null,"","","","","","",0,"","No"]
["Charleston Area Regional Transportation Authority","Charleston","SC",4110,40110,"Independent Public Agency or Authority of Transit Service","Full Reporter",548404,100,"CB","PT",7,null,"","","","","","",0,"","No"]
["Sarasota County Area Transit","Sarasota","FL",4046,40046,"City, County or Local Government Unit or Department of Transportation","Full Reporter",643260,100,"CB","DO",5,null,"","","","","","",0,"","No"]
["Berks Area Regional Transportation Authority","Reading","PA",3024,30024,"Independent Public Agency or Authority of Transit Service","Full Reporter",266254,99,"MB","DO",44,null,"","","","","","",0,"","No"]
["Suburban Transit Corporation","New Brunswick","NJ",2128,20128,"Private-For-Profit Corporation","Full Reporter",18351295,98,"CB","DO",98,null,0,"",0,"",2.9,"",2.9,"","No"]
["Connecticut Department of Transportation - CTTRANSIT New Haven Division","Hartford","CT",1055,10055,"State Government Unit or Department of Transportation","Full Reporter",562839,97,"MB","DO",97,null,"","","","","","",0,"","No"]
["City of Alexandria ","Alexandria","VA",3071,30071,"City, County or Local Government Unit or Department of Transportation","Full Reporter",4586770,97,"MB","DO",64,null,0,"",0,"",3.7,"",3.7,"","No"]
["Metropolitan Tulsa Transit Authority","Tulsa","OK",6018,60018,"City, County or Local Government Unit or Department of Transportation","Full Reporter",655479,96,"MB","DO",51,null,"","","","","","",0,"","No"]
["Metropolitan Tulsa Transit Authority","Tulsa","OK",6018,60018,"City, County or Local Government Unit or Department of Transportation","Full Reporter",655479,96,"MB","PT",7,null,"","","","","","",0,"","No"]
["Red Rose Transit Authority","Lancaster","PA",3018,30018,"Independent Public Agency or Authority of Transit Service","Full Reporter",402004,95,"MB","DO",33,null,"","","","","","",0,"","No"]
["Denton County Transportation Authority","Lewisville","TX",6101,60101,"Independent Public Agency or Authority of Transit Service","Full Reporter",366174,94,"MB","DO",44,null,"","","","","","",0,"","No"]
["Birmingham-Jefferson County Transit Authority","Birmingham","AL",4042,40042,"Independent Public Agency or Authority of Transit Service","Full Reporter",749495,93,"MB","DO",68,null,"","","","","","",0,"","No"]
["MetroWest Regional Transit Authority","Framingham","MA",1118,10118,"Independent Public Agency or Authority of Transit Service","Full Reporter",4181019,93,"MB","PT",33,null,"","","","","","",0,"","No"]
["Chapel Hill Transit","Chapel Hill","NC",4051,40051,"City, County or Local Government Unit or Department of Transportation","Full Reporter",347602,92,"MB","DO",76,null,"","","","","","",0,"","No"]
["Norwalk Transit District","Norwalk","CT",1057,10057,"Independent Public Agency or Authority of Transit Service","Full Reporter",923311,92,"MB","DO",44,null,"","","","","","",0,"","No"]
["Norwalk Transit District","Norwalk","CT",1057,10057,"Independent Public Agency or Authority of Transit Service","Full Reporter",923311,92,"MB","PT",4,null,"","","","","","",0,"","No"]
["Chapel Hill Transit","Chapel Hill","NC",4051,40051,"City, County or Local Government Unit or Department of Transportation","Full Reporter",347602,92,"MB","PT",1,null,"","","","","","",0,"","No"]
["Santa Barbara Metropolitan Transit District","Santa Barbara","CA",9020,90020,"Independent Public Agency or Authority of Transit Service","Full Reporter",195861,91,"MB","DO",87,null,"","","","","","",0,"","No"]
["County of Maui - Dept. of Transportation","Wailuku","HI",9241,90241,"City, County or Local Government Unit or Department of Transportation","Full Reporter",55934,91,"MB","PT",18,null,"","","","","","",0,"","No"]
["County of Maui - Dept. of Transportation","Wailuku","HI",9241,90241,"City, County or Local Government Unit or Department of Transportation","Full Reporter",55934,91,"CB","PT",7,null,"","","","","","",0,"","No"]
["Santa Barbara Metropolitan Transit District","Santa Barbara","CA",9020,90020,"Independent Public Agency or Authority of Transit Service","Full Reporter",195861,91,"CB","DO",4,null,"","","","","","",0,"","No"]
["City Transit Management Company, Inc.","Lubbock","TX",6010,60010,"City, County or Local Government Unit or Department of Transportation","Full Reporter",237356,89,"MB","DO",60,null,"","","","","","",0,"","No"]
["Municipality of Anchorage - Public Transportation Department","Anchorage","AK",12,12,"City, County or Local Government Unit or Department of Transportation","Full Reporter",251243,89,"MB","DO",44,null,"","","","","","",0,"","No"]
["Santa Clarita Transit","Santa Clarita","CA",9171,90171,"City, County or Local Government Unit or Department of Transportation","Full Reporter",258653,89,"MB","PT",43,null,"","","","","","",0,"",{"$f":"IF(OR(O258=\"Q\",Q258=\"Q\",S258=\"Q\",U258=\"Q\"),\"Yes\",\"No\")","v":"No"}]
["Santa Clarita Transit","Santa Clarita","CA",9171,90171,"City, County or Local Government Unit or Department of Transportation","Full Reporter",258653,89,"CB","PT",24,null,"","","","","","",0,"","No"]
["Durham Area Transit Authority","Durham","NC",4087,40087,"City, County or Local Government Unit or Department of Transportation","Full Reporter",347602,88,"MB","PT",45,null,"","","","","","",0,"","No"]
["Worcester Regional Transit Authority","Worcester","MA",1014,10014,"Independent Public Agency or Authority of Transit Service","Full Reporter",486514,88,"MB","DO",43,null,"","","","","","",0,"","No"]
["Middlesex County Area Transit","New Brunswick","NJ",2196,20196,"City, County or Local Government Unit or Department of Transportation","Full Reporter",18351295,88,"MB","DO",13,null,"","","","","","",0,"","No"]
["Rio Metro Regional Transit District","Albuquerque","NM",6111,60111,"Independent Public Agency or Authority of Transit Service","Full Reporter",741318,88,"CB","PT",5,null,"","","","","","",0,"","No"]
["Rio Metro Regional Transit District","Albuquerque","NM",6111,60111,"Independent Public Agency or Authority of Transit Service","Full Reporter",741318,88,"CB","DO",2,null,"","","","","","",0,"","No"]
["Rio Metro Regional Transit District","Albuquerque","NM",6111,60111,"Independent Public Agency or Authority of Transit Service","Full Reporter",741318,88,"MB","DO",2,null,"","","","","","",0,"","No"]
["Johnson County Kansas, aka: Johnson County Transit","Olathe","KS",7035,70035,"City, County or Local Government Unit or Department of Transportation","Full Reporter",1519417,87,"MB","PT",22,null,"","","","","","",0,"","No"]
["Johnson County Kansas, aka: Johnson County Transit","Olathe","KS",7035,70035,"City, County or Local Government Unit or Department of Transportation","Full Reporter",1519417,87,"CB","PT",21,null,"","","","","","",0,"","No"]
["Laketran","Grand River","OH",5117,50117,"Independent Public Agency or Authority of Transit Service","Full Reporter",1780673,87,"CB","DO",13,null,"","","","","","",0,"","No"]
["Laketran","Grand River","OH",5117,50117,"Independent Public Agency or Authority of Transit Service","Full Reporter",1780673,87,"MB","DO",10,null,"","","","","","",0,"","No"]
["Brockton Area Transit Authority","Brockton","MA",1004,10004,"Independent Public Agency or Authority of Transit Service","Full Reporter",4181019,86,"MB","PT",42,null,"","","","","","",0,"","No"]
["Skagit Transit","Burlington","WA",44,44,"Independent Public Agency or Authority of Transit Service","Full Reporter",62966,86,"MB","DO",15,null,"","","","","","",0,"","No"]
["Skagit Transit","Burlington","WA",44,44,"Independent Public Agency or Authority of Transit Service","Full Reporter",62966,86,"CB","DO",5,null,"","","","","","",0,"","No"]
["Greater Peoria Mass Transit District","Peoria","IL",5056,50056,"Independent Public Agency or Authority of Transit Service","Full Reporter",266921,85,"MB","DO",48,null,"","","","","","",0,"","No"]
["City of Appleton - Valley Transit","Appleton","WI",5001,50001,"City, County or Local Government Unit or Department of Transportation","Full Reporter",216154,85,"MB","DO",21,null,"","","","","","",0,"","No"]
["City of Appleton - Valley Transit","Appleton","WI",5001,50001,"City, County or Local Government Unit or Department of Transportation","Full Reporter",216154,85,"MB","PT",15,null,"","","","","","",0,"","No"]
["City of Tallahassee","Tallahassee","FL",4036,40036,"City, County or Local Government Unit or Department of Transportation","Full Reporter",240223,84,"MB","DO",65,null,"","","","","","",0,"","No"]
["SunLine Transit Agency","Thousand Palms","CA",9079,90079,"Independent Public Agency or Authority of Transit Service","Full Reporter",345580,84,"MB","DO",54,null,"","","","","","",0,"","No"]
["Torrance Transit System","Torrance","CA",9010,90010,"City, County or Local Government Unit or Department of Transportation","Full Reporter",12150996,84,"MB","DO",48,null,0,"",4.8,"",0,"",4.8,"","No"]
["Loudoun County Commuter Bus Service - Office of Transportation Services","Leesburg","VA",3081,30081,"City, County or Local Government Unit or Department of Transportation","Full Reporter",4586770,83,"CB","PT",55,null,0,"",0,"",9.5,"",9.5,"","No"]
["Loudoun County Commuter Bus Service - Office of Transportation Services","Leesburg","VA",3081,30081,"City, County or Local Government Unit or Department of Transportation","Full Reporter",4586770,83,"MB","PT",28,null,0,"",0,"",0,"",0,"","No"]
["Ames Transit Agency dba CyRide","Ames","IA",7041,70041,"City, County or Local Government Unit or Department of Transportation","Full Reporter",60438,81,"MB","DO",74,null,"","","","","","",0,"","No"]
["Golden Empire Transit District","Bakersfield","CA",9004,90004,"Independent Public Agency or Authority of Transit Service","Full Reporter",523994,81,"MB","DO",65,null,"","","","","","",0,"","No"]
["Ames Transit Agency dba CyRide","Ames","IA",7041,70041,"City, County or Local Government Unit or Department of Transportation","Full Reporter",60438,81,"MB","PT",4,null,"","","","","","",0,"","No"]
["Knoxville Area Transit","Knoxville","TN",4002,40002,"City, County or Local Government Unit or Department of Transportation","Full Reporter",558696,80,"MB","DO",62,null,"","","","","","",0,"","No"]
["Hampton Jitney, Inc.","Southampton","NY",2217,20217,"Private-For-Profit Corporation","Full Reporter",18351295,79,"CB","DO",79,null,"","","","","","",0,"","No"]
["Greensboro Transit Authority","Greensboro","NC",4093,40093,"City, County or Local Government Unit or Department of Transportation","Full Reporter",311810,79,"MB","PT",41,null,"","","","","","",0,"","No"]
["Rockland Coaches, Inc.","Westwood","NJ",2149,20149,"Private-For-Profit Corporation","Full Reporter",18351295,78,"CB","DO",78,null,0.5,"",0,"",2.9,"",3.4,"","No"]
["Capital Area Transit System","Baton Rouge","LA",6022,60022,"Independent Public Agency or Authority of Transit Service","Full Reporter",594309,77,"MB","DO",59,null,"","","","","","",0,"","No"]
["Central Oklahoma Transportation and Parking Authority","Oklahoma City","OK",6017,60017,"City, County or Local Government Unit or Department of Transportation","Full Reporter",861505,77,"MB","DO",48,null,"","","","","","",0,"","No"]
["Luzerne County Transportation Authority","Kingston","PA",3015,30015,"Independent Public Agency or Authority of Transit Service","Full Reporter",381502,77,"MB","DO",32,null,"","","","","","",0,"","No"]
["Central Oklahoma Transportation and Parking Authority","Oklahoma City","OK",6017,60017,"City, County or Local Government Unit or Department of Transportation","Full Reporter",861505,77,"MB","PT",4,null,"","","","","","",0,"","No"]
["Chatham Area Transit Authority","Savannah","GA",4025,40025,"Independent Public Agency or Authority of Transit Service","Full Reporter",260677,76,"MB","DO",52,null,"","","","","","",0,"","No"]
["Ms Coast Transportation Authority","Gulfport","MS",4014,40014,"Independent Public Agency or Authority of Transit Service","Full Reporter",208948,76,"MB","DO",17,null,"","","","","","",0,"","No"]
["StarTran","Lincoln","NE",7001,70001,"City, County or Local Government Unit or Department of Transportation","Full Reporter",258719,75,"MB","DO",56,null,"","","","","","",0,"","No"]
["Lowell Regional Transit Authority","Lowell","MA",1005,10005,"Independent Public Agency or Authority of Transit Service","Full Reporter",4181019,75,"MB","PT",43,null,"","","","","","",0,"","No"]
["Chittenden County Transportation Authority","Burlington","VT",1066,10066,"Independent Public Agency or Authority of Transit Service","Full Reporter",108740,74,"MB","DO",40,null,"","","","","","",0,"","No"]
["Piedmont Authority for Regional Transportation","Greensboro","NC",4173,40173,"Independent Public Agency or Authority of Transit Service","Full Reporter",311810,74,"CB","PT",26,null,"","","","","","",0,"","No"]
["Regional Transportation Authority","Nashville","TN",4159,40159,"Independent Public Agency or Authority of Transit Service","Full Reporter",969587,74,"CB","PT",18,null,"","","","","","",0,"","No"]
["Chittenden County Transportation Authority","Burlington","VT",1066,10066,"Independent Public Agency or Authority of Transit Service","Full Reporter",108740,74,"CB","DO",14,null,"","","","","","",0,"","No"]
["The Greater New Haven Transit District","Hamden","CT",1049,10049,"Independent Public Agency or Authority of Transit Service","Full Reporter",562839,74,"MB","DO",2,null,"","","","","","",0,"","No"]
["The Eastern Contra Costa Transit Authority","Antioch","CA",9162,90162,"Independent Public Agency or Authority of Transit Service","Full Reporter",277634,73,"MB","PT",52,null,0,"",0,"",19.399999999999999,"",19.399999999999999,"","No"]
["Antelope Valley Transit Authority","Lancaster","CA",9121,90121,"Independent Public Agency or Authority of Transit Service","Full Reporter",341219,73,"MB","PT",37,null,"","","","","","",0,"","No"]
["Antelope Valley Transit Authority","Lancaster","CA",9121,90121,"Independent Public Agency or Authority of Transit Service","Full Reporter",341219,73,"CB","PT",24,null,0,"",0,"",92.5,"",92.5,"","No"]
["Central Arkansas Transit Authority","North Little Rock","AR",6033,60033,"Independent Public Agency or Authority of Transit Service","Full Reporter",431388,72,"MB","DO",49,null,"","","","","","",0,"","No"]
["Transport of Rockland","Pomona","NY",2084,20084,"City, County or Local Government Unit or Department of Transportation","Full Reporter",18351295,71,"MB","PT",52,null,"","","","","","",0,"","No"]
["Chattanooga Area Regional Transportation Authority","Chattanooga","TN",4001,40001,"City, County or Local Government Unit or Department of Transportation","Full Reporter",381112,71,"MB","DO",51,null,"","","","","","",0,"","No"]
["Southeastern Regional Transit Authority","New Bedford","MA",1006,10006,"Independent Public Agency or Authority of Transit Service","Full Reporter",149443,71,"MB","PT",49,null,"","","","","","",0,"","No"]
["Somerset County Transportation","Somerville","NJ",2209,20209,"City, County or Local Government Unit or Department of Transportation","Full Reporter",18351295,71,"MB","DO",10,null,"","","","","","",0,"","No"]
["SouthWest Transit","Eden Prairie","MN",5221,50518,"City, County or Local Government Unit or Department of Transportation","Full Reporter",2650890,69,"MB","PT",65,null,0,"",0,"",28.8,"",28.8,"","No"]
["Connecticut Department of Transportation- CTTransit Waterbury- NET","Waterbury","CT",1128,10128,"Subsidiary Unit of a Transit Agency, Reporting Separately","Full Reporter",194535,69,"MB","PT",35,null,"","","","","","",0,"","No"]
["Yakima Transit","Yakima","WA",6,6,"City, County or Local Government Unit or Department of Transportation","Full Reporter",129534,69,"MB","DO",19,null,"","","","","","",0,"","No"]
["Yakima Transit","Yakima","WA",6,6,"City, County or Local Government Unit or Department of Transportation","Full Reporter",129534,69,"CB","PT",2,null,"","","","","","",0,"","No"]
["Kalamazoo Metro Transit System","Kalamazoo","MI",5035,50035,"City, County or Local Government Unit or Department of Transportation","Full Reporter",209703,67,"MB","DO",26,null,"","","","","","",0,"","No"]
["STAR Transit","Terrell","TX",6114,60114,"City, County or Local Government Unit or Department of Transportation","Full Reporter",5121892,67,"CB","DO",4,null,"","","","","","",0,"","No"]
["STAR Transit","Terrell","TX",6114,60114,"City, County or Local Government Unit or Department of Transportation","Full Reporter",5121892,67,"MB","DO",1,null,"","","","","","",0,"","No"]
["Tompkins Consolidated Area Transit","Ithaca","NY",2145,20145,"Private-Non-Profit Corporation","Full Reporter",53661,66,"MB","DO",40,null,"","","","","","",0,"","No"]
["Arlington Transit - Arlington County","Arlington","VA",3080,30080,"City, County or Local Government Unit or Department of Transportation","Full Reporter",4586770,66,"MB","PT",39,null,"","","","","","",0,"","No"]
["Livermore / Amador Valley Transit Authority","Livermore","CA",9144,90144,"Independent Public Agency or Authority of Transit Service","Full Reporter",615968,65,"MB","PT",49,null,"","","","","","",0,"","No"]
["Sonoma County Transit","Santa Rosa","CA",9089,90089,"City, County or Local Government Unit or Department of Transportation","Full Reporter",308231,65,"MB","PT",39,null,"","","","","","",0,"","No"]
["Gwinnett County Board of Commissioners","Lawrenceville","GA",4138,40138,"City, County or Local Government Unit or Department of Transportation","Full Reporter",4515419,65,"CB","PT",37,null,0,"",59.2,"",0,"",59.2,"","No"]
["South Florida Regional Transportation Authority","Pompano Beach","FL",4077,40077,"Independent Public Agency or Authority of Transit Service","Full Reporter",5502379,65,"MB","PT",23,null,"","","","","","",0,"","No"]
["Gwinnett County Board of Commissioners","Lawrenceville","GA",4138,40138,"City, County or Local Government Unit or Department of Transportation","Full Reporter",4515419,65,"MB","PT",22,null,"","","","","","",0,"",{"$f":"IF(OR(O322=\"Q\",Q322=\"Q\",S322=\"Q\",U322=\"Q\"),\"Yes\",\"No\")","v":"No"}]
["Sonoma County Transit","Santa Rosa","CA",9089,90089,"City, County or Local Government Unit or Department of Transportation","Full Reporter",308231,65,"MB","DO",1,null,"","","","","","",0,"","No"]
["Modesto Area Express","Modesto","CA",9007,90007,"City, County or Local Government Unit or Department of Transportation","Full Reporter",358172,64,"MB","PT",46,null,"","","","","","",0,"","No"]
["Gold Coast Transit","Oxnard","CA",9035,90035,"Independent Public Agency or Authority of Transit Service","Full Reporter",367260,64,"MB","DO",45,null,"","","","","","",0,"","No"]
["Greater Bridgeport Transit Authority","Bridgeport","CT",1050,10050,"Independent Public Agency or Authority of Transit Service","Full Reporter",923311,64,"MB","DO",43,null,"","","","","","",0,"","No"]
["Merrimack Valley Regional Transit Authority","Haverhill","MA",1013,10013,"Independent Public Agency or Authority of Transit Service","Full Reporter",4181019,64,"MB","PT",39,null,"","","","","","",0,"","No"]
["Merrimack Valley Regional Transit Authority","Haverhill","MA",1013,10013,"Independent Public Agency or Authority of Transit Service","Full Reporter",4181019,64,"CB","PT",6,null,"","","","","","",0,"","No"]
["Anaheim Transportation Network","Anaheim","CA",9211,90211,"Private-Non-Profit Corporation","Full Reporter",12150996,63,"MB","PT",63,null,"","","","","","",0,"","No"]
["Valley Regional Transit","Meridian","ID",11,11,"Independent Public Agency or Authority of Transit Service","Full Reporter",349684,63,"MB","DO",44,null,"","","","","","",0,"","No"]
["Stark Area Regional Transit Authority","Canton","OH",5011,50011,"Independent Public Agency or Authority of Transit Service","Full Reporter",279245,63,"MB","DO",33,null,"","","","","","",0,"","No"]
["Bay Metropolitan Transit Authority","Bay City","MI",5029,50029,"Independent Public Agency or Authority of Transit Service","Full Reporter",70585,62,"MB","DO",46,null,"","","","","","",0,"","No"]
["County of Lackawanna Transit System","Scranton","PA",3025,30025,"Independent Public Agency or Authority of Transit Service","Full Reporter",381502,62,"MB","DO",26,null,"","","","","","",0,"","No"]
["County of Lackawanna Transit System","Scranton","PA",3025,30025,"Independent Public Agency or Authority of Transit Service","Full Reporter",381502,62,"MB","PT",6,null,"","","","","","",0,"","No"]
["Bergen County Community Transportation","Lodi","NJ",2192,20192,"City, County or Local Government Unit or Department of Transportation","Full Reporter",18351295,62,"MB","DO",4,null,"","","","","","",0,"","No"]
["Escambia County Area Transit","Pensacola","FL",4038,40038,"City, County or Local Government Unit or Department of Transportation","Full Reporter",340067,61,"MB","PT",33,null,"","","","","","",0,"","No"]
["Springfield Mass Transit District","Springfield","IL",5059,50059,"Independent Public Agency or Authority of Transit Service","Full Reporter",161316,60,"MB","DO",48,null,"","","","","","",0,"","No"]
["Rock Island County Metropolitan Mass Transit District","Moline ","IL",5057,50057,"Independent Public Agency or Authority of Transit Service","Full Reporter",280051,60,"MB","DO",44,null,"","","","","","",0,"","No"]
["Lakeland Bus Lines, Inc.","Dover","NJ",2163,20163,"Private-For-Profit Corporation","Full Reporter",18351295,59,"CB","DO",59,null,0,"",0,"",2.9,"",2.9,"","No"]
["Port Imperial Ferry Corporation dba NY Waterway","Weehawken","NJ",2190,20190,"Private-For-Profit Corporation","Full Reporter",18351295,59,"MB","DO",47,null,"","","","","","",0,"","No"]
["Winston-Salem Transit Authority - Trans-Aid of Forsyth County","Winston-Salem","NC",4012,40012,"Independent Public Agency or Authority of Transit Service","Full Reporter",391024,59,"MB","DO",36,null,"","","","","","",0,"","No"]
["Portage Area Regional Transportation Authority","Kent","OH",5021,50021,"Independent Public Agency or Authority of Transit Service","Full Reporter",569499,59,"MB","DO",28,null,"","","","","","",0,"","No"]
["Kanawha Valley Regional Transportation Authority","Charleston","WV",3001,30001,"Independent Public Agency or Authority of Transit Service","Full Reporter",153199,58,"MB","DO",45,null,"","","","","","",0,"","No"]
["Washington County Transportation Authority","Washington","PA",3111,30111,"Independent Public Agency or Authority of Transit Service","Full Reporter",1733853,58,"MB","PT",2,null,"","","","","","",0,"","No"]
["DeCamp Bus Lines","Montclair","NJ",2161,20161,"Private-For-Profit Corporation","Full Reporter",18351295,57,"CB","DO",57,null,0,"",0,"",2.9,"",2.9,"","No"]
["Everett Transit","Everett","WA",5,5,"City, County or Local Government Unit or Department of Transportation","Full Reporter",3059393,56,"MB","DO",34,null,"","","","","","",0,"","No"]
["Transit Authority of Central Kentucky","Elizabethtown","KY",4191,40191,"Independent Public Agency or Authority of Transit Service","Full Reporter",73467,56,"MB","DO",6,null,"","","","","","",0,"","No"]
["Greater Lafayette Public Transportation Corporation","Lafayette","IN",5051,50051,"Independent Public Agency or Authority of Transit Service","Full Reporter",147725,55,"MB","DO",50,null,"","","","","","",0,"","No"]
["Duluth Transit Authority","Duluth","MN",5025,50025,"Independent Public Agency or Authority of Transit Service","Full Reporter",120378,55,"MB","DO",48,null,"","","","","","",0,"","No"]
["Transit Joint Powers Authority for Merced County","Merced","CA",9173,90173,"Independent Public Agency or Authority of Transit Service","Full Reporter",136969,55,"MB","PT",40,null,"","","","","","",0,"","No"]
["Concho Valley Transit District","San Angelo","TX",6102,60102,"Independent Public Agency or Authority of Transit Service","Full Reporter",92984,55,"MB","DO",15,null,"","","","","","",0,"","No"]
["Cambria County Transit Authority","Johnstown","PA",3012,30012,"Independent Public Agency or Authority of Transit Service","Full Reporter",69014,54,"MB","DO",32,null,"","","","","","",0,"","No"]
["Alternativa de Transporte Integrado -ATI","San Juan","PR",4094,40094,"State Government Unit or Department of Transportation","Full Reporter",2148346,53,"MB","PT",21,null,11.1,"",0,"",0,"",11.1,"","No"]
["Pasco County Public Transportation","Port Richey","FL",4074,40074,"City, County or Local Government Unit or Department of Transportation","Full Reporter",2441770,53,"MB","DO",18,null,"","","","","","",0,"","No"]
["Orange-Newark-Elizabeth, Inc.","Elizabeth","NJ",2166,20166,"Private-For-Profit Corporation","Full Reporter",18351295,52,"MB","DO",52,null,"","","","","","",0,"","No"]
["City of Lawrence","Lawrence","KS",7048,70048,"Consolidated Reporter","Full Reporter",88053,52,"MB","PT",37,null,"","","","","","",0,"","No"]
["Shreveport Area Transit System","Shreveport","LA",6024,60024,"City, County or Local Government Unit or Department of Transportation","Full Reporter",298317,52,"MB","DO",36,null,"","","","","","",0,"","No"]
["Laredo Transit Management, Inc.","Laredo","TX",6009,60009,"City, County or Local Government Unit or Department of Transportation","Full Reporter",235730,52,"MB","DO",35,null,"","","","","","",0,"","No"]
["Western Reserve Transit Authority","Youngstown","OH",5024,50024,"Independent Public Agency or Authority of Transit Service","Full Reporter",387550,52,"MB","DO",35,null,"","","","","","",0,"","No"]
["Greater Roanoke Transit Company","Roanoke","VA",3007,30007,"Other Publicly-Owned or Privately Chartered Corporation","Full Reporter",210111,52,"MB","DO",34,null,"","","","","","",0,"","No"]
["Greater Roanoke Transit Company","Roanoke","VA",3007,30007,"Other Publicly-Owned or Privately Chartered Corporation","Full Reporter",210111,52,"CB","DO",1,null,"","","","","","",0,"","No"]
["Trans-Bridge Lines, Inc. ","Bethlehem","PA",2169,20169,"Private-For-Profit Corporation","Full Reporter",18351295,51,"CB","DO",51,null,0,"",2.9,"",0,"",2.9,"","No"]
["University of Georgia Transit System","Athens","GA",4180,40180,"University","Full Reporter",128754,51,"MB","DO",45,null,"","","","","","",0,"","No"]
["St. Cloud Metropolitan Transit Commission","St. Cloud","MN",5028,50028,"Independent Public Agency or Authority of Transit Service","Full Reporter",110621,51,"MB","DO",27,null,"","","","","","",0,"","No"]
["City of Elk Grove","Elk Grove","CA",9205,90205,"City, County or Local Government Unit or Department of Transportation","Full Reporter",1723634,51,"CB","PT",26,null,"","","","","","",0,"","No"]
["City of Elk Grove","Elk Grove","CA",9205,90205,"City, County or Local Government Unit or Department of Transportation","Full Reporter",1723634,51,"MB","PT",18,null,"","","","","","",0,"","No"]
["The Tri-County Council for the Lower Eastern Shore of Maryland","Salisbury","MD",3096,30096,"Independent Public Agency or Authority of Transit Service","Full Reporter",98081,51,"MB","DO",15,null,"","","","","","",0,"","No"]
["St. Cloud Metropolitan Transit Commission","St. Cloud","MN",5028,50028,"Independent Public Agency or Authority of Transit Service","Full Reporter",110621,51,"CB","DO",4,null,"","","","","","",0,"","No"]
["Broward County Community Bus Service","Plantation","FL",4179,40179,"Consolidated Reporter","Full Reporter",5502379,50,"MB","PT",50,null,"","","","","","",0,"","No"]
["DDOT - Progressive Transportation Services Administration","Washington","DC",3112,30112,"State Government Unit or Department of Transportation","Full Reporter",4586770,50,"MB","PT",50,null,"","","","","","",0,"","No"]
["City of Gardena Transportation Department","Gardena","CA",9042,90042,"City, County or Local Government Unit or Department of Transportation","Full Reporter",12150996,50,"MB","DO",44,null,11.7,"",0,"",0,"",11.7,"","No"]
["Eau Claire Transit","Eau Claire","WI",5099,50099,"City, County or Local Government Unit or Department of Transportation","Full Reporter",102852,50,"MB","DO",16,null,"","","","","","",0,"","No"]
["Lake County Board of County Commissioners","Tavares","FL",4158,40158,"City, County or Local Government Unit or Department of Transportation","Full Reporter",131337,50,"MB","PT",7,null,"","","","","","",0,"","No"]
["Culver City Municipal Bus Lines","Culver City","CA",9039,90039,"City, County or Local Government Unit or Department of Transportation","Full Reporter",12150996,49,"MB","DO",44,null,"","","","","","",0,"","No"]
["Yolo County Transportation District","Woodland","CA",9090,90090,"Independent Public Agency or Authority of Transit Service","Full Reporter",1723634,49,"MB","PT",41,null,"","","","","","",0,"","No"]
["Central Midlands Transit","Columbia","SC",4141,40141,"Independent Public Agency or Authority of Transit Service","Full Reporter",549777,49,"MB","PT",36,null,"","","","","","",0,"","No"]
["Transfort ","Fort Collins","CO",8011,80011,"City, County or Local Government Unit or Department of Transportation","Full Reporter",264465,49,"MB","DO",31,null,"","","","","","",0,"","No"]
["Yuma County Intergovernmental Public Transportation Authority","Yuma","AZ",9233,90233,"Independent Public Agency or Authority of Transit Service","Full Reporter",135267,49,"MB","PT",22,null,"","","","","","",0,"","No"]
["Western Piedmont Regional Transit Authority ","Conover","NC",4172,40172,"Independent Public Agency or Authority of Transit Service","Full Reporter",212195,49,"MB","DO",6,null,"","","","","","",0,"","No"]
["Transfort ","Fort Collins","CO",8011,80011,"City, County or Local Government Unit or Department of Transportation","Full Reporter",264465,49,"RB","DO",6,null,5.9,"",0,"",0,"",5.9,"","No"]
["Transfort ","Fort Collins","CO",8011,80011,"City, County or Local Government Unit or Department of Transportation","Full Reporter",264465,49,"MB","PT",4,null,"","","","","","",0,"","No"]
["South Bend Public Transportation Corporation","South Bend","IN",5052,50052,"Independent Public Agency or Authority of Transit Service","Full Reporter",278165,48,"MB","DO",36,null,"","","","","","",0,"","No"]
["Western Contra Costa Transit Authority","Pinole","CA",9159,90159,"Independent Public Agency or Authority of Transit Service","Full Reporter",3281212,48,"MB","PT",33,null,"","","","","","",0,"","No"]
["The Wave Transit System","Mobile","AL",4043,40043,"City, County or Local Government Unit or Department of Transportation","Full Reporter",326183,48,"MB","DO",23,null,"","","","","","",0,"","No"]
["Western Contra Costa Transit Authority","Pinole","CA",9159,90159,"Independent Public Agency or Authority of Transit Service","Full Reporter",3281212,48,"CB","PT",6,null,"","","","","","",0,"","No"]
["Kenosha Transit","Kenosha","WI",5003,50003,"City, County or Local Government Unit or Department of Transportation","Full Reporter",124064,47,"MB","DO",37,null,"","","","","","",0,"",{"$f":"IF(OR(O386=\"Q\",Q386=\"Q\",S386=\"Q\",U386=\"Q\"),\"Yes\",\"No\")","v":"No"}]
["Broome County Department of Public Transportation","Vestal","NY",2003,20003,"City, County or Local Government Unit or Department of Transportation","Full Reporter",158084,47,"MB","DO",30,null,"","","","","","",0,"","No"]
["Ventura Intercity Service Transit Authority","Ventura","CA",9164,90164,"Independent Public Agency or Authority of Transit Service","Full Reporter",367260,47,"CB","PT",29,null,"","","","","","",0,"","No"]
["Butte County Association of Governments","Chico","CA",9208,90208,"MPO, COG or Other Planning Agency","Full Reporter",98176,47,"MB","PT",26,null,"","","","","","",0,"","No"]
["Rockford Mass Transit District","Rockford","IL",5058,50058,"Independent Public Agency or Authority of Transit Service","Full Reporter",296863,47,"MB","DO",25,null,"","","","","","",0,"","No"]
["Ventura Intercity Service Transit Authority","Ventura","CA",9164,90164,"Independent Public Agency or Authority of Transit Service","Full Reporter",367260,47,"MB","PT",5,null,"","","","","","",0,"","No"]
["Link Transit","Wenatchee","WA",43,43,"Independent Public Agency or Authority of Transit Service","Full Reporter",67227,45,"MB","DO",30,null,"","","","","","",0,"","No"]
["Manatee County Area Transit","Bradenton","FL",4026,40026,"City, County or Local Government Unit or Department of Transportation","Full Reporter",643260,45,"MB","DO",23,null,"","","","","","",0,"","No"]
["Lower Rio Grande Valley Development Council","Weslaco","TX",6090,60090,"MPO, COG or Other Planning Agency","Full Reporter",728825,45,"CB","DO",19,null,"","","","","","",0,"","No"]
["Lower Rio Grande Valley Development Council","Weslaco","TX",6090,60090,"MPO, COG or Other Planning Agency","Full Reporter",728825,45,"MB","DO",16,null,"","","","","","",0,"","No"]
["Okaloosa County Board of County Commissioners","Fort Walton Beach","FL",4128,40128,"City, County or Local Government Unit or Department of Transportation","Full Reporter",191917,45,"MB","PT",12,null,"","","","","","",0,"","No"]
["Jefferson Parish Department of Transit Administration","Gretna","LA",6088,60088,"City, County or Local Government Unit or Department of Transportation","Full Reporter",899703,44,"MB","PT",29,null,0,"",0,"",7,"",7,"","No"]
["Dutchess County Division of Mass Transportation","Poughkeepsie","NY",2010,20010,"City, County or Local Government Unit or Department of Transportation","Full Reporter",423566,44,"MB","DO",26,null,"","","","","","",0,"","No"]
["Cape Fear Public Transportation Authority","Wilmington","NC",4006,40006,"Independent Public Agency or Authority of Transit Service","Full Reporter",219957,44,"MB","PT",25,null,"","","","","","",0,"","No"]
["San Luis Obispo Regional Transit Authority","San Luis Obispo","CA",9206,90206,"Independent Public Agency or Authority of Transit Service","Full Reporter",59219,44,"MB","DO",22,null,"","","","","","",0,"","No"]
["San Luis Obispo Regional Transit Authority","San Luis Obispo","CA",9206,90206,"Independent Public Agency or Authority of Transit Service","Full Reporter",59219,44,"CB","DO",1,null,"","","","","","",0,"","No"]
["Blacksburg Transit","Blacksburg","VA",3091,30091,"City, County or Local Government Unit or Department of Transportation","Full Reporter",88542,43,"MB","DO",35,null,"","","","","","",0,"","No"]
["Napa Valley Transportation Authority","Napa","CA",9088,90088,"Independent Public Agency or Authority of Transit Service","Full Reporter",83913,43,"MB","PT",24,null,"","","","","","",0,"","No"]
["Connecticut Department of Transportation","Newington","CT",1102,10102,"State Government Unit or Department of Transportation","Full Reporter",924859,43,"CB","PT",15,null,0,"",23.6,"",0,"",23.6,"","No"]
["Santee Wateree Regional Transportation Authority","Sumter","SC",4100,40100,"Independent Public Agency or Authority of Transit Service","Full Reporter",73107,43,"MB","DO",11,null,"","","","","","",0,"","No"]
["Clermont Transportation Connection","Batavia","OH",5166,50166,"City, County or Local Government Unit or Department of Transportation","Full Reporter",1624827,43,"MB","DO",9,null,"","","","","","",0,"","No"]
["Santee Wateree Regional Transportation Authority","Sumter","SC",4100,40100,"Independent Public Agency or Authority of Transit Service","Full Reporter",73107,43,"CB","DO",7,null,"","","","","","",0,"","No"]
["Napa Valley Transportation Authority","Napa","CA",9088,90088,"Independent Public Agency or Authority of Transit Service","Full Reporter",83913,43,"CB","PT",7,null,"","","","","","",0,"","No"]
["Connecticut Department of Transportation - CTTRANSIT Stamford Division","Hartford","CT",1056,10056,"State Government Unit or Department of Transportation","Full Reporter",923311,42,"MB","DO",42,null,"","","","","","",0,"","No"]
["City of Rochester Public Transportation","Rochester","MN",5092,50092,"City, County or Local Government Unit or Department of Transportation","Full Reporter",107677,42,"MB","PT",37,null,"","","","","","",0,"","No"]
["Fort Wayne Public Transportation Corporation","Fort Wayne","IN",5044,50044,"Independent Public Agency or Authority of Transit Service","Full Reporter",313492,42,"MB","DO",30,null,"","","","","","",0,"","No"]
["Su Tran LLC dba: Sioux Area Metro","Sioux Falls","SD",8002,80002,"Private Provider Reporting on Behalf of a Public Entity","Full Reporter",156777,42,"MB","DO",22,null,"","","","","","",0,"","No"]
["Howard Transit","Ellicott City","MD",3048,30048,"City, County or Local Government Unit or Department of Transportation","Full Reporter",2203663,42,"MB","PT",19,null,"","","","","","",0,"","No"]
["City of Fairfield - Fairfield and Suisun Transit","Fairfield","CA",9092,90092,"City, County or Local Government Unit or Department of Transportation","Full Reporter",133683,42,"MB","PT",17,null,"","","","","","",0,"","No"]
["City of Fairfield - Fairfield and Suisun Transit","Fairfield","CA",9092,90092,"City, County or Local Government Unit or Department of Transportation","Full Reporter",133683,42,"CB","PT",16,null,"","","","","","",0,"","No"]
["City of Visalia - Visalia City Coach","Visalia","CA",9091,90091,"City, County or Local Government Unit or Department of Transportation","Full Reporter",219454,41,"MB","PT",33,null,"","","","","","",0,"","No"]
["Topeka Metropolitan Transit Authority","Topeka","KS",7014,70014,"Independent Public Agency or Authority of Transit Service","Full Reporter",150003,41,"MB","DO",22,null,"","","","","","",0,"","No"]
["City of Waukesha Transit Commission","Waukesha","WI",5096,50096,"City, County or Local Government Unit or Department of Transportation","Full Reporter",1376476,41,"MB","DO",20,null,10.7,"",0,"",0,"",10.7,"","No"]
["Rogue Valley Transportation District","Medford","OR",34,34,"Independent Public Agency or Authority of Transit Service","Full Reporter",154081,41,"MB","DO",19,null,"","","","","","",0,"","No"]
["City of Waukesha Transit Commission","Waukesha","WI",5096,50096,"City, County or Local Government Unit or Department of Transportation","Full Reporter",1376476,41,"CB","PT",12,null,"","","","","","",0,"","No"]
["Central Oregon Intergovernmental Council","Bend","OR",57,57,"MPO, COG or Other Planning Agency","Full Reporter",83794,41,"CB","DO",10,null,"","","","","","",0,"","No"]
["Central Oregon Intergovernmental Council","Bend","OR",57,57,"MPO, COG or Other Planning Agency","Full Reporter",83794,41,"MB","PT",9,null,"","","","","","",0,"","No"]
["University of Michigan Parking and Transportation Services","Ann Arbor","MI",5158,50158,"University","Full Reporter",306022,40,"MB","DO",40,null,"","","","","","",0,"","No"]
["Solano County Transit","Vallejo","CA",9232,90232,"City, County or Local Government Unit or Department of Transportation","Full Reporter",165074,40,"MB","PT",19,null,"","","","","","",0,"","No"]
["Fort Bend County Public Transportation","Sugar Land","TX",6103,60103,"City, County or Local Government Unit or Department of Transportation","Full Reporter",4944332,40,"CB","PT",16,null,0,"",0,"",12.2,"",12.2,"","No"]
["Solano County Transit","Vallejo","CA",9232,90232,"City, County or Local Government Unit or Department of Transportation","Full Reporter",165074,40,"CB","PT",12,null,"","","","","","",0,"","No"]
["Monroe County Transportation  Authority","Scotrun","PA","3R04-012",30137,"Independent Public Agency or Authority of Transit Service","Full Reporter",54316,40,"MB","DO",11,null,"","","","","","",0,"","No"]
["Fort Bend County Public Transportation","Sugar Land","TX",6103,60103,"City, County or Local Government Unit or Department of Transportation","Full Reporter",4944332,40,"MB","PT",5,null,"","","","","","",0,"","No"]
["Belle Urban System - Racine","Racine","WI",5006,50006,"City, County or Local Government Unit or Department of Transportation","Full Reporter",133700,39,"MB","DO",29,null,"","","","","","",0,"","No"]
["Santa Fe Trails - City of Santa Fe","Santa Fe","NM",6077,60077,"City, County or Local Government Unit or Department of Transportation","Full Reporter",89284,39,"MB","DO",25,null,"","","","","","",0,"","No"]
["Housatonic Area Regional Transit ","Danbury","CT",1051,10051,"Independent Public Agency or Authority of Transit Service","Full Reporter",168136,39,"MB","DO",24,null,"","","","","","",0,"","No"]
["Placer County Department of Public Works and Facilities","Auburn","CA",9196,90196,"City, County or Local Government Unit or Department of Transportation","Full Reporter",1723634,39,"MB","DO",16,null,"","","","","","",0,"","No"]
["Placer County Department of Public Works and Facilities","Auburn","CA",9196,90196,"City, County or Local Government Unit or Department of Transportation","Full Reporter",1723634,39,"CB","PT",4,null,"","","","","","",0,"","No"]
["Belle Urban System - Racine","Racine","WI",5006,50006,"City, County or Local Government Unit or Department of Transportation","Full Reporter",133700,39,"CB","PT",3,null,"","","","","","",0,"","No"]
["Placer County Department of Public Works and Facilities","Auburn","CA",9196,90196,"City, County or Local Government Unit or Department of Transportation","Full Reporter",1723634,39,"MB","PT",1,null,"","","","","","",0,"","No"]
["City of Harrisonburg Department of Public Transportation","Harrisonburg","VA",3094,30094,"City, County or Local Government Unit or Department of Transportation","Full Reporter",66784,38,"MB","DO",31,null,"","","","","","",0,"","No"]
["Bloomington Public Transportation Corporation","Bloomington","IN",5110,50110,"Independent Public Agency or Authority of Transit Service","Full Reporter",108657,38,"MB","DO",30,null,"","","","","","",0,"","No"]
["Lakeland Area Mass Transit District ","Lakeland","FL",4031,40031,"Independent Public Agency or Authority of Transit Service","Full Reporter",262596,38,"MB","DO",27,null,"","","","","","",0,"","No"]
["Green Bay Metro","Green Bay","WI",5002,50002,"City, County or Local Government Unit or Department of Transportation","Full Reporter",206520,38,"MB","DO",25,null,"","","","","","",0,"","No"]
["Metropolitan Evansville Transit System","Evansville","IN",5043,50043,"City, County or Local Government Unit or Department of Transportation","Full Reporter",229351,38,"MB","DO",24,null,"","","","","","",0,"","No"]
["Fayetteville Area System of Transit","Fayetteville","NC",4009,40009,"City, County or Local Government Unit or Department of Transportation","Full Reporter",310282,38,"MB","DO",22,null,"","","","","","",0,"","No"]
["Beaver County Transit Authority","Rochester","PA",3023,30023,"Independent Public Agency or Authority of Transit Service","Full Reporter",1733853,38,"MB","DO",20,null,10.1,"",0,"",0,"",10.1,"","No"]
["Butler County Regional Transit Authority","Hamilton","OH",5157,50157,"Independent Public Agency or Authority of Transit Service","Full Reporter",1624827,38,"MB","DO",11,null,"","","","","","",0,"","No"]
["Butler County Regional Transit Authority","Hamilton","OH",5157,50157,"Independent Public Agency or Authority of Transit Service","Full Reporter",1624827,38,"CB","DO",5,null,"","","","","","",0,"","No"]
["Buncombe County","Asheville ","NC",4224,40224,"City, County or Local Government Unit or Department of Transportation","Full Reporter",280648,38,"MB","PT",3,null,"","","","","","",0,"","No"]
["River Bend Transit","Davenport","IA",7049,70049,"Private-Non-Profit Corporation","Full Reporter",280051,38,"MB","PT",1,null,"","","","","","",0,"","No"]
["City of Rome Transit Department","Rome","GA",4058,40058,"City, County or Local Government Unit or Department of Transportation","Full Reporter",60851,37,"MB","DO",31,null,"","","","","","",0,"","No"]
["Greater Lynchburg Transit Company","Lynchburg","VA",3008,30008,"Independent Public Agency or Authority of Transit Service","Full Reporter",116636,37,"MB","DO",28,null,"","","","","","",0,"","No"]
["City of Columbia","Columbia","MO",7016,70016,"City, County or Local Government Unit or Department of Transportation","Full Reporter",124748,37,"MB","DO",28,null,"","","","","","",0,"","No"]
["The Tri-State Transit Authority","Huntington","WV",3002,30002,"Independent Public Agency or Authority of Transit Service","Full Reporter",202637,37,"MB","DO",27,null,"","","","","","",0,"",{"$f":"IF(OR(O450=\"Q\",Q450=\"Q\",S450=\"Q\",U450=\"Q\"),\"Yes\",\"No\")","v":"No"}]
["Bloomington-Normal Public Transit System","Normal","IL",5047,50047,"Independent Public Agency or Authority of Transit Service","Full Reporter",132600,37,"MB","DO",23,null,"","","","","","",0,"","No"]
["Williamsburg Area Transit Authority","Williamsburg","VA",3076,30076,"Independent Public Agency or Authority of Transit Service","Full Reporter",75689,37,"MB","DO",20,null,"","","","","","",0,"","No"]
["Williamsburg Area Transit Authority","Williamsburg","VA",3076,30076,"Independent Public Agency or Authority of Transit Service","Full Reporter",75689,37,"MB","PT",13,null,"","","","","","",0,"","No"]
["Clay County Council on Aging, Inc., dba Clay Transit","Green Cove Springs","FL",null,40245,"Private-Non-Profit Corporation","Full Reporter",1065219,37,"MB","DO",7,null,"","","","","","",0,"","No"]
["Polk County Transit Services Division - Polk County Board of County Commissioners","Bartow","FL",4127,40127,"City, County or Local Government Unit or Department of Transportation","Full Reporter",201289,37,"MB","DO",6,null,"","","","","","",0,"","No"]
["Unitrans - City of Davis/ASUCD","Davis","CA",9142,90142,"University","Full Reporter",72794,36,"MB","DO",36,null,"","","","","","",0,"","No"]
["Muncie Indiana Transit System","Muncie","IN",5054,50054,"City, County or Local Government Unit or Department of Transportation","Full Reporter",90580,36,"MB","DO",26,null,"","","","","","",0,"","No"]
["City of Fargo, DBA:  Metropolitan Area Transit","Fargo","ND",8003,80003,"City, County or Local Government Unit or Department of Transportation","Full Reporter",176676,36,"MB","PT",23,null,"","","","","","",0,"","No"]
["Collier Area Transit","Naples","FL",4140,40140,"City, County or Local Government Unit or Department of Transportation","Full Reporter",310298,36,"MB","PT",17,null,"","","","","","",0,"","No"]
["Chula Vista Transit","Chula Vista","CA",9193,90193,"City, County or Local Government Unit or Department of Transportation","Full Reporter",2956746,35,"MB","PT",35,null,"","","","","","",0,"","No"]
["City of Plymouth","City of Plymouth","MN",5219,50516,"City, County or Local Government Unit or Department of Transportation","Full Reporter",2650890,35,"MB","PT",27,null,0,"",0,"",36.6,"",36.6,"","No"]
["Decatur Public Transit System","Decatur","IL",5061,50061,"City, County or Local Government Unit or Department of Transportation","Full Reporter",93863,35,"MB","DO",22,null,"","","","","","",0,"","No"]
["The Gulf Coast Center","Texas City","TX",6082,60082,"Independent Public Agency or Authority of Transit Service","Full Reporter",106383,35,"MB","DO",14,null,"","","","","","",0,"","No"]
["Altoona Metro Transit","Altoona","PA",3011,30011,"Independent Public Agency or Authority of Transit Service","Full Reporter",79930,34,"MB","DO",21,null,"","","","","","",0,"","No"]
["Transit Services of Frederick County","Frederick","MD",3072,30072,"City, County or Local Government Unit or Department of Transportation","Full Reporter",141576,34,"MB","DO",16,null,"","","","","","",0,"","No"]
["Yuba-Sutter Transit Authority","Marysville","CA",9061,90061,"Independent Public Agency or Authority of Transit Service","Full Reporter",116719,34,"MB","PT",14,null,"","","","","","",0,"","No"]
["Bay County Transportation Planning Organization","Panama City","FL",4185,40185,"MPO, COG or Other Planning Agency","Full Reporter",143280,34,"MB","PT",11,null,"","","","","","",0,"","No"]
["Yuba-Sutter Transit Authority","Marysville","CA",9061,90061,"Independent Public Agency or Authority of Transit Service","Full Reporter",116719,34,"CB","PT",10,null,"","","","","","",0,"","No"]
["North Carolina State University Transportation Department","Raleigh","NC",4147,40147,"University","Full Reporter",884891,33,"MB","PT",33,null,"","","","","","",0,"","No"]
["City of Santa Rosa","Santa Rosa","CA",9017,90017,"City, County or Local Government Unit or Department of Transportation","Full Reporter",308231,33,"MB","DO",22,null,"","","","","","",0,"","No"]
["City of Brownsville - Brownsville Metro","Brownsville","TX",6014,60014,"City, County or Local Government Unit or Department of Transportation","Full Reporter",217585,33,"MB","DO",19,null,"","","","","","",0,"","No"]
["Washington County Transit","West Bend","WI",5160,50160,"City, County or Local Government Unit or Department of Transportation","Full Reporter",1376476,33,"CB","PT",8,null,"","","","","","",0,"","No"]
["City of Brownsville - Brownsville Metro","Brownsville","TX",6014,60014,"City, County or Local Government Unit or Department of Transportation","Full Reporter",217585,33,"CB","PT",6,null,"","","","","","",0,"","No"]
["City of Santa Rosa","Santa Rosa","CA",9017,90017,"City, County or Local Government Unit or Department of Transportation","Full Reporter",308231,33,"MB","PT",1,null,"","","","","","",0,"","No"]
["The Woodlands Township","The Woodlands","TX",6134,60134,"City, County or Local Government Unit or Department of Transportation","Full Reporter",239938,32,"CB","PT",32,null,"","","","","","",0,"","No"]
["Monsey New Square Trails Corporation","Spring Valley","NY",2135,20135,"Private-For-Profit Corporation","Full Reporter",18351295,32,"CB","DO",32,null,0,"",0,"",2.9,"",2.9,"","No"]
["Saginaw Transit Authority Regional Service","Saginaw","MI",5039,50039,"Independent Public Agency or Authority of Transit Service","Full Reporter",126265,32,"MB","DO",28,null,"","","","","","",0,"","No"]
["City of Huntsville, Alabama - Public Transportation Division","Huntsville","AL",4071,40071,"City, County or Local Government Unit or Department of Transportation","Full Reporter",286692,32,"MB","DO",13,null,"","","","","","",0,"","No"]
["GO Transit","Oshkosh","WI",5009,50009,"City, County or Local Government Unit or Department of Transportation","Full Reporter",74495,32,"MB","DO",9,null,"","","","","","",0,"","No"]
["Council on Aging of St. Lucie, Inc.","Fort Pierce","FL",4097,40097,"Private Provider Reporting on Behalf of a Public Entity","Full Reporter",376047,32,"MB","DO",8,null,"","","","","","",0,"","No"]
["GO Transit","Oshkosh","WI",5009,50009,"City, County or Local Government Unit or Department of Transportation","Full Reporter",74495,32,"MB","PT",1,null,"","","","","","",0,"","No"]
["Billings Metropolitan Transit","Billings","MT",8004,80004,"City, County or Local Government Unit or Department of Transportation","Full Reporter",114773,31,"MB","DO",20,null,"","","","","","",0,"","No"]
["Fayette Area Coordinated Transportation","Lemont Furnace","PA",3087,30087,"City, County or Local Government Unit or Department of Transportation","Full Reporter",51370,31,"MB","DO",6,null,0,"",2,"",0,"",2,"","No"]
["Fayette Area Coordinated Transportation","Lemont Furnace","PA",3087,30087,"City, County or Local Government Unit or Department of Transportation","Full Reporter",51370,31,"MB","PT",3,null,"","","","","","",0,"","No"]
["Centro of Oneida, Inc.","Syracuse","NY",2185,20185,"Subsidiary Unit of a Transit Agency, Reporting Separately","Full Reporter",117328,30,"MB","DO",22,null,"","","","","","",0,"","No"]
["Cedar Rapids Transit","Cedar Rapids","IA",7008,70008,"City, County or Local Government Unit or Department of Transportation","Full Reporter",177844,30,"MB","DO",22,null,"","","","","","",0,"","No"]
["LaCrosse Municipal Transit Utility","La Crosse","WI",5004,50004,"City, County or Local Government Unit or Department of Transportation","Full Reporter",100868,30,"MB","DO",16,null,"","","","","","",0,"","No"]
["City of Jackson, Department of Planning and Development, Transit Services Division ","Jackson","MS",4015,40015,"City, County or Local Government Unit or Department of Transportation","Full Reporter",351478,30,"MB","PT",14,null,"","","","","","",0,"","No"]
["Ozaukee County Transit Services","Port Washington","WI",5161,50161,"City, County or Local Government Unit or Department of Transportation","Full Reporter",1376476,30,"CB","DO",7,null,"","","","","","",0,"","No"]
["University of Iowa","Iowa City","IA",7019,70019,"University","Full Reporter",106621,29,"MB","DO",26,null,"","","","","","",0,"","No"]
["New York City Department of Transportation","New York","NY",2082,20082,"City, County or Local Government Unit or Department of Transportation","Full Reporter",18351295,29,"MB","PT",25,null,"","","","","","",0,"","No"]
["Redding Area Bus Authority","Redding","CA",9093,90093,"Independent Public Agency or Authority of Transit Service","Full Reporter",117731,29,"MB","PT",13,null,"","","","","","",0,"","No"]
["City of Kokomo","Kokomo","IN",5145,50145,"City, County or Local Government Unit or Department of Transportation","Full Reporter",62182,29,"MB","DO",4,null,"","","","","","",0,"","No"]
["Sioux City Transit System","Sioux City","IA",7012,70012,"City, County or Local Government Unit or Department of Transportation","Full Reporter",106494,28,"MB","DO",21,null,"","","","","","",0,"","No"]
["Missoula Urban Transportation District","Missoula","MT",8009,80009,"Independent Public Agency or Authority of Transit Service","Full Reporter",82157,28,"MB","DO",21,null,"","","","","","",0,"","No"]
["Santa Maria Area Transit","Santa Maria","CA",9087,90087,"City, County or Local Government Unit or Department of Transportation","Full Reporter",130447,28,"MB","PT",19,null,"","","","","","",0,"","No"]
["Ozark Regional Transit","Springdale","AR",6072,60072,"Independent Public Agency or Authority of Transit Service","Full Reporter",295083,28,"MB","DO",18,null,"","","","","","",0,"","No"]
["Shoreline Metro","Sheboygan","WI",5088,50088,"City, County or Local Government Unit or Department of Transportation","Full Reporter",71313,28,"MB","DO",17,null,"","","","","","",0,"","No"]
["Indian River County","Vero Beach","FL",4104,40104,"City, County or Local Government Unit or Department of Transportation","Full Reporter",149422,28,"MB","PT",16,null,"","","","","","",0,"","No"]
["Handitran Special Transit Division - City of Arlington","Arlington","TX",6041,60041,"City, County or Local Government Unit or Department of Transportation","Full Reporter",5121892,28,"CB","PT",2,null,"","","","","","",0,"","No"]
["City of Montgomery-Montgomery Area Transit System","Montgomery","AL",4044,40044,"City, County or Local Government Unit or Department of Transportation","Full Reporter",263907,27,"MB","DO",19,null,"","","","","","",0,"","No"]
["County Commissioners of Charles County, MD","Port Tobacco","MD",3088,30088,"City, County or Local Government Unit or Department of Transportation","Full Reporter",109919,27,"MB","PT",16,null,"","","","","","",0,"","No"]
["Shenango Valley Shuttle Service","Hermitage","PA",3055,30055,"City, County or Local Government Unit or Department of Transportation","Full Reporter",387550,27,"MB","DO",5,null,"","","","","","",0,"","No"]
["Greater Portland Transit District","Portland","ME",1016,10016,"Independent Public Agency or Authority of Transit Service","Full Reporter",203914,26,"MB","DO",26,null,"","","","","","",0,"","No"]
["Adirondack Transit Lines, Inc,","Hurley","NY",2177,20177,"Private-For-Profit Corporation","Full Reporter",18351295,26,"CB","DO",26,null,0,"",2.9,"",0,"",2.9,"","No"]
["Williamsport Bureau of Transportation","Williamsport","PA",3026,30026,"City, County or Local Government Unit or Department of Transportation","Full Reporter",56142,26,"MB","DO",23,null,"","","","","","",0,"","No"]
["Norwalk Transit System","Norwalk","CA",9022,90022,"City, County or Local Government Unit or Department of Transportation","Full Reporter",12150996,26,"MB","DO",19,null,"","","","","","",0,"","No"]
["Imperial County Transportation Commission","El Centro","CA",9226,90226,"Independent Public Agency or Authority of Transit Service","Full Reporter",107672,26,"MB","PT",18,null,"","","","","","",0,"","No"]
["Laguna Beach Municipal Transit","Laguna Beach","CA",9119,90119,"City, County or Local Government Unit or Department of Transportation","Full Reporter",583681,25,"MB","DO",25,null,"","","","","","",0,"","No"]
["University Of New Hampshire - University Transportation Services","Durham","NH",1119,10119,"University","Full Reporter",88087,25,"MB","DO",25,null,"","","","","","",0,"","No"]
["Athens Transit System","Athens","GA",4047,40047,"City, County or Local Government Unit or Department of Transportation","Full Reporter",128754,25,"MB","DO",22,null,"","","","","","",0,"","No"]
["City Utilities of Springfield ","Springfield","MO",7003,70003,"City, County or Local Government Unit or Department of Transportation","Full Reporter",273724,24,"MB","DO",20,null,"","","","","","",0,"","No"]
["Northern Arizona Intergovernmental Public Transportation Authority","Flagstaff","AZ",9219,90219,"Independent Public Agency or Authority of Transit Service","Full Reporter",71957,24,"MB","DO",17,null,"","","","","","",0,"","No"]
["Waco Transit System, Inc.","Waco","TX",6012,60012,"City, County or Local Government Unit or Department of Transportation","Full Reporter",172378,24,"MB","DO",15,null,"","","","","","",0,"",{"$f":"IF(OR(O514=\"Q\",Q514=\"Q\",S514=\"Q\",U514=\"Q\"),\"Yes\",\"No\")","v":"No"}]
["Woods Hole, Martha's Vineyard and Nantucket Steamship Authority","Woods Hole","MA",null,10183,"Independent Public Agency or Authority of Transit Service","Full Reporter",246695,24,"MB","DO",15,null,"","","","","","",0,"","No"]
["Pueblo Transit System","Pueblo","CO",8007,80007,"City, County or Local Government Unit or Department of Transportation","Full Reporter",136550,24,"MB","DO",13,null,"","","","","","",0,"","No"]
["City of Jackson Transportation Authority","Jackson","MI",5034,50034,"Independent Public Agency or Authority of Transit Service","Full Reporter",90057,24,"MB","DO",9,null,"","","","","","",0,"","No"]
["RiverCities Transit","Longview","WA",16,16,"City, County or Local Government Unit or Department of Transportation","Full Reporter",63952,24,"MB","DO",9,null,"","","","","","",0,"","No"]
["County of Lebanon Transit Authority","Lebanon","PA",3095,30095,"Independent Public Agency or Authority of Transit Service","Full Reporter",77086,24,"MB","DO",8,null,"","","","","","",0,"","No"]
["County of Lebanon Transit Authority","Lebanon","PA",3095,30095,"Independent Public Agency or Authority of Transit Service","Full Reporter",77086,24,"CB","DO",4,null,"","","","","","",0,"","No"]
["Connecticut Department of Transportation - CTTransit New Britain -Dattco.","New Britain","CT",1045,10045,"Private Provider Reporting on Behalf of a Public Entity","Full Reporter",924859,23,"CB","PT",18,null,18.2,"",0,"",0,"",18.2,"","No"]
["Berkshire Regional Transit Authority","Pittsfield","MA",1007,10007,"Subsidiary Unit of a Transit Agency, Reporting Separately","Full Reporter",59124,23,"MB","PT",15,null,"","","","","","",0,"","No"]
["Lafayette Transit System","Lafayette","LA",6038,60038,"City, County or Local Government Unit or Department of Transportation","Full Reporter",252720,23,"MB","DO",13,null,"","","","","","",0,"","No"]
["Connecticut Department of Transportation - CTTransit New Britain -Dattco.","New Britain","CT",1045,10045,"Private Provider Reporting on Behalf of a Public Entity","Full Reporter",924859,23,"MB","PT",5,null,"","","","","","",0,"","No"]
["Lafayette Transit System","Lafayette","LA",6038,60038,"City, County or Local Government Unit or Department of Transportation","Full Reporter",252720,23,"MB","PT",4,null,"","","","","","",0,"","No"]
["Ulster County Area Transit","Kingston","NY",2178,20178,"City, County or Local Government Unit or Department of Transportation","Full Reporter",423566,22,"MB","DO",18,null,"","","","","","",0,"","No"]
["Cache Valley Transit District","Logan","UT",8028,80028,"Independent Public Agency or Authority of Transit Service","Full Reporter",94983,22,"MB","DO",17,null,"","","","","","",0,"","No"]
["Greenville Transit Authority","Greenville","SC",4053,40053,"Independent Public Agency or Authority of Transit Service","Full Reporter",400492,22,"MB","DO",17,null,"","","","","","",0,"","No"]
["Iowa City Transit","Iowa City","IA",7018,70018,"City, County or Local Government Unit or Department of Transportation","Full Reporter",106621,21,"MB","DO",21,null,"","","","","","",0,"","No"]
["Southeast Area Transit","Preston","CT",1040,10040,"Independent Public Agency or Authority of Transit Service","Full Reporter",209190,21,"MB","DO",18,null,"","","","","","",0,"","No"]
["Macatawa Area Express Transportation Authority","Holland","MI",5184,50184,"Independent Public Agency or Authority of Transit Service","Full Reporter",99941,21,"MB","DO",8,null,"","","","","","",0,"","No"]
["Huntington Area Rapid Transit","Huntington Station","NY",2071,20071,"City, County or Local Government Unit or Department of Transportation","Full Reporter",18351295,21,"MB","DO",8,null,"","","","","","",0,"","No"]
["University of Minnesota Transit","Minneapolis","MN",5218,50515,"University","Full Reporter",2650890,20,"MB","PT",18,null,6.4,"",0,"",0,"",6.4,"","No"]
["Gary Public Transportation Corporation","Gary","IN",5045,50045,"City, County or Local Government Unit or Department of Transportation","Full Reporter",8608208,20,"MB","DO",16,null,"","","","","","",0,"","No"]
["Kings County Area Public Transit Agency","Hanford","CA",9200,90200,"Independent Public Agency or Authority of Transit Service","Full Reporter",87941,20,"MB","PT",14,null,"","","","","","",0,"","No"]
["Great Falls Transit District","Great Falls","MT",8012,80012,"Independent Public Agency or Authority of Transit Service","Full Reporter",65207,20,"MB","DO",13,null,"","","","","","",0,"","No"]
["Mid Mon Valley Transit Authority","Charleroi","PA",3061,30061,"Independent Public Agency or Authority of Transit Service","Full Reporter",66086,19,"MB","PT",18,null,7.8,"",0,"",0,"",7.8,"","No"]
["Augusta Richmond County Transit Department","Augusta","GA",4023,40023,"City, County or Local Government Unit or Department of Transportation","Full Reporter",386787,19,"MB","PT",12,null,"","","","","","",0,"","No"]
["Plymouth & Brockton Street Railway Company","Plymouth","MA",1117,10117,"Private-For-Profit Corporation","Full Reporter",4181019,18,"CB","DO",18,null,"","","","","","",0,"","No"]
["City of Scottsdale - Scottsdale Trolley","Scottsdale","AZ",9131,90131,"City, County or Local Government Unit or Department of Transportation","Full Reporter",3629114,18,"MB","PT",18,null,"","","","","","",0,"","No"]
["Waccamaw Regional Transportation Authority","Conway","SC",4102,40102,"Independent Public Agency or Authority of Transit Service","Full Reporter",215304,18,"MB","DO",13,null,"","","","","","",0,"","No"]
["Beaumont Municipal Transit System","Beaumont","TX",6016,60016,"City, County or Local Government Unit or Department of Transportation","Full Reporter",147922,18,"MB","PT",12,null,"","","","","","",0,"","No"]
["Cities Area Transit","Grand Forks","ND",8008,80008,"City, County or Local Government Unit or Department of Transportation","Full Reporter",61270,18,"MB","DO",8,null,"","","","","","",0,"","No"]
["Medina County Public Transit","Medina","OH",5198,50198,"City, County or Local Government Unit or Department of Transportation","Full Reporter",1780673,18,"MB","DO",5,null,"","","","","","",0,"","No"]
["City of Glendale Transit","Glendale","AZ",9034,90034,"City, County or Local Government Unit or Department of Transportation","Full Reporter",3629114,18,"MB","DO",3,null,"","","","","","",0,"","No"]
["Cooperative Alliance for Seacoast Transportation","Dover","NH",1086,10086,"Independent Public Agency or Authority of Transit Service","Full Reporter",88087,17,"MB","DO",14,null,"","","","","","",0,"","No"]
["River Valley Metro Mass Transit District","Bourbonnais","IL",5159,50159,"City, County or Local Government Unit or Department of Transportation","Full Reporter",81926,17,"MB","PT",13,null,"","","","","","",0,"","No"]
["River Valley Metro Mass Transit District","Bourbonnais","IL",5159,50159,"City, County or Local Government Unit or Department of Transportation","Full Reporter",81926,17,"CB","PT",2,null,"","","","","","",0,"","No"]
["ART (Asheville Redefines Transit)","Asheville","NC",4005,40005,"City, County or Local Government Unit or Department of Transportation","Full Reporter",280648,16,"MB","DO",16,null,"","","","","","",0,"","No"]
["Ohio Valley Regional Transportation Authority","Wheeling","WV",3035,30035,"Independent Public Agency or Authority of Transit Service","Full Reporter",81249,16,"MB","DO",14,null,"","","","","","",0,"","No"]
["Mesa County","Grand Junction","CO",8016,80016,"City, County or Local Government Unit or Department of Transportation","Full Reporter",128124,16,"MB","PT",12,null,"","","","","","",0,"","No"]
["Middletown Transit District","Middletown","CT",1063,10063,"Independent Public Agency or Authority of Transit Service","Full Reporter",924859,16,"MB","DO",9,null,"","","","","","",0,"","No"]
["City of Lodi - Transit Division","Lodi","CA",9175,90175,"City, County or Local Government Unit or Department of Transportation","Full Reporter",68738,16,"MB","PT",8,null,"","","","","","",0,"","No"]
["Michiana Area Council of Governments","South Bend","IN",5149,50149,"MPO, COG or Other Planning Agency","Full Reporter",143592,16,"MB","PT",8,null,"","","","","","",0,"","No"]
["Worcester Regional Transit Authority COA","Worcester","MA",1126,10126,"Consolidated Reporter","Full Reporter",486514,16,"MB","PT",1,null,"","","","","","",0,"","No"]
["Delaware County Transit Board","Delaware","OH",5199,50199,"Independent Public Agency or Authority of Transit Service","Full Reporter",1368035,15,"MB","DO",11,null,"","","","","","",0,"","No"]
["Nashua Transit System","Nashua","NH",1087,10087,"City, County or Local Government Unit or Department of Transportation","Full Reporter",226400,15,"MB","PT",9,null,"","","","","","",0,"","No"]
["Jackson Transit Authority","Jackson","TN",4057,40057,"Independent Public Agency or Authority of Transit Service","Full Reporter",71880,15,"MB","DO",9,null,"","","","","","",0,"","No"]
["City of Redondo Beach - Beach Cities Transit","Redondo Beach","CA",9214,90214,"City, County or Local Government Unit or Department of Transportation","Full Reporter",12150996,14,"MB","PT",10,null,"","","","","","",0,"","No"]
["City of Commerce Municipal Buslines","Commerce","CA",9043,90043,"City, County or Local Government Unit or Department of Transportation","Full Reporter",12150996,14,"MB","DO",10,null,"","","","","","",0,"","No"]
["Albany Transit System","Albany","GA",4021,40021,"City, County or Local Government Unit or Department of Transportation","Full Reporter",95779,14,"MB","DO",8,null,"","","","","","",0,"","No"]
["City of Petaluma","Petaluma","CA",9213,90213,"City, County or Local Government Unit or Department of Transportation","Full Reporter",64078,14,"MB","PT",8,null,"","","","","","",0,"","No"]
["Milford Transit District","Milford","CT",1107,10107,"Independent Public Agency or Authority of Transit Service","Full Reporter",923311,14,"MB","DO",6,null,"","","","","","",0,"","No"]
["Putnam County Transit","Carmel","NY",2096,20096,"City, County or Local Government Unit or Department of Transportation","Full Reporter",18351295,14,"MB","PT",6,null,"","","","","","",0,"","No"]
["Connecticut Department of Transportation -CTTRANSIT New Britain ","Berlin","CT",1130,10130,"Private Provider Reporting on Behalf of a Public Entity","Full Reporter",924859,13,"MB","PT",13,null,"","","","","","",0,"","No"]
["Monroe Bus Corporation","Brooklyn","NY",2137,20137,"Private-For-Profit Corporation","Full Reporter",423566,12,"CB","DO",12,null,"","","","","","",0,"","No"]
["Centro of Oswego, Inc.","Syracuse","NY",2172,20172,"Subsidiary Unit of a Transit Agency, Reporting Separately","Full Reporter",412317,11,"MB","DO",11,null,"","","","","","",0,"","No"]
["Centro of Cayuga, Inc.","Syracuse","NY",2116,20116,"Subsidiary Unit of a Transit Agency, Reporting Separately","Full Reporter",412317,11,"MB","DO",11,null,"","","","","","",0,"","No"]
["City of Corvallis","Corvallis","OR",47,47,"City, County or Local Government Unit or Department of Transportation","Full Reporter",62433,11,"MB","PT",11,null,"","","","","","",0,"","No"]
["City of Moorhead, DBA: Metropolitan Area Transit","Moorhead","MN",5026,50026,"City, County or Local Government Unit or Department of Transportation","Full Reporter",176676,11,"MB","PT",8,null,"","","","","","",0,"","No"]
["City of San Luis Obispo","San Luis Obispo","CA",9156,90156,"City, County or Local Government Unit or Department of Transportation","Full Reporter",59219,10,"MB","PT",10,null,"","","","","","",0,"","No"]
["Terre Haute Transit Utility","Terre Haute","IN",5053,50053,"City, County or Local Government Unit or Department of Transportation","Full Reporter",92742,10,"MB","DO",8,null,"","","","","","",0,"","No"]
["City of Tulare","Tulare","CA",9244,90244,"City, County or Local Government Unit or Department of Transportation","Full Reporter",219454,10,"MB","PT",7,null,"","","","","","",0,"","No"]
["City of Washington","Washington","PA",3101,30101,"City, County or Local Government Unit or Department of Transportation","Full Reporter",1733853,9,"MB","PT",6,null,"","","","","","",0,"","No"]
["City of Long Beach","Long Beach","NY",2006,20006,"City, County or Local Government Unit or Department of Transportation","Full Reporter",18351295,9,"MB","DO",6,null,"","","","","","",0,"","No"]
["Martin County","Stuart","FL",4192,40192,"City, County or Local Government Unit or Department of Transportation","Full Reporter",376047,9,"MB","PT",5,null,"","","","","","",0,"","No"]
["City of Fairfax CUE Bus","Fairfax","VA",3058,30058,"City, County or Local Government Unit or Department of Transportation","Full Reporter",4586770,8,"MB","DO",8,null,"","","","","","",0,"","No"]
["City of Ocala, Florida","Ocala","FL",4120,40120,"City, County or Local Government Unit or Department of Transportation","Full Reporter",156909,8,"MB","PT",6,null,"","","","","","",0,"",{"$f":"IF(OR(O578=\"Q\",Q578=\"Q\",S578=\"Q\",U578=\"Q\"),\"Yes\",\"No\")","v":"No"}]
["City of Turlock","Turlock","CA",9201,90201,"City, County or Local Government Unit or Department of Transportation","Full Reporter",99904,8,"MB","PT",4,null,"","","","","","",0,"","No"]
["City of Valparaiso","Valparaiso","IN",5183,50183,"City, County or Local Government Unit or Department of Transportation","Full Reporter",8608208,8,"CB","PT",4,null,"","","","","","",0,"","No"]
["City of Valparaiso","Valparaiso","IN",5183,50183,"City, County or Local Government Unit or Department of Transportation","Full Reporter",8608208,8,"MB","PT",4,null,"","","","","","",0,"","No"]
["Coralville Transit System","Coralville","IA",7030,70030,"City, County or Local Government Unit or Department of Transportation","Full Reporter",106621,7,"MB","DO",7,null,"","","","","","",0,"","No"]
["Private Transportation Corporation","Brooklyn","NY",2175,20175,"Private-For-Profit Corporation","Full Reporter",18351295,6,"MB","PT",6,null,"","","","","","",0,"","No"]
["The University of Montana - ASUM Transportation","Missoula","MT",8107,80107,"University","Full Reporter",82157,6,"MB","DO",6,null,"","","","","","",0,"","No"]
["Borough of Pottstown - Pottstown Area Rapid Transit","Pottstown","PA",3077,30077,"City, County or Local Government Unit or Department of Transportation","Full Reporter",107682,6,"MB","PT",5,null,"","","","","","",0,"","No"]
["City of Fort Lauderdale","Fort Lauderdale","FL",null,44929,"City, County or Local Government Unit or Department of Transportation","Full Reporter",5502379,6,"MB","PT",5,null,"","","","","","",0,"","No"]
["City of Maple Grove","Maple Grove","MN",5220,50517,"City, County or Local Government Unit or Department of Transportation","Full Reporter",2650890,6,"MB","PT",1,null,"","","","","","",0,"","No"]
["City of Loveland Transit","Loveland","CO",8025,80025,"City, County or Local Government Unit or Department of Transportation","Full Reporter",264465,5,"MB","DO",3,null,"","","","","","",0,"","No"]
["East Chicago Transit","East Chicago","IN",5042,50042,"City, County or Local Government Unit or Department of Transportation","Full Reporter",8608208,4,"MB","DO",3,null,"","","","","","",0,"","No"]
["Brunswick Transit Alternative","Brunswick","OH",5143,50143,"City, County or Local Government Unit or Department of Transportation","Full Reporter",1780673,2,"MB","DO",2,null,"","","","","","",0,"","No"]

{"sheet":"Track and Roadway by Agency","index":4,"n_rows":534,"n_cols":45,"rows_kept":534,"cut":false,"hidden":false,"merged":[]}
["Name","City","State","Legacy NTD ID","NTD ID","Organization Type","Reporter Type","Primary UZA Population","VOMS","Miles of Track:","At Grade: Restricted Right-of-Way","At Grade: Restricted Right-of-Way Questionable","Street Running","Street Running Questionable","Elevated on Structure","Elevated on Structure Questionable","Elevated on Fill","Elevated on Fill Questionable","Open Cut","Open Cut Questionable","Subway","Subway Questionable","Total Track Miles","Total Track Miles Questionable","Number of Crossings:","At Grade: Restricted Right-of-Way Crossings","At Grade: Restricted Right-of-Way Questionable","Street Running Crossings","Street Running Questionable","Total Crossings","Total Crossings Questionable","Miles of Roadway:","Permanent Busway","Permanent Busway Questionable","Permanent HOV","Permanent HOV Questionable","Part-Time Busway or HOV","Part-Time Busway or HOV Questionable","Total Roadway Miles","Total Roadway Miles Questionable","Any data questionable?",null,null,null,{"$f":"IF(AS4=1,1,0)","v":1}]
["MTA New York City Transit","New York","NY",2008,20008,"Subsidiary Unit of a Transit Agency, Reporting Separately","Full Reporter",18351295,11000,null,137.30000000000001,"",0,"",196.3,"",29,"",29.5,"",440.4,"",832.5,"",null,0,"",0,"",0,"",null,82.800000000000011,"",9.6,"",88.3,"",180.7,"",{"$f":"IF(OR(L2=\"Q\",N2=\"Q\",P2=\"Q\",R2=\"Q\",T2=\"Q\",V2=\"Q\",X2=\"Q\",AA2=\"Q\",AC2=\"Q\",AE2=\"Q\",AH2=\"Q\",AJ2=\"Q\",AL2=\"Q\",AN2=\"Q\"),\"Yes\",\"No\")","v":"No"},null,null,null,"Hide questionable data tags"]
["New Jersey Transit Corporation","Newark","NJ",2080,20080,"Other Publicly-Owned or Privately Chartered Corporation","Full Reporter",18351295,4020,null,905.89999999999986,"",6.9,"",13.100000000000001,"",29.299999999999997,"",8.6,"",11.3,"",975.09999999999991,"",null,416,"",32,"",448,"",null,0.5,"",0,"",35.799999999999997,"",36.299999999999997,"","No",null,null,null,"Show questionable data tags"]
["Los Angeles County Metropolitan Transportation Authority dba: Metro","Los Angeles","CA",9154,90154,"Independent Public Agency or Authority of Transit Service","Full Reporter",12150996,3516,null,73.3,"",0,"",15.5,"",26,"",16.899999999999999,"",38.200000000000003,"",169.89999999999998,"",null,152,"",0,"",152,"",null,40.4,"",72.5,"",0,"",112.9,"","No",null,null,null,1]
["Washington Metropolitan Area Transit Authority","Washington","DC",3030,30030,"Independent Public Agency or Authority of Transit Service","Full Reporter",4586770,3200,null,152.19999999999999,"",0,"",24.2,"",0.5,"",3.1,"",112.3,"",292.29999999999995,"",null,0,"",0,"",0,"",null,1.3,"",10.4,"",61.8,"",73.5,"","No"]
["King County Department of Transportation - Metro Transit Division","Seattle","WA",1,1,"City, County or Local Government Unit or Department of Transportation","Full Reporter",3059393,2875,null,0.1,"",2.5,"",0,"",0,"",0,"",0,"",2.6,"",null,0,"",18,"",18,"",null,125.60000000000001,"",149.4,"",97.4,"",372.40000000000003,"","No"]
["Chicago Transit Authority","Chicago","IL",5066,50066,"Independent Public Agency or Authority of Transit Service","Full Reporter",8608208,2728,null,95.300000000000011,"",0,"",116.5,"",49.8,"",2.7,"",23.5,"",287.8,"",null,25,"",0,"",25,"",null,3.8,"",0,"",0,"",3.8,"","No"]
["Massachusetts Bay Transportation Authority","Boston","MA",1003,10003,"Independent Public Agency or Authority of Transit Service","Full Reporter",4181019,2344,null,823,"",2,"",8,"",0,"",10,"",54.5,"",897.5,"",null,314,"",9,"",323,"",null,11.4,"",0,"",1.6,"",13,"","No"]
["Southeastern Pennsylvania Transportation Authority","Philadelphia","PA",3019,30019,"Independent Public Agency or Authority of Transit Service","Full Reporter",5441567,2340,null,671.6,"",189.2,"",17,"",0,"",0,"",54.8,"",932.6,"",null,336,"",646,"",982,"",null,33,"",0,"",0,"",33,"","No"]
["Metropolitan Transit Authority of Harris County, Texas ","Houston","TX",6008,60008,"Independent Public Agency or Authority of Transit Service","Full Reporter",4944332,2240,null,51,"",4.5999999999999996,"",2.8,"",0.4,"",0,"",0,"",58.8,"",null,127,"",34,"",161,"",null,0,"",57,"",61.000000000000007,"",118,"","No"]
["Puerto Rico Highway and Transportation Authority","San Juan","PR",4105,40105,"State Government Unit or Department of Transportation","Full Reporter",2148346,1800,null,0,"",0,"",0,"",0,"",0,"",0,"",0,"",null,0,"",0,"",0,"",null,0,"",0,"",0,"",0,"","No"]
["Pace - Suburban Bus Division","Arlington Heights","IL",5113,50113,"Independent Public Agency or Authority of Transit Service","Full Reporter",8608208,1638,null,0,"",0,"",0,"",0,"",0,"",0,"",0,"",null,0,"",0,"",0,"",null,0,"",0,"",0,"",0,"","No"]
["Orange County Transportation Authority","Orange","CA",9036,90036,"Independent Public Agency or Authority of Transit Service","Full Reporter",12150996,1528,null,0,"",0,"",0,"",0,"",0,"",0,"",0,"",null,0,"",0,"",0,"",null,0,"",0,"",230.6,"",230.6,"","No"]
["San Francisco Municipal Railway","San Francisco","CA",9015,90015,"City, County or Local Government Unit or Department of Transportation","Full Reporter",3281212,1524,null,29.6,"",54,"",0,"",0,"",0.2,"",14.9,"",98.699999999999989,"",null,77,"",417,"",494,"",null,163.4,"",12.6,"",6.7,"",182.70000000000002,"","No"]
["Maryland Transit Administration","Baltimore","MD",3034,30034,"State Government Unit or Department of Transportation","Full Reporter",2203663,1491,null,538.69999999999993,"",3,"",9.9,"",0,"",0,"",11,"",562.59999999999991,"",null,75,"",17,"",92,"",null,14.8,"",0,"",17,"",31.8,"","No"]
["Denver Regional Transportation District","Denver","CO",8006,80006,"Independent Public Agency or Authority of Transit Service","Full Reporter",2374203,1395,null,63.3,"",0,"",7.9,"",19.8,"",2.4,"",0.6,"",94,"",null,57,"",0,"",57,"",null,1.9,"",0,"",50.6,"",52.5,"","No"]
["Metro-North Commuter Railroad Company, dba: MTA Metro-North Railroad","New York","NY",2078,20078,"Subsidiary Unit of a Transit Agency, Reporting Separately","Full Reporter",18351295,1199,null,791.5,"",0,"",6.2,"",0,"",0,"",10.3,"",808,"",null,157,"",0,"",157,"",null,0,"",0,"",0,"",0,"","No"]
["Miami-Dade Transit","Miami","FL",4034,40034,"City, County or Local Government Unit or Department of Transportation","Full Reporter",5502379,1129,null,9.9,"",0,"",56.199999999999996,"",1.6,"",0,"",0,"",67.7,"",null,0,"",0,"",0,"",null,39.799999999999997,"",0,"",52.4,"",92.199999999999989,"","No"]
["Utah Transit Authority","Salt Lake City","UT",8001,80001,"Independent Public Agency or Authority of Transit Service","Full Reporter",1021243,1104,null,212.5,"",1,"",2.9000000000000004,"",9.6000000000000014,"",1.9,"",0,"",227.9,"",null,133,"",76,"",209,"",null,2.1,"",12.7,"",0,"",14.799999999999999,"","No"]
["MTA Bus Company","New York","NY",2188,20188,"Subsidiary Unit of a Transit Agency, Reporting Separately","Full Reporter",18351295,1091,null,0,"",0,"",0,"",0,"",0,"",0,"",0,"",null,0,"",0,"",0,"",null,0.3,"",0,"",14.6,"",14.9,"","No"]
["Northeast Illinois Regional Commuter Railroad Corporation dba: Metra Rail","Chicago","IL",5118,50118,"Independent Public Agency or Authority of Transit Service","Full Reporter",8608208,1062,null,846.2,"",0,"",0,"",310.8,"",48.9,"",0,"",1205.9000000000001,"",null,568,"",0,"",568,"",null,0,"",0,"",0,"",0,"","No"]
["Dallas Area Rapid Transit","Dallas","TX",6056,60056,"Independent Public Agency or Authority of Transit Service","Full Reporter",5121892,1042,null,174.7,"",3.6,"",73.599999999999994,"",0,"",2.2000000000000002,"",6.2,"",260.29999999999995,"",null,186,"",29,"",215,"",null,0,"",75.3,"",46.9,"",122.19999999999999,"","No"]
["MTA Long Island Rail Road","Jamaica","NY",2100,20100,"Subsidiary Unit of a Transit Agency, Reporting Separately","Full Reporter",18351295,1019,null,603,"",0,"",36.1,"",24,"",0,"",7.2,"",670.3,"",null,334,"",0,"",334,"",null,0,"",0,"",0,"",0,"","No"]
["Tri-County Metropolitan Transportation District of Oregon","Portland","OR",8,8,"Independent Public Agency or Authority of Transit Service","Full Reporter",1849898,918,null,97.3,"",0,"",5.3,"",3.4,"",10.9,"",6.4,"",123.3,"",null,214,"",0,"",214,"",null,3.3,"",0,"",0.6,"",3.9,"","No"]
["Port Authority of Allegheny County","Pittsburgh","PA",3022,30022,"Independent Public Agency or Authority of Transit Service","Full Reporter",1733853,912,null,35.099999999999994,"",6.7,"",3,"",0,"",0,"",6.6,"",51.399999999999991,"",null,37,"",5,"",42,"",null,43.1,"",13.4,"",0,"",56.5,"","No"]
["Metro Transit ","Minneapolis","MN",5027,50027,"Subsidiary Unit of a Transit Agency, Reporting Separately","Full Reporter",2650890,885,null,111.7,"",0,"",3.3000000000000003,"",0.9,"",1,"",3.5,"",120.4,"",null,140,"",0,"",140,"",null,10.1,"",0,"",0,"",10.1,"","No"]
["Pace-Suburban Bus Division, ADA Paratransit Services","Arlington Heights","IL",5182,50182,"Independent Public Agency or Authority of Transit Service","Full Reporter",8608208,873,null,0,"",0,"",0,"",0,"",0,"",0,"",0,"",null,0,"",0,"",0,"",null,0,"",0,"",0,"",0,"","No"]
["Metropolitan Atlanta Rapid Transit Authority","Atlanta","GA",4022,40022,"Independent Public Agency or Authority of Transit Service","Full Reporter",4515419,838,null,58.2,"",0,"",24.4,"",0,"",0,"",21.1,"",103.7,"",null,0,"",0,"",0,"",null,0.2,"",0,"",13.5,"",13.7,"","No"]
["City and County of Honolulu Department of Transportation Services","Honolulu","HI",9002,90002,"City, County or Local Government Unit or Department of Transportation","Full Reporter",802459,799,null,0,"",0,"",0,"",0,"",0,"",0,"",0,"",null,0,"",0,"",0,"",null,1.2,"",0,"",34.700000000000003,"",35.900000000000006,"","No"]
["VIA Metropolitan Transit","San Antonio","TX",6011,60011,"Independent Public Agency or Authority of Transit Service","Full Reporter",1758210,786,null,0,"",0,"",0,"",0,"",0,"",0,"",0,"",null,0,"",0,"",0,"",null,0,"",0,"",0,"",0,"","No"]
["San Diego Metropolitan Transit System","San Diego","CA",9026,90026,"Independent Public Agency or Authority of Transit Service","Full Reporter",2956746,732,null,82.7,"",6.6,"",8.9,"",1.8,"",1.4,"",1.2,"",102.6,"",null,70,"",26,"",96,"",null,3.0999999999999996,"",30.8,"",0,"",33.9,"","No"]
["San Diego Association of Governments","San Diego","CA",9095,90095,"MPO, COG or Other Planning Agency","Full Reporter",2956746,714,null,0,"",0,"",0,"",0,"",0,"",0,"",0,"",null,0,"",0,"",0,"",null,0,"",0,"",0,"",0,"","No"]
["Access Services  ","El Monte","CA",9157,90157,"Independent Public Agency or Authority of Transit Service","Full Reporter",12150996,709,null,0,"",0,"",0,"",0,"",0,"",0,"",0,"",null,0,"",0,"",0,"",null,0,"",0,"",0,"",0,"","No"]
["Santa Clara Valley Transportation Authority","San Jose","CA",9013,90013,"Independent Public Agency or Authority of Transit Service","Full Reporter",1664496,679,null,67.099999999999994,"",0,"",2.9,"",7.9,"",1.4,"",0.3,"",79.599999999999994,"",null,168,"",0,"",168,"",null,1.1000000000000001,"",247.79999999999998,"",0,"",248.89999999999998,"","No"]
["Capital Metropolitan Transportation Authority","Austin","TX",6048,60048,"Independent Public Agency or Authority of Transit Service","Full Reporter",1362416,674,null,63.6,"",0,"",1,"",0,"",0,"",0,"",64.599999999999994,"",null,79,"",0,"",79,"",null,0,"",0,"",0,"",0,"","No"]
["Alameda-Contra Costa Transit District","Oakland","CA",9014,90014,"Independent Public Agency or Authority of Transit Service","Full Reporter",3281212,667,null,0,"",0,"",0,"",0,"",0,"",0,"",0,"",null,0,"",0,"",0,"",null,0,"",54.199999999999996,"",0,"",54.199999999999996,"","No"]
["Regional Transportation Commission of Southern Nevada","Las Vegas","NV",9045,90045,"Independent Public Agency or Authority of Transit Service","Full Reporter",1886011,660,null,0,"",0,"",0,"",0,"",0,"",0,"",0,"",null,0,"",0,"",0,"",null,64.8,"",0,"",9.1999999999999993,"",74,"","No"]
["Snohomish County Public Transportation Benefit Area Corporation","Everett","WA",29,29,"Independent Public Agency or Authority of Transit Service","Full Reporter",3059393,608,null,0,"",0,"",0,"",0,"",0,"",0,"",0,"",null,0,"",0,"",0,"",null,4,"",146.4,"",3.9000000000000004,"",154.30000000000001,"","No"]
["City of Phoenix Public Transit Department dba Valley Metro","Phoenix","AZ",9032,90032,"City, County or Local Government Unit or Department of Transportation","Full Reporter",3629114,571,null,0,"",0,"",0,"",0,"",0,"",0,"",0,"",null,0,"",0,"",0,"",null,0,"",0,"",117.7,"",117.7,"","No"]
["Central Florida Regional Transportation Authority","Orlando","FL",4035,40035,"Independent Public Agency or Authority of Transit Service","Full Reporter",1510516,560,null,0,"",0,"",0,"",0,"",0,"",0,"",0,"",null,0,"",0,"",0,"",null,4.0999999999999996,"",0,"",0,"",4.0999999999999996,"","No"]
["The Greater Cleveland Regional Transit Authority","Cleveland","OH",5015,50015,"Independent Public Agency or Authority of Transit Service","Full Reporter",1780673,547,null,64.5,"",0,"",2.8,"",3.9,"",3.1,"",0.6,"",74.900000000000006,"",null,22,"",0,"",22,"",null,11.899999999999999,"",0,"",5.4,"",17.299999999999997,"","No"]
["VRide, Inc. - Michigan","Farmington Hills","MI",5193,50193,"Private Provider Reporting on Behalf of a Public Entity","Full Reporter",3734090,539,null,0,"",0,"",0,"",0,"",0,"",0,"",0,"",null,0,"",0,"",0,"",null,0,"",0,"",0,"",0,"","No"]
["San Francisco Bay Area Rapid Transit District","Oakland","CA",9003,90003,"Independent Public Agency or Authority of Transit Service","Full Reporter",3281212,538,null,154.70000000000002,"",0,"",59.6,"",0,"",0.3,"",56.1,"",270.70000000000005,"",null,0,"",0,"",0,"",null,0,"",0,"",0,"",0,"","No"]
["Pierce County Transportation Benefit Area Authority","Tacoma","WA",3,3,"Independent Public Agency or Authority of Transit Service","Full Reporter",3059393,507,null,0,"",0,"",0,"",0,"",0,"",0,"",0,"",null,0,"",0,"",0,"",null,0,"",16.899999999999999,"",0,"",16.899999999999999,"","No"]
["California Vanpool Authority","Hanford","CA",9230,90230,"City, County or Local Government Unit or Department of Transportation","Full Reporter",87941,505,null,0,"",0,"",0,"",0,"",0,"",0,"",0,"",null,0,"",0,"",0,"",null,0,"",0,"",0,"",0,"","No"]
["Broward County Transit Division","Plantation","FL",4029,40029,"City, County or Local Government Unit or Department of Transportation","Full Reporter",5502379,474,null,0,"",0,"",0,"",0,"",0,"",0,"",0,"",null,0,"",0,"",0,"",null,0,"",0,"",24.6,"",24.6,"","No"]
["Potomac and Rappahannock Transportation Commission","Woodbridge","VA",3070,30070,"Independent Public Agency or Authority of Transit Service","Full Reporter",4586770,473,null,0,"",0,"",0,"",0,"",0,"",0,"",0,"",null,0,"",0,"",0,"",null,0,"",0,"",122.4,"",122.4,"","No"]
["Bi-State Development Agency of the Missouri-Illinois Metropolitan District, d.b.a.(St. Louis) Metro","St. Louis","MO",7006,70006,"Independent Public Agency or Authority of Transit Service","Full Reporter",2150706,473,null,54.9,"",0,"",8.6,"",12.4,"",14.5,"",5.9,"",96.3,"",null,25,"",0,"",25,"",null,0,"",0,"",0,"",0,"","No"]
["LACMTA - Small Operators","Los Angeles","CA",9166,90166,"Other","Full Reporter",12150996,462,null,0,"",0,"",0,"",0,"",0,"",0,"",0,"",null,0,"",0,"",0,"",null,0,"",0,"",0,"",0,"","No"]
["City of Detroit Department of Transportation","Detroit","MI",5119,50119,"City, County or Local Government Unit or Department of Transportation","Full Reporter",3734090,454,null,0,"",0,"",0,"",0,"",0,"",0,"",0,"",null,0,"",0,"",0,"",null,0,"",0,"",0,"",0,"","No"]
["Board of County Commissioners, Palm Beach County, PalmTran, Inc.","West Palm Beach","FL",4037,40037,"City, County or Local Government Unit or Department of Transportation","Full Reporter",5502379,450,null,0,"",0,"",0,"",0,"",0,"",0,"",0,"",null,0,"",0,"",0,"",null,0,"",0,"",0,"",0,"","No"]
["Metro Mobility","St. Paul","MN",5155,50155,"Subsidiary Unit of a Transit Agency, Reporting Separately","Full Reporter",2650890,446,null,0,"",0,"",0,"",0,"",0,"",0,"",0,"",null,0,"",0,"",0,"",null,0,"",0,"",0,"",0,"","No"]
["Delaware Transit Corporation","Dover","DE",3075,30075,"Independent Public Agency or Authority of Transit Service","Full Reporter",5441567,445,null,0,"",0,"",0,"",0,"",0,"",0,"",0,"",null,0,"",0,"",0,"",null,0,"",0,"",0,"",0,"","No"]
["Ben Franklin Transit","Richland","WA",18,18,"Independent Public Agency or Authority of Transit Service","Full Reporter",210975,440,null,0,"",0,"",0,"",0,"",0,"",0,"",0,"",null,0,"",0,"",0,"",null,0,"",0,"",0,"",0,"","No"]
["Milwaukee County Transit System","Milwaukee","WI",5008,50008,"City, County or Local Government Unit or Department of Transportation","Full Reporter",1376476,433,null,0,"",0,"",0,"",0,"",0,"",0,"",0,"",null,0,"",0,"",0,"",null,0,"",0,"",0,"",0,"","No"]
["Charlotte Area Transit System","Charlotte","NC",4008,40008,"City, County or Local Government Unit or Department of Transportation","Full Reporter",1249442,431,null,6.6,"",0,"",0.9,"",1.8,"",0,"",0,"",9.3000000000000007,"",null,20,"",0,"",20,"",null,15.4,"",28.8,"",0,"",44.2,"","No"]
["Regional Public Transportation Authority, dba: Valley Metro","Phoenix","AZ",9136,90136,"Independent Public Agency or Authority of Transit Service","Full Reporter",3629114,403,null,0,"",0,"",0,"",0,"",0,"",0,"",0,"",null,0,"",0,"",0,"",null,0,"",0,"",227.4,"",227.4,"","No"]
["vRide, Inc. - Valley Metro","Phoenix","AZ",9169,90169,"Private Provider Reporting on Behalf of a Public Entity","Full Reporter",3629114,397,null,0,"",0,"",0,"",0,"",0,"",0,"",0,"",null,0,"",0,"",0,"",null,0,"",0,"",0,"",0,"","No"]
["City of Los Angeles Department of Transportation","Los Angeles","CA",9147,90147,"City, County or Local Government Unit or Department of Transportation","Full Reporter",12150996,369,null,0,"",0,"",0,"",0,"",0,"",0,"",0,"",null,0,"",0,"",0,"",null,0,"",35.1,"",0,"",35.1,"","No"]
["Transportation District Commission of Hampton Roads","Hampton","VA",3083,30083,"Independent Public Agency or Authority of Transit Service","Full Reporter",1439666,368,null,4.2,"",1.9,"",1.3,"",0,"",0,"",0,"",7.4,"",null,14,"",8,"",22,"",null,0,"",0,"",72.8,"",72.8,"","No"]
["San Mateo County Transit District","San Carlos","CA",9009,90009,"Independent Public Agency or Authority of Transit Service","Full Reporter",3281212,363,null,0,"",0,"",0,"",0,"",0,"",0,"",0,"",null,0,"",0,"",0,"",null,0,"",0,"",0,"",0,"","No"]
["Central Ohio Transit Authority","Columbus","OH",5016,50016,"Independent Public Agency or Authority of Transit Service","Full Reporter",1368035,361,null,0,"",0,"",0,"",0,"",0,"",0,"",0,"",null,0,"",0,"",0,"",null,0,"",0,"",0,"",0,"","No"]
["Nassau Inter County Express","Garden City","NY",2206,20206,"City, County or Local Government Unit or Department of Transportation","Full Reporter",18351295,353,null,0,"",0,"",0,"",0,"",0,"",0,"",0,"",null,0,"",0,"",0,"",null,0,"",0,"",0,"",0,"","No"]
["Niagara Frontier Transportation Authority","Buffalo","NY",2004,20004,"Independent Public Agency or Authority of Transit Service","Full Reporter",935906,351,null,3.3,"",0.4,"",0,"",0,"",0,"",10.4,"",14.100000000000001,"",null,0,"",8,"",8,"",null,0,"",0,"",0,"",0,"","No"]
["Southwest Ohio Regional Transit Authority","Cincinnati","OH",5012,50012,"City, County or Local Government Unit or Department of Transportation","Full Reporter",1624827,346,null,0,"",0,"",0,"",0,"",0,"",0,"",0,"",null,0,"",0,"",0,"",null,0.1,"",0,"",0,"",0.1,"","No"]
["Westchester County Bee-Line System","Mount Vernon","NY",2076,20076,"City, County or Local Government Unit or Department of Transportation","Full Reporter",18351295,343,null,0,"",0,"",0,"",0,"",0,"",0,"",0,"",null,0,"",0,"",0,"",null,0,"",0,"",0,"",0,"",{"$f":"IF(OR(L66=\"Q\",N66=\"Q\",P66=\"Q\",R66=\"Q\",T66=\"Q\",V66=\"Q\",X66=\"Q\",AA66=\"Q\",AC66=\"Q\",AE66=\"Q\",AH66=\"Q\",AJ66=\"Q\",AL66=\"Q\",AN66=\"Q\"),\"Yes\",\"No\")","v":"No"}]
["City of Tucson","Tucson   ","AZ",9033,90033,"City, County or Local Government Unit or Department of Transportation","Full Reporter",843168,338,null,0.2,"",3.7,"",0,"",0,"",0,"",0,"",3.9000000000000004,"",null,2,"",40,"",42,"",null,0,"",0,"",0,"",0,"","No"]
["Central Puget Sound Regional Transit Authority","Seattle","WA",40,40,"Independent Public Agency or Authority of Transit Service","Full Reporter",3059393,336,null,177.6,"",1,"",13.399999999999999,"",0,"",0.6,"",7.5,"",200.1,"",null,113,"",4,"",117,"",null,4.0999999999999996,"",181.6,"",91.300000000000011,"",277,"","No"]
["Cape Cod Regional Transit Authority","Hyannis","MA",1105,10105,"Independent Public Agency or Authority of Transit Service","Full Reporter",246695,335,null,0,"",0,"",0,"",0,"",0,"",0,"",0,"",null,0,"",0,"",0,"",null,0,"",0,"",0,"",0,"","No"]
["Greater Richmond Transit Company","Richmond","VA",3006,30006,"Other Publicly-Owned or Privately Chartered Corporation","Full Reporter",953556,328,null,0,"",0,"",0,"",0,"",0,"",0,"",0,"",null,0,"",0,"",0,"",null,0,"",0,"",0,"",0,"","No"]
["Lane Transit District","Eugene","OR",7,7,"Independent Public Agency or Authority of Transit Service","Full Reporter",247421,325,null,0,"",0,"",0,"",0,"",0,"",0,"",0,"",null,0,"",0,"",0,"",null,10.1,"",0,"",0,"",10.1,"","No"]
["Suburban Mobility Authority for Regional Transportation","Detroit","MI",5031,50031,"Independent Public Agency or Authority of Transit Service","Full Reporter",3734090,317,null,0,"",0,"",0,"",0,"",0,"",0,"",0,"",null,0,"",0,"",0,"",null,0,"",0,"",0,"",0,"","No"]
["Transit Authority of River City","Louisville","KY",4018,40018,"Independent Public Agency or Authority of Transit Service","Full Reporter",972546,315,null,0,"",0,"",0,"",0,"",0,"",0,"",0,"",null,0,"",0,"",0,"",null,0,"",0,"",0,"",0,"","No"]
["Spokane Transit Authority","Spokane","WA",2,2,"Independent Public Agency or Authority of Transit Service","Full Reporter",387847,311,null,0,"",0,"",0,"",0,"",0,"",0,"",0,"",null,0,"",0,"",0,"",null,0,"",0,"",0,"",0,"","No"]
["Intercity Transit","Olympia","WA",19,19,"Independent Public Agency or Authority of Transit Service","Full Reporter",176617,310,null,0,"",0,"",0,"",0,"",0,"",0,"",0,"",null,0,"",0,"",0,"",null,0,"",0,"",0,"",0,"","No"]
["Pinellas Suncoast Transit Authority","St. Petersburg","FL",4027,40027,"Independent Public Agency or Authority of Transit Service","Full Reporter",2441770,308,null,0,"",0,"",0,"",0,"",0,"",0,"",0,"",null,0,"",0,"",0,"",null,0,"",0,"",1.1000000000000001,"",1.1000000000000001,"","No"]
["Port Authority Trans-Hudson Corporation","Jersey City","NJ",2098,20098,"Independent Public Agency or Authority of Transit Service","Full Reporter",18351295,304,null,12.7,"",0,"",3.3,"",5,"",5.2,"",16.899999999999999,"",43.099999999999994,"",null,2,"",0,"",2,"",null,0,"",0,"",0,"",0,"","No"]
["Rhode Island Public Transit Authority","Providence","RI",1001,10001,"Independent Public Agency or Authority of Transit Service","Full Reporter",1190956,304,null,0,"",0,"",0,"",0,"",0,"",0,"",0,"",null,0,"",0,"",0,"",null,1.6,"",0,"",0,"",1.6,"","No"]
["Capital Area Transit","Raleigh","NC",4007,40007,"City, County or Local Government Unit or Department of Transportation","Full Reporter",884891,298,null,0,"",0,"",0,"",0,"",0,"",0,"",0,"",null,0,"",0,"",0,"",null,0,"",0,"",0,"",0,"","No"]
["Kansas City Area Transportation Authority","Kansas City","MO",7005,70005,"Independent Public Agency or Authority of Transit Service","Full Reporter",1519417,295,null,0,"",0,"",0,"",0,"",0,"",0,"",0,"",null,0,"",0,"",0,"",null,1,"",0,"",14.1,"",15.1,"","No"]
["Suffolk County Department of Public Works - Transportation Division","Yaphank","NY",2072,20072,"City, County or Local Government Unit or Department of Transportation","Full Reporter",18351295,291,null,0,"",0,"",0,"",0,"",0,"",0,"",0,"",null,0,"",0,"",0,"",null,0,"",0,"",46.9,"",46.9,"","No"]
["Ride-On Montgomery County Transit","Rockville","MD",3051,30051,"City, County or Local Government Unit or Department of Transportation","Full Reporter",4586770,282,null,0,"",0,"",0,"",0,"",0,"",0,"",0,"",null,0,"",0,"",0,"",null,0,"",0,"",0,"",0,"","No"]
["Foothill Transit","West Covina","CA",9146,90146,"Independent Public Agency or Authority of Transit Service","Full Reporter",12150996,278,null,0,"",0,"",0,"",0,"",0,"",0,"",0,"",null,0,"",0,"",0,"",null,1.5,"",0,"",62.3,"",63.8,"","No"]
["Metropolitan Transit Authority","Nashville","TN",4004,40004,"Independent Public Agency or Authority of Transit Service","Full Reporter",969587,269,null,0,"",0,"",0,"",0,"",0,"",0,"",0,"",null,0,"",0,"",0,"",null,0,"",0,"",0,"",0,"","No"]
["Salem Area Mass Transit District","Salem","OR",25,25,"Independent Public Agency or Authority of Transit Service","Full Reporter",236632,269,null,0,"",0,"",0,"",0,"",0,"",0,"",0,"",null,0,"",0,"",0,"",null,0,"",0,"",0,"",0,"","No"]
["vRide, Inc. - Atlanta","Atlanta","GA",4153,40153,"Private Provider Reporting on Behalf of a Public Entity","Full Reporter",4515419,267,null,0,"",0,"",0,"",0,"",0,"",0,"",0,"",null,0,"",0,"",0,"",null,0,"",0,"",0,"",0,"","No"]
["Kitsap Transit","Bremerton","WA",20,20,"Independent Public Agency or Authority of Transit Service","Full Reporter",198979,266,null,0,"",0,"",0,"",0,"",0,"",0,"",0,"",null,0,"",0,"",0,"",null,0,"",0,"",0,"",0,"","No"]
["Riverside Transit Agency","Riverside","CA",9031,90031,"Independent Public Agency or Authority of Transit Service","Full Reporter",1932666,260,null,0,"",0,"",0,"",0,"",0,"",0,"",0,"",null,0,"",0,"",0,"",null,0,"",0,"",0,"",0,"","No"]
["Regional Transit Service, Inc. and Lift Line, Inc.","Rochester","NY",2113,20113,"Independent Public Agency or Authority of Transit Service","Full Reporter",720572,256,null,0,"",0,"",0,"",0,"",0,"",0,"",0,"",null,0,"",0,"",0,"",null,0,"",0,"",0,"",0,"","No"]
["Pioneer Valley Transit Authority","Springfield","MA",1008,10008,"Independent Public Agency or Authority of Transit Service","Full Reporter",621300,254,null,0,"",0,"",0,"",0,"",0,"",0,"",0,"",null,0,"",0,"",0,"",null,0,"",0,"",0,"",0,"","No"]
["Metro Transit System","Madison","WI",5005,50005,"City, County or Local Government Unit or Department of Transportation","Full Reporter",401661,254,null,0,"",0,"",0,"",0,"",0,"",0,"",0,"",null,0,"",0,"",0,"",null,12.5,"",0,"",0,"",12.5,"","No"]
["Omnitrans","San Bernardino","CA",9029,90029,"Independent Public Agency or Authority of Transit Service","Full Reporter",1932666,248,null,0,"",0,"",0,"",0,"",0,"",0,"",0,"",null,0,"",0,"",0,"",null,5.4,"",0,"",0,"",5.4,"","No"]
["Miami Lakes - vRide, Inc.","Miami Lakes","FL",4152,40152,"Private Provider Reporting on Behalf of a Public Entity","Full Reporter",5502379,246,null,0,"",0,"",0,"",0,"",0,"",0,"",0,"",null,0,"",0,"",0,"",null,0,"",0,"",0,"",0,"","No"]
["Jacksonville Transportation Authority","Jacksonville","FL",4040,40040,"Independent Public Agency or Authority of Transit Service","Full Reporter",1065219,246,null,0,"",0,"",5.4,"",0,"",0,"",0,"",5.4,"",null,0,"",0,"",0,"",null,0,"",0,"",0,"",0,"","No"]
["Interurban Transit Partnership","Grand Rapids","MI",5033,50033,"Independent Public Agency or Authority of Transit Service","Full Reporter",569935,246,null,0,"",0,"",0,"",0,"",0,"",0,"",0,"",null,0,"",0,"",0,"",null,9.5,"",0,"",0,"",9.5,"","No"]
["Victor Valley Transit Authority","Hesperia","CA",9148,90148,"Independent Public Agency or Authority of Transit Service","Full Reporter",328454,245,null,0,"",0,"",0,"",0,"",0,"",0,"",0,"",null,0,"",0,"",0,"",null,0,"",0,"",0,"",0,"","No"]
["Capital District Transportation Authority","Albany","NY",2002,20002,"Independent Public Agency or Authority of Transit Service","Full Reporter",594962,239,null,0,"",0,"",0,"",0,"",0,"",0,"",0,"",null,0,"",0,"",0,"",null,0,"",0,"",0,"",0,"","No"]
["Connecticut Department of Transportation - CTTRANSIT - Hartford Division","Hartford","CT",1048,10048,"State Government Unit or Department of Transportation","Full Reporter",924859,233,null,0,"",0,"",0,"",0,"",0,"",0,"",0,"",null,0,"",0,"",0,"",null,36.4,"",28.8,"",0,"",65.2,"","No"]
["Des Moines Area Regional Transit Authority","Des Moines","IA",7010,70010,"Independent Public Agency or Authority of Transit Service","Full Reporter",450070,231,null,0,"",0,"",0,"",0,"",0,"",0,"",0,"",null,0,"",0,"",0,"",null,0,"",0,"",0,"",0,"","No"]
["North County Transit District","Oceanside","CA",9030,90030,"Independent Public Agency or Authority of Transit Service","Full Reporter",2956746,230,null,129.29999999999998,"",0,"",2.6,"",0,"",1.6,"",0,"",133.49999999999997,"",null,78,"",0,"",78,"",null,0,"",0,"",0,"",0,"","No"]
["Greater Hartford Ridesharing Corporation - The Rideshare Company","Bloomfield","CT",1108,10108,"Independent Public Agency or Authority of Transit Service","Full Reporter",924859,228,null,0,"",0,"",0,"",0,"",0,"",0,"",0,"",null,0,"",0,"",0,"",null,0,"",0,"",0,"",0,"","No"]
["Academy Lines, Inc.","Hoboken","NJ",2122,20122,"Private-For-Profit Corporation","Full Reporter",18351295,225,null,0,"",0,"",0,"",0,"",0,"",0,"",0,"",null,0,"",0,"",0,"",null,0,"",0,"",2.9,"",2.9,"","No"]
["Metropolitan Council","St. Paul","MN",5154,50154,"City, County or Local Government Unit or Department of Transportation","Full Reporter",2650890,223,null,0,"",0,"",0,"",0,"",0,"",0,"",0,"",null,0,"",0,"",0,"",null,1.4,"",26.5,"",17.600000000000001,"",45.5,"","No"]
["Sacramento Regional Transit District","Sacramento","CA",9019,90019,"Independent Public Agency or Authority of Transit Service","Full Reporter",1723634,222,null,62.6,"",7.9,"",2.6,"",2,"",0,"",0,"",75.099999999999994,"",null,59,"",74,"",133,"",null,0,"",0,"",0,"",0,"","No"]
["Fairfax Connector Bus System","Fairfax","VA",3068,30068,"City, County or Local Government Unit or Department of Transportation","Full Reporter",4586770,221,null,0,"",0,"",0,"",0,"",0,"",0,"",0,"",null,0,"",0,"",0,"",null,0,"",0,"",69.5,"",69.5,"","No"]
["Blue Water Area Transportation Commission","Port Huron","MI",5148,50148,"Independent Public Agency or Authority of Transit Service","Full Reporter",87106,209,null,0,"",0,"",0,"",0,"",0,"",0,"",0,"",null,0,"",0,"",0,"",null,0,"",0,"",0,"",0,"","No"]
["METRO Regional Transit Authority ","Akron","OH",5010,50010,"Independent Public Agency or Authority of Transit Service","Full Reporter",569499,209,null,0,"",0,"",0,"",0,"",0,"",0,"",0,"",null,0,"",0,"",0,"",null,0,"",0,"",0,"",0,"","No"]
["Fort Worth Transportation Authority","Fort Worth","TX",6007,60007,"Independent Public Agency or Authority of Transit Service","Full Reporter",5121892,207,null,0,"",0,"",0,"",0,"",0,"",0,"",0,"",null,0,"",0,"",0,"",null,0,"",0,"",0,"",0,"","No"]
["Long Beach Transit","Long Beach","CA",9023,90023,"Other Publicly-Owned or Privately Chartered Corporation","Full Reporter",12150996,202,null,0,"",0,"",0,"",0,"",0,"",0,"",0,"",null,0,"",0,"",0,"",null,0.5,"",0,"",0,"",0.5,"","No"]
["Hillsborough Area Regional Transit Authority","Tampa","FL",4041,40041,"Independent Public Agency or Authority of Transit Service","Full Reporter",2441770,201,null,3.5,"",0,"",0,"",0,"",0,"",0,"",3.5,"",null,23,"",0,"",23,"",null,0,"",0,"",1.1000000000000001,"",1.1000000000000001,"","No"]
["Indianapolis and Marion County Public Transportation","Indianapolis","IN",5050,50050,"Independent Public Agency or Authority of Transit Service","Full Reporter",1487483,194,null,0,"",0,"",0,"",0,"",0,"",0,"",0,"",null,0,"",0,"",0,"",null,0,"",0,"",0,"",0,"","No"]
["Southern California Regional Rail Authority dba: Metrolink","Los Angeles","CA",9151,90151,"Independent Public Agency or Authority of Transit Service","Full Reporter",12150996,192,null,653.1,"",0,"",2.4,"",0.3,"",0,"",0,"",655.80000000000007,"",null,423,"",0,"",423,"",null,0,"",0,"",0,"",0,"","No"]
["Mass Transit Department - City of El Paso","El Paso","TX",6006,60006,"City, County or Local Government Unit or Department of Transportation","Full Reporter",803086,187,null,0,"",0,"",0,"",0,"",0,"",0,"",0,"",null,0,"",0,"",0,"",null,0,"",0,"",0,"",0,"","No"]
["City of Albuquerque Transit Department","Albuquerque","NM",6019,60019,"City, County or Local Government Unit or Department of Transportation","Full Reporter",741318,187,null,0,"",0,"",0,"",0,"",0,"",0,"",0,"",null,0,"",0,"",0,"",null,0,"",0,"",0,"",0,"","No"]
["Mass Transportation Authority ","Flint","MI",5032,50032,"Independent Public Agency or Authority of Transit Service","Full Reporter",356218,185,null,0,"",0,"",0,"",0,"",0,"",0,"",0,"",null,0,"",0,"",0,"",null,0,"",0,"",0,"",0,"","No"]
["Regional Transportation Commission of Washoe County","Reno","NV",9001,90001,"Independent Public Agency or Authority of Transit Service","Full Reporter",392141,181,null,0,"",0,"",0,"",0,"",0,"",0,"",0,"",null,0,"",0,"",0,"",null,0.5,"",0,"",0,"",0.5,"","No"]
["Greater Dayton Regional Transit Authority","Dayton","OH",5017,50017,"Independent Public Agency or Authority of Transit Service","Full Reporter",724091,178,null,0,"",0,"",0,"",0,"",0,"",0,"",0,"",null,0,"",0,"",0,"",null,125.7,"",0,"",0,"",125.7,"","No"]
["New Orleans Regional Transit Authority","New Orleans","LA",6032,60032,"Independent Public Agency or Authority of Transit Service","Full Reporter",899703,178,null,18.600000000000001,"",0,"",0,"",0,"",0,"",0,"",18.600000000000001,"",null,247,"",0,"",247,"",null,0,"",7,"",0,"",7,"","No"]
["Toledo Area Regional Transit Authority","Toledo","OH",5022,50022,"Independent Public Agency or Authority of Transit Service","Full Reporter",507643,177,null,0,"",0,"",0,"",0,"",0,"",0,"",0,"",null,0,"",0,"",0,"",null,0,"",0,"",1,"",1,"","No"]
["Capital Area Transportation Authority","Lansing","MI",5036,50036,"Independent Public Agency or Authority of Transit Service","Full Reporter",313532,172,null,0,"",0,"",0,"",0,"",0,"",0,"",0,"",null,0,"",0,"",0,"",null,0,"",0,"",0,"",0,"","No"]
["Clark County Public Transportation Benefit Area Authority","Vancouver","WA",24,24,"Independent Public Agency or Authority of Transit Service","Full Reporter",1849898,171,null,0,"",0,"",0,"",0,"",0,"",0,"",0,"",null,0,"",0,"",0,"",null,0,"",0,"",3.4,"",3.4,"","No"]
["Ft.Worth - vRide, Inc.","Arlington","TX",6084,60084,"Private Provider Reporting on Behalf of a Public Entity","Full Reporter",5121892,170,null,0,"",0,"",0,"",0,"",0,"",0,"",0,"",null,0,"",0,"",0,"",null,0,"",0,"",0,"",0,"","No"]
["Montachusett Regional Transit Authority","Fitchburg","MA",1061,10061,"Independent Public Agency or Authority of Transit Service","Full Reporter",116960,169,null,0,"",0,"",0,"",0,"",0,"",0,"",0,"",null,0,"",0,"",0,"",null,0,"",0,"",0,"",0,"","No"]
["Lehigh and Northampton Transportation Authority","Allentown","PA",3010,30010,"Independent Public Agency or Authority of Transit Service","Full Reporter",664651,165,null,0,"",0,"",0,"",0,"",0,"",0,"",0,"",null,0,"",0,"",0,"",null,0,"",0,"",0,"",0,"","No"]
["Research Triangle Regional Public Transportation Authority","Research Triangle Park","NC",4108,40108,"Independent Public Agency or Authority of Transit Service","Full Reporter",347602,164,null,0,"",0,"",0,"",0,"",0,"",0,"",0,"",null,0,"",0,"",0,"",null,0,"",0,"",0,"",0,"","No"]
["Santa Monica's Big Blue Bus","Santa Monica","CA",9008,90008,"City, County or Local Government Unit or Department of Transportation","Full Reporter",12150996,163,null,0,"",0,"",0,"",0,"",0,"",0,"",0,"",null,0,"",0,"",0,"",null,0.6,"",0,"",0,"",0.6,"","No"]
["CNY Centro, Inc. ","Syracuse","NY",2018,20018,"Subsidiary Unit of a Transit Agency, Reporting Separately","Full Reporter",412317,162,null,0,"",0,"",0,"",0,"",0,"",0,"",0,"",null,0,"",0,"",0,"",null,0,"",0,"",0,"",0,"","No"]
["Mountain Metropolitan Transit","Colorado Springs","CO",8005,80005,"City, County or Local Government Unit or Department of Transportation","Full Reporter",559409,161,null,0,"",0,"",0,"",0,"",0,"",0,"",0,"",null,0,"",0,"",0,"",null,0,"",0,"",0,"",0,"","No"]
["Hudson Transit Lines, Inc.","Mahwah","NJ",2126,20126,"Private-For-Profit Corporation","Full Reporter",18351295,161,null,0,"",0,"",0,"",0,"",0,"",0,"",0,"",null,0,"",0,"",0,"",null,0,"",0,"",2.9,"",2.9,"","No"]
["Madison County Transit District","Granite City","IL",5146,50146,"Independent Public Agency or Authority of Transit Service","Full Reporter",2150706,157,null,0,"",0,"",0,"",0,"",0,"",0,"",0,"",null,0,"",0,"",0,"",null,0,"",0,"",0,"",0,"",{"$f":"IF(OR(L130=\"Q\",N130=\"Q\",P130=\"Q\",R130=\"Q\",T130=\"Q\",V130=\"Q\",X130=\"Q\",AA130=\"Q\",AC130=\"Q\",AE130=\"Q\",AH130=\"Q\",AJ130=\"Q\",AL130=\"Q\",AN130=\"Q\"),\"Yes\",\"No\")","v":"No"}]
["Wichita Transit","Wichita","KS",7015,70015,"City, County or Local Government Unit or Department of Transportation","Full Reporter",472870,156,null,0,"",0,"",0,"",0,"",0,"",0,"",0,"",null,0,"",0,"",0,"",null,0,"",0,"",0,"",0,"","No"]
["Ann Arbor Area Transportation Authority","Ann Arbor","MI",5040,50040,"Independent Public Agency or Authority of Transit Service","Full Reporter",306022,154,null,0,"",0,"",0,"",0,"",0,"",0,"",0,"",null,0,"",0,"",0,"",null,0,"",0,"",0,"",0,"","No"]
["Space Coast Area Transit","Cocoa","FL",4063,40063,"City, County or Local Government Unit or Department of Transportation","Full Reporter",452791,154,null,0,"",0,"",0,"",0,"",0,"",0,"",0,"",null,0,"",0,"",0,"",null,0,"",0,"",0,"",0,"","No"]
["Memphis Area Transit Authority","Memphis","TN",4003,40003,"City, County or Local Government Unit or Department of Transportation","Full Reporter",1060061,150,null,3.2,"",7,"",0.1,"",0.2,"",0,"",0,"",10.5,"",null,0,"",0,"",0,"",null,0,"",0,"",0,"",0,"","No"]
["Central Contra Costa Transit Authority","Concord","CA",9078,90078,"Independent Public Agency or Authority of Transit Service","Full Reporter",615968,143,null,0,"",0,"",0,"",0,"",0,"",0,"",0,"",null,0,"",0,"",0,"",null,0,"",0,"",0,"",0,"","No"]
["Gainesville Regional Transit System","Gainesville","FL",4030,40030,"City, County or Local Government Unit or Department of Transportation","Full Reporter",187781,142,null,0,"",0,"",0,"",0,"",0,"",0,"",0,"",null,0,"",0,"",0,"",null,0,"",0,"",0,"",0,"","No"]
["Paratransit, Inc.","Sacramento","CA",9223,90223,"Private-Non-Profit Corporation","Full Reporter",1723634,142,null,0,"",0,"",0,"",0,"",0,"",0,"",0,"",null,0,"",0,"",0,"",null,0,"",0,"",0,"",0,"","No"]
["Golden Gate Bridge, Highway and Transportation District","San Francisco","CA",9016,90016,"Independent Public Agency or Authority of Transit Service","Full Reporter",3281212,141,null,0,"",0,"",0,"",0,"",0,"",0,"",0,"",null,0,"",0,"",0,"",null,0,"",0,"",58.1,"",58.1,"","No"]
["York County Transportation Authority","York","PA",3027,30027,"Independent Public Agency or Authority of Transit Service","Full Reporter",232045,135,null,0,"",0,"",0,"",0,"",0,"",0,"",0,"",null,0,"",0,"",0,"",null,0,"",0,"",0,"",0,"","No"]
["Peninsula Corridor Joint Powers Board dba: Caltrain","San Carlos","CA",9134,90134,"Independent Public Agency or Authority of Transit Service","Full Reporter",3281212,134,null,127.7,"",0,"",4,"",4,"",1,"",0,"",136.69999999999999,"",null,54,"",0,"",54,"",null,0,"",0,"",0,"",0,"","No"]
["Fresno Area Express","Fresno","CA",9027,90027,"City, County or Local Government Unit or Department of Transportation","Full Reporter",654628,130,null,0,"",0,"",0,"",0,"",0,"",0,"",0,"",null,0,"",0,"",0,"",null,0,"",0,"",0,"",0,"","No"]
["Minnesota Valley Transit Authority","Burnsville","MN",5222,50519,"Independent Public Agency or Authority of Transit Service","Full Reporter",2650890,127,null,0,"",0,"",0,"",0,"",0,"",0,"",0,"",null,0,"",0,"",0,"",null,2.5,"",43,"",45,"",90.5,"","No"]
["Transit Authority of Omaha","Omaha","NE",7002,70002,"Independent Public Agency or Authority of Transit Service","Full Reporter",725008,125,null,0,"",0,"",0,"",0,"",0,"",0,"",0,"",null,0,"",0,"",0,"",null,0,"",0,"",0,"",0,"","No"]
["Metropolitan Bus Authority","San Juan","PR",4086,40086,"Independent Public Agency or Authority of Transit Service","Full Reporter",2148346,125,null,0,"",0,"",0,"",0,"",0,"",0,"",0,"",null,0,"",0,"",0,"",null,17.100000000000001,"",0,"",0,"",17.100000000000001,"","No"]
["County of Volusia, dba: VOTRAN","South Daytona","FL",4032,40032,"City, County or Local Government Unit or Department of Transportation","Full Reporter",349064,125,null,0,"",0,"",0,"",0,"",0,"",0,"",0,"",null,0,"",0,"",0,"",null,0,"",0,"",0,"",0,"","No"]
["vRide, Inc. - Denver","Denver","CO",8109,80109,"Private Provider Reporting on Behalf of a Public Entity","Full Reporter",2374203,120,null,0,"",0,"",0,"",0,"",0,"",0,"",0,"",null,0,"",0,"",0,"",null,0,"",0,"",0,"",0,"","No"]
["Lexington Transit Authority","Lexington","KY",4017,40017,"Independent Public Agency or Authority of Transit Service","Full Reporter",290263,120,null,0,"",0,"",0,"",0,"",0,"",0,"",0,"",null,0,"",0,"",0,"",null,0,"",0,"",0,"",0,"","No"]
["Champaign-Urbana Mass Transit District","Urbana","IL",5060,50060,"Independent Public Agency or Authority of Transit Service","Full Reporter",145361,119,null,0,"",0,"",0,"",0,"",0,"",0,"",0,"",null,0,"",0,"",0,"",null,0,"",0,"",0,"",0,"","No"]
["Santa Cruz Metropolitan Transit District","Santa Cruz","CA",9006,90006,"Independent Public Agency or Authority of Transit Service","Full Reporter",163703,118,null,0,"",0,"",0,"",0,"",0,"",0,"",0,"",null,0,"",0,"",0,"",null,0,"",0,"",0,"",0,"","No"]
["Cobb County Department of Transportation Authority","Marietta","GA",4078,40078,"City, County or Local Government Unit or Department of Transportation","Full Reporter",4515419,118,null,0,"",0,"",0,"",0,"",0,"",0,"",0,"",null,0,"",0,"",0,"",null,0,"",0,"",19.5,"",19.5,"","No"]
["Brazos Transit District","Bryan","TX",6059,60059,"Independent Public Agency or Authority of Transit Service","Full Reporter",171345,118,null,0,"",0,"",0,"",0,"",0,"",0,"",0,"",null,0,"",0,"",0,"",null,0,"",0,"",0,"",0,"","No"]
["Rides Mass Transit District","Harrisburg","IL",5211,50211,"Independent Public Agency or Authority of Transit Service","Full Reporter",67821,117,null,0,"",0,"",0,"",0,"",0,"",0,"",0,"",null,0,"",0,"",0,"",null,0,"",0,"",0,"",0,"","No"]
["Erie Metropolitan Transit Authority","Erie","PA",3013,30013,"Independent Public Agency or Authority of Transit Service","Full Reporter",196611,116,null,0,"",0,"",0,"",0,"",0,"",0,"",0,"",null,0,"",0,"",0,"",null,0,"",0,"",0,"",0,"","No"]
["Prince George's County Transit","Largo","MD",3085,30085,"City, County or Local Government Unit or Department of Transportation","Full Reporter",4586770,116,null,0,"",0,"",0,"",0,"",0,"",0,"",0,"",null,0,"",0,"",0,"",null,0,"",0,"",0,"",0,"","No"]
["Hill Country Transit District","San Saba","TX",6091,60091,"Independent Public Agency or Authority of Transit Service","Full Reporter",217630,115,null,0,"",0,"",0,"",0,"",0,"",0,"",0,"",null,0,"",0,"",0,"",null,0,"",0,"",0,"",0,"","No"]
["Greater Hartford Transit District","Hartford","CT",1017,10017,"Independent Public Agency or Authority of Transit Service","Full Reporter",924859,114,null,0,"",0,"",0,"",0,"",0,"",0,"",0,"",null,0,"",0,"",0,"",null,0,"",0,"",0,"",0,"","No"]
["Greater Attleboro-Taunton Regional Transit Authority","Taunton","MA",1064,10064,"Independent Public Agency or Authority of Transit Service","Full Reporter",1190956,113,null,0,"",0,"",0,"",0,"",0,"",0,"",0,"",null,0,"",0,"",0,"",null,0,"",0,"",0,"",0,"","No"]
["Centre Area Transportation Authority","State College","PA",3054,30054,"Independent Public Agency or Authority of Transit Service","Full Reporter",87454,113,null,0,"",0,"",0,"",0,"",0,"",0,"",0,"",null,0,"",0,"",0,"",null,0,"",0,"",0,"",0,"","No"]
["Cumberland Dauphin-Harrisburg Transit Authority","Harrisburg","PA",3014,30014,"Independent Public Agency or Authority of Transit Service","Full Reporter",444474,113,null,0,"",0,"",0,"",0,"",0,"",0,"",0,"",null,0,"",0,"",0,"",null,0,"",0,"",0,"",0,"","No"]
["Transit Authority of Northern Kentucky","Fort Wright","KY",4019,40019,"Independent Public Agency or Authority of Transit Service","Full Reporter",1624827,109,null,0,"",0,"",0,"",0,"",0,"",0,"",0,"",null,0,"",0,"",0,"",null,0,"",0,"",0,"",0,"","No"]
["Whatcom Transportation Authority","Bellingham","WA",21,21,"Independent Public Agency or Authority of Transit Service","Full Reporter",114473,107,null,0,"",0,"",0,"",0,"",0,"",0,"",0,"",null,0,"",0,"",0,"",null,0,"",0,"",0,"",0,"","No"]
["Marin County Transit District","San Rafael","CA",9234,90234,"Independent Public Agency or Authority of Transit Service","Full Reporter",3281212,107,null,0,"",0,"",0,"",0,"",0,"",0,"",0,"",null,0,"",0,"",0,"",null,0,"",0,"",0,"",0,"","No"]
["Montebello Bus Lines","Montebello","CA",9041,90041,"City, County or Local Government Unit or Department of Transportation","Full Reporter",12150996,104,null,0,"",0,"",0,"",0,"",0,"",0,"",0,"",null,0,"",0,"",0,"",null,0,"",0,"",0,"",0,"","No"]
["Lee County Transit","Fort Myers","FL",4028,40028,"City, County or Local Government Unit or Department of Transportation","Full Reporter",530290,104,null,0,"",0,"",0,"",0,"",0,"",0,"",0,"",null,0,"",0,"",0,"",null,0,"",0,"",0,"",0,"","No"]
["Monterey-Salinas Transit","Monterey","CA",9062,90062,"Independent Public Agency or Authority of Transit Service","Full Reporter",114237,103,null,0,"",0,"",0,"",0,"",0,"",0,"",0,"",null,0,"",0,"",0,"",null,0,"",0,"",0,"",0,"","No"]
["Westmoreland County Transit Authority","Greensburg","PA",3044,30044,"City, County or Local Government Unit or Department of Transportation","Full Reporter",1733853,103,null,0,"",0,"",0,"",0,"",0,"",0,"",0,"",null,0,"",0,"",0,"",null,13.6,"",0,"",0,"",13.6,"","No"]
["San Joaquin Regional Transit District","Stockton","CA",9012,90012,"Independent Public Agency or Authority of Transit Service","Full Reporter",370583,102,null,0,"",0,"",0,"",0,"",0,"",0,"",0,"",null,0,"",0,"",0,"",null,0,"",0,"",0,"",0,"","No"]
["Corpus Christi Regional Transportation Authority","Corpus Christi","TX",6051,60051,"Independent Public Agency or Authority of Transit Service","Full Reporter",320069,102,null,0,"",0,"",0,"",0,"",0,"",0,"",0,"",null,0,"",0,"",0,"",null,0,"",0,"",0,"",0,"","No"]
["Georgia Regional Transportation Authority","Atlanta","GA",4135,40135,"State Government Unit or Department of Transportation","Full Reporter",4515419,101,null,0,"",0,"",0,"",0,"",0,"",0,"",0,"",null,0,"",0,"",0,"",null,0,"",91.2,"",0,"",91.2,"","No"]
["Sarasota County Area Transit","Sarasota","FL",4046,40046,"City, County or Local Government Unit or Department of Transportation","Full Reporter",643260,100,null,0,"",0,"",0,"",0,"",0,"",0,"",0,"",null,0,"",0,"",0,"",null,0,"",0,"",0,"",0,"","No"]
["Charleston Area Regional Transportation Authority","Charleston","SC",4110,40110,"Independent Public Agency or Authority of Transit Service","Full Reporter",548404,100,null,0,"",0,"",0,"",0,"",0,"",0,"",0,"",null,0,"",0,"",0,"",null,0,"",0,"",0,"",0,"","No"]
["Berks Area Regional Transportation Authority","Reading","PA",3024,30024,"Independent Public Agency or Authority of Transit Service","Full Reporter",266254,99,null,0,"",0,"",0,"",0,"",0,"",0,"",0,"",null,0,"",0,"",0,"",null,0,"",0,"",0,"",0,"","No"]
["Suburban Transit Corporation","New Brunswick","NJ",2128,20128,"Private-For-Profit Corporation","Full Reporter",18351295,98,null,0,"",0,"",0,"",0,"",0,"",0,"",0,"",null,0,"",0,"",0,"",null,0,"",0,"",2.9,"",2.9,"","No"]
["Tampa Bay Area Regional Transportation Authority","Tampa","FL",4200,40200,"Independent Public Agency or Authority of Transit Service","Full Reporter",2441770,98,null,0,"",0,"",0,"",0,"",0,"",0,"",0,"",null,0,"",0,"",0,"",null,0,"",0,"",0,"",0,"","No"]
["Connecticut Department of Transportation - CTTRANSIT New Haven Division","Hartford","CT",1055,10055,"State Government Unit or Department of Transportation","Full Reporter",562839,97,null,0,"",0,"",0,"",0,"",0,"",0,"",0,"",null,0,"",0,"",0,"",null,0,"",0,"",0,"",0,"","No"]
["City of Alexandria ","Alexandria","VA",3071,30071,"City, County or Local Government Unit or Department of Transportation","Full Reporter",4586770,97,null,0,"",0,"",0,"",0,"",0,"",0,"",0,"",null,0,"",0,"",0,"",null,0,"",0,"",3.7,"",3.7,"","No"]
["Metropolitan Tulsa Transit Authority","Tulsa","OK",6018,60018,"City, County or Local Government Unit or Department of Transportation","Full Reporter",655479,96,null,0,"",0,"",0,"",0,"",0,"",0,"",0,"",null,0,"",0,"",0,"",null,0,"",0,"",0,"",0,"","No"]
["Red Rose Transit Authority","Lancaster","PA",3018,30018,"Independent Public Agency or Authority of Transit Service","Full Reporter",402004,95,null,0,"",0,"",0,"",0,"",0,"",0,"",0,"",null,0,"",0,"",0,"",null,0,"",0,"",0,"",0,"","No"]
["Denton County Transportation Authority","Lewisville","TX",6101,60101,"Independent Public Agency or Authority of Transit Service","Full Reporter",366174,94,null,27.9,"",0,"",0.8,"",0,"",0,"",0,"",28.7,"",null,43,"",0,"",43,"",null,0,"",0,"",0,"",0,"","No"]
["MetroWest Regional Transit Authority","Framingham","MA",1118,10118,"Independent Public Agency or Authority of Transit Service","Full Reporter",4181019,93,null,0,"",0,"",0,"",0,"",0,"",0,"",0,"",null,0,"",0,"",0,"",null,0,"",0,"",0,"",0,"","No"]
["Birmingham-Jefferson County Transit Authority","Birmingham","AL",4042,40042,"Independent Public Agency or Authority of Transit Service","Full Reporter",749495,93,null,0,"",0,"",0,"",0,"",0,"",0,"",0,"",null,0,"",0,"",0,"",null,0,"",0,"",0,"",0,"","No"]
["Norwalk Transit District","Norwalk","CT",1057,10057,"Independent Public Agency or Authority of Transit Service","Full Reporter",923311,92,null,0,"",0,"",0,"",0,"",0,"",0,"",0,"",null,0,"",0,"",0,"",null,0,"",0,"",0,"",0,"","No"]
["Chapel Hill Transit","Chapel Hill","NC",4051,40051,"City, County or Local Government Unit or Department of Transportation","Full Reporter",347602,92,null,0,"",0,"",0,"",0,"",0,"",0,"",0,"",null,0,"",0,"",0,"",null,0,"",0,"",0,"",0,"","No"]
["Santa Barbara Metropolitan Transit District","Santa Barbara","CA",9020,90020,"Independent Public Agency or Authority of Transit Service","Full Reporter",195861,91,null,0,"",0,"",0,"",0,"",0,"",0,"",0,"",null,0,"",0,"",0,"",null,0,"",0,"",0,"",0,"","No"]
["County of Maui - Dept. of Transportation","Wailuku","HI",9241,90241,"City, County or Local Government Unit or Department of Transportation","Full Reporter",55934,91,null,0,"",0,"",0,"",0,"",0,"",0,"",0,"",null,0,"",0,"",0,"",null,0,"",0,"",0,"",0,"","No"]
["Virginia Railway Express","Alexandria","VA",3073,30073,"Independent Public Agency or Authority of Transit Service","Full Reporter",4586770,90,null,171.4,"",0,"",2.2000000000000002,"",0,"",0,"",0.9,"",174.5,"",null,20,"",0,"",20,"",null,0,"",0,"",0,"",0,"","No"]
["Municipality of Anchorage - Public Transportation Department","Anchorage","AK",12,12,"City, County or Local Government Unit or Department of Transportation","Full Reporter",251243,89,null,0,"",0,"",0,"",0,"",0,"",0,"",0,"",null,0,"",0,"",0,"",null,0,"",0,"",0,"",0,"","No"]
["City Transit Management Company, Inc.","Lubbock","TX",6010,60010,"City, County or Local Government Unit or Department of Transportation","Full Reporter",237356,89,null,0,"",0,"",0,"",0,"",0,"",0,"",0,"",null,0,"",0,"",0,"",null,0,"",0,"",0,"",0,"","No"]
["Santa Clarita Transit","Santa Clarita","CA",9171,90171,"City, County or Local Government Unit or Department of Transportation","Full Reporter",258653,89,null,0,"",0,"",0,"",0,"",0,"",0,"",0,"",null,0,"",0,"",0,"",null,0,"",0,"",0,"",0,"","No"]
["Worcester Regional Transit Authority","Worcester","MA",1014,10014,"Independent Public Agency or Authority of Transit Service","Full Reporter",486514,88,null,0,"",0,"",0,"",0,"",0,"",0,"",0,"",null,0,"",0,"",0,"",null,0,"",0,"",0,"",0,"","No"]
["Durham Area Transit Authority","Durham","NC",4087,40087,"City, County or Local Government Unit or Department of Transportation","Full Reporter",347602,88,null,0,"",0,"",0,"",0,"",0,"",0,"",0,"",null,0,"",0,"",0,"",null,0,"",0,"",0,"",0,"","No"]
["Rio Metro Regional Transit District","Albuquerque","NM",6111,60111,"Independent Public Agency or Authority of Transit Service","Full Reporter",741318,88,null,103,"",0,"",0.8,"",7.1,"",0.2,"",0,"",111.1,"",null,86,"",0,"",86,"",null,0,"",0,"",0,"",0,"","No"]
["Middlesex County Area Transit","New Brunswick","NJ",2196,20196,"City, County or Local Government Unit or Department of Transportation","Full Reporter",18351295,88,null,0,"",0,"",0,"",0,"",0,"",0,"",0,"",null,0,"",0,"",0,"",null,0,"",0,"",0,"",0,"","No"]
["Johnson County Kansas, aka: Johnson County Transit","Olathe","KS",7035,70035,"City, County or Local Government Unit or Department of Transportation","Full Reporter",1519417,87,null,0,"",0,"",0,"",0,"",0,"",0,"",0,"",null,0,"",0,"",0,"",null,0,"",0,"",0,"",0,"",{"$f":"IF(OR(L194=\"Q\",N194=\"Q\",P194=\"Q\",R194=\"Q\",T194=\"Q\",V194=\"Q\",X194=\"Q\",AA194=\"Q\",AC194=\"Q\",AE194=\"Q\",AH194=\"Q\",AJ194=\"Q\",AL194=\"Q\",AN194=\"Q\"),\"Yes\",\"No\")","v":"No"}]
["Laketran","Grand River","OH",5117,50117,"Independent Public Agency or Authority of Transit Service","Full Reporter",1780673,87,null,0,"",0,"",0,"",0,"",0,"",0,"",0,"",null,0,"",0,"",0,"",null,0,"",0,"",0,"",0,"","No"]
["Brockton Area Transit Authority","Brockton","MA",1004,10004,"Independent Public Agency or Authority of Transit Service","Full Reporter",4181019,86,null,0,"",0,"",0,"",0,"",0,"",0,"",0,"",null,0,"",0,"",0,"",null,0,"",0,"",0,"",0,"","No"]
["Skagit Transit","Burlington","WA",44,44,"Independent Public Agency or Authority of Transit Service","Full Reporter",62966,86,null,0,"",0,"",0,"",0,"",0,"",0,"",0,"",null,0,"",0,"",0,"",null,0,"",0,"",0,"",0,"","No"]
["Greater Peoria Mass Transit District","Peoria","IL",5056,50056,"Independent Public Agency or Authority of Transit Service","Full Reporter",266921,85,null,0,"",0,"",0,"",0,"",0,"",0,"",0,"",null,0,"",0,"",0,"",null,0,"",0,"",0,"",0,"","No"]
["City of Appleton - Valley Transit","Appleton","WI",5001,50001,"City, County or Local Government Unit or Department of Transportation","Full Reporter",216154,85,null,0,"",0,"",0,"",0,"",0,"",0,"",0,"",null,0,"",0,"",0,"",null,0,"",0,"",0,"",0,"","No"]
["Torrance Transit System","Torrance","CA",9010,90010,"City, County or Local Government Unit or Department of Transportation","Full Reporter",12150996,84,null,0,"",0,"",0,"",0,"",0,"",0,"",0,"",null,0,"",0,"",0,"",null,0,"",4.8,"",0,"",4.8,"","No"]
["SunLine Transit Agency","Thousand Palms","CA",9079,90079,"Independent Public Agency or Authority of Transit Service","Full Reporter",345580,84,null,0,"",0,"",0,"",0,"",0,"",0,"",0,"",null,0,"",0,"",0,"",null,0,"",0,"",0,"",0,"","No"]
["City of Tallahassee","Tallahassee","FL",4036,40036,"City, County or Local Government Unit or Department of Transportation","Full Reporter",240223,84,null,0,"",0,"",0,"",0,"",0,"",0,"",0,"",null,0,"",0,"",0,"",null,0,"",0,"",0,"",0,"","No"]
["Loudoun County Commuter Bus Service - Office of Transportation Services","Leesburg","VA",3081,30081,"City, County or Local Government Unit or Department of Transportation","Full Reporter",4586770,83,null,0,"",0,"",0,"",0,"",0,"",0,"",0,"",null,0,"",0,"",0,"",null,0,"",0,"",9.5,"",9.5,"","No"]
["Kentuckiana Regional Planning and Development Agency","Louisville","KY",4196,40196,"MPO, COG or Other Planning Agency","Full Reporter",972546,81,null,0,"",0,"",0,"",0,"",0,"",0,"",0,"",null,0,"",0,"",0,"",null,0,"",0,"",0,"",0,"","No"]
["Golden Empire Transit District","Bakersfield","CA",9004,90004,"Independent Public Agency or Authority of Transit Service","Full Reporter",523994,81,null,0,"",0,"",0,"",0,"",0,"",0,"",0,"",null,0,"",0,"",0,"",null,0,"",0,"",0,"",0,"","No"]
["Ames Transit Agency dba CyRide","Ames","IA",7041,70041,"City, County or Local Government Unit or Department of Transportation","Full Reporter",60438,81,null,0,"",0,"",0,"",0,"",0,"",0,"",0,"",null,0,"",0,"",0,"",null,0,"",0,"",0,"",0,"","No"]
["Massachusetts Department of Transportation","Boston","MA",1129,10129,"State Government Unit or Department of Transportation","Full Reporter",4181019,81,null,0,"",0,"",0,"",0,"",0,"",0,"",0,"",null,0,"",0,"",0,"",null,0,"",0,"",0,"",0,"","No"]
["Knoxville Area Transit","Knoxville","TN",4002,40002,"City, County or Local Government Unit or Department of Transportation","Full Reporter",558696,80,null,0,"",0,"",0,"",0,"",0,"",0,"",0,"",null,0,"",0,"",0,"",null,0,"",0,"",0,"",0,"","No"]
["Hampton Jitney, Inc.","Southampton","NY",2217,20217,"Private-For-Profit Corporation","Full Reporter",18351295,79,null,0,"",0,"",0,"",0,"",0,"",0,"",0,"",null,0,"",0,"",0,"",null,0,"",0,"",0,"",0,"","No"]
["Greensboro Transit Authority","Greensboro","NC",4093,40093,"City, County or Local Government Unit or Department of Transportation","Full Reporter",311810,79,null,0,"",0,"",0,"",0,"",0,"",0,"",0,"",null,0,"",0,"",0,"",null,0,"",0,"",0,"",0,"","No"]
["Rockland Coaches, Inc.","Westwood","NJ",2149,20149,"Private-For-Profit Corporation","Full Reporter",18351295,78,null,0,"",0,"",0,"",0,"",0,"",0,"",0,"",null,0,"",0,"",0,"",null,0.5,"",0,"",2.9,"",3.4,"","No"]
["Port Authority Transit Corporation","Lindenwold","NJ",2075,20075,"Independent Public Agency or Authority of Transit Service","Full Reporter",5441567,78,null,12.6,"",0,"",4.0999999999999996,"",13.6,"",2.2999999999999998,"",5.8,"",38.4,"",null,0,"",0,"",0,"",null,0,"",0,"",0,"",0,"","No"]
["Central Oklahoma Transportation and Parking Authority","Oklahoma City","OK",6017,60017,"City, County or Local Government Unit or Department of Transportation","Full Reporter",861505,77,null,0,"",0,"",0,"",0,"",0,"",0,"",0,"",null,0,"",0,"",0,"",null,0,"",0,"",0,"",0,"","No"]
["Capital Area Transit System","Baton Rouge","LA",6022,60022,"Independent Public Agency or Authority of Transit Service","Full Reporter",594309,77,null,0,"",0,"",0,"",0,"",0,"",0,"",0,"",null,0,"",0,"",0,"",null,0,"",0,"",0,"",0,"","No"]
["Luzerne County Transportation Authority","Kingston","PA",3015,30015,"Independent Public Agency or Authority of Transit Service","Full Reporter",381502,77,null,0,"",0,"",0,"",0,"",0,"",0,"",0,"",null,0,"",0,"",0,"",null,0,"",0,"",0,"",0,"","No"]
["Ms Coast Transportation Authority","Gulfport","MS",4014,40014,"Independent Public Agency or Authority of Transit Service","Full Reporter",208948,76,null,0,"",0,"",0,"",0,"",0,"",0,"",0,"",null,0,"",0,"",0,"",null,0,"",0,"",0,"",0,"","No"]
["Chatham Area Transit Authority","Savannah","GA",4025,40025,"Independent Public Agency or Authority of Transit Service","Full Reporter",260677,76,null,0,"",0,"",0,"",0,"",0,"",0,"",0,"",null,0,"",0,"",0,"",null,0,"",0,"",0,"",0,"","No"]
["StarTran","Lincoln","NE",7001,70001,"City, County or Local Government Unit or Department of Transportation","Full Reporter",258719,75,null,0,"",0,"",0,"",0,"",0,"",0,"",0,"",null,0,"",0,"",0,"",null,0,"",0,"",0,"",0,"","No"]
["Lowell Regional Transit Authority","Lowell","MA",1005,10005,"Independent Public Agency or Authority of Transit Service","Full Reporter",4181019,75,null,0,"",0,"",0,"",0,"",0,"",0,"",0,"",null,0,"",0,"",0,"",null,0,"",0,"",0,"",0,"","No"]
["North Front Range Metropolitan Planning Organization","Fort Collins","CO",8106,80106,"MPO, COG or Other Planning Agency","Full Reporter",264465,75,null,0,"",0,"",0,"",0,"",0,"",0,"",0,"",null,0,"",0,"",0,"",null,0,"",0,"",0,"",0,"","No"]
["The Greater New Haven Transit District","Hamden","CT",1049,10049,"Independent Public Agency or Authority of Transit Service","Full Reporter",562839,74,null,0,"",0,"",0,"",0,"",0,"",0,"",0,"",null,0,"",0,"",0,"",null,0,"",0,"",0,"",0,"","No"]
["Chittenden County Transportation Authority","Burlington","VT",1066,10066,"Independent Public Agency or Authority of Transit Service","Full Reporter",108740,74,null,0,"",0,"",0,"",0,"",0,"",0,"",0,"",null,0,"",0,"",0,"",null,0,"",0,"",0,"",0,"","No"]
["Piedmont Authority for Regional Transportation","Greensboro","NC",4173,40173,"Independent Public Agency or Authority of Transit Service","Full Reporter",311810,74,null,0,"",0,"",0,"",0,"",0,"",0,"",0,"",null,0,"",0,"",0,"",null,0,"",0,"",0,"",0,"","No"]
["Regional Transportation Authority","Nashville","TN",4159,40159,"Independent Public Agency or Authority of Transit Service","Full Reporter",969587,74,null,33,"",0,"",0,"",0,"",0,"",0,"",33,"",null,35,"",0,"",35,"",null,0,"",0,"",0,"",0,"","No"]
["The Eastern Contra Costa Transit Authority","Antioch","CA",9162,90162,"Independent Public Agency or Authority of Transit Service","Full Reporter",277634,73,null,0,"",0,"",0,"",0,"",0,"",0,"",0,"",null,0,"",0,"",0,"",null,0,"",0,"",19.399999999999999,"",19.399999999999999,"","No"]
["Antelope Valley Transit Authority","Lancaster","CA",9121,90121,"Independent Public Agency or Authority of Transit Service","Full Reporter",341219,73,null,0,"",0,"",0,"",0,"",0,"",0,"",0,"",null,0,"",0,"",0,"",null,0,"",0,"",92.5,"",92.5,"","No"]
["Central Arkansas Transit Authority","North Little Rock","AR",6033,60033,"Independent Public Agency or Authority of Transit Service","Full Reporter",431388,72,null,0,"",3,"",0.5,"",0,"",0,"",0,"",3.5,"",null,0,"",24,"",24,"",null,0,"",0,"",0,"",0,"","No"]
["Enterprise Rideshare","Atlanta","GA",4203,40203,"Private-For-Profit Corporation","Full Reporter",4515419,72,null,0,"",0,"",0,"",0,"",0,"",0,"",0,"",null,0,"",0,"",0,"",null,0,"",0,"",0,"",0,"","No"]
["Southeastern Regional Transit Authority","New Bedford","MA",1006,10006,"Independent Public Agency or Authority of Transit Service","Full Reporter",149443,71,null,0,"",0,"",0,"",0,"",0,"",0,"",0,"",null,0,"",0,"",0,"",null,0,"",0,"",0,"",0,"","No"]
["Chattanooga Area Regional Transportation Authority","Chattanooga","TN",4001,40001,"City, County or Local Government Unit or Department of Transportation","Full Reporter",381112,71,null,1,"",0,"",0,"",0,"",0,"",0,"",1,"",null,0,"",0,"",0,"",null,0,"",0,"",0,"",0,"","No"]
["Transport of Rockland","Pomona","NY",2084,20084,"City, County or Local Government Unit or Department of Transportation","Full Reporter",18351295,71,null,0,"",0,"",0,"",0,"",0,"",0,"",0,"",null,0,"",0,"",0,"",null,0,"",0,"",0,"",0,"","No"]
["Somerset County Transportation","Somerville","NJ",2209,20209,"City, County or Local Government Unit or Department of Transportation","Full Reporter",18351295,71,null,0,"",0,"",0,"",0,"",0,"",0,"",0,"",null,0,"",0,"",0,"",null,0,"",0,"",0,"",0,"","No"]
["Northern Indiana Commuter Transportation District","Chesterton","IN",5104,50104,"Independent Public Agency or Authority of Transit Service","Full Reporter",8608208,70,null,95.6,"",2,"",0,"",32.799999999999997,"",0,"",0,"",130.39999999999998,"",null,85,"",32,"",117,"",null,0,"",0,"",0,"",0,"","No"]
["Connecticut Department of Transportation- CTTransit Waterbury- NET","Waterbury","CT",1128,10128,"Subsidiary Unit of a Transit Agency, Reporting Separately","Full Reporter",194535,69,null,0,"",0,"",0,"",0,"",0,"",0,"",0,"",null,0,"",0,"",0,"",null,0,"",0,"",0,"",0,"","No"]
["Yakima Transit","Yakima","WA",6,6,"City, County or Local Government Unit or Department of Transportation","Full Reporter",129534,69,null,0,"",0,"",0,"",0,"",0,"",0,"",0,"",null,0,"",0,"",0,"",null,0,"",0,"",0,"",0,"","No"]
["SouthWest Transit","Eden Prairie","MN",5221,50518,"City, County or Local Government Unit or Department of Transportation","Full Reporter",2650890,69,null,0,"",0,"",0,"",0,"",0,"",0,"",0,"",null,0,"",0,"",0,"",null,0,"",0,"",28.8,"",28.8,"","No"]
["STAR Transit","Terrell","TX",6114,60114,"City, County or Local Government Unit or Department of Transportation","Full Reporter",5121892,67,null,0,"",0,"",0,"",0,"",0,"",0,"",0,"",null,0,"",0,"",0,"",null,0,"",0,"",0,"",0,"","No"]
["Kalamazoo Metro Transit System","Kalamazoo","MI",5035,50035,"City, County or Local Government Unit or Department of Transportation","Full Reporter",209703,67,null,0,"",0,"",0,"",0,"",0,"",0,"",0,"",null,0,"",0,"",0,"",null,0,"",0,"",0,"",0,"","No"]
["Arlington Transit - Arlington County","Arlington","VA",3080,30080,"City, County or Local Government Unit or Department of Transportation","Full Reporter",4586770,66,null,0,"",0,"",0,"",0,"",0,"",0,"",0,"",null,0,"",0,"",0,"",null,0,"",0,"",0,"",0,"","No"]
["vRide, Inc. - Anchorage","Anchorage","AK",49,49,"Private Provider Reporting on Behalf of a Public Entity","Full Reporter",251243,66,null,0,"",0,"",0,"",0,"",0,"",0,"",0,"",null,0,"",0,"",0,"",null,0,"",0,"",0,"",0,"","No"]
["Tompkins Consolidated Area Transit","Ithaca","NY",2145,20145,"Private-Non-Profit Corporation","Full Reporter",53661,66,null,0,"",0,"",0,"",0,"",0,"",0,"",0,"",null,0,"",0,"",0,"",null,0,"",0,"",0,"",0,"","No"]
["Livermore / Amador Valley Transit Authority","Livermore","CA",9144,90144,"Independent Public Agency or Authority of Transit Service","Full Reporter",615968,65,null,0,"",0,"",0,"",0,"",0,"",0,"",0,"",null,0,"",0,"",0,"",null,0,"",0,"",0,"",0,"","No"]
["Sonoma County Transit","Santa Rosa","CA",9089,90089,"City, County or Local Government Unit or Department of Transportation","Full Reporter",308231,65,null,0,"",0,"",0,"",0,"",0,"",0,"",0,"",null,0,"",0,"",0,"",null,0,"",0,"",0,"",0,"","No"]
["South Florida Regional Transportation Authority","Pompano Beach","FL",4077,40077,"Independent Public Agency or Authority of Transit Service","Full Reporter",5502379,65,null,152.19999999999999,"",0,"",0,"",0,"",0,"",0,"",152.19999999999999,"",null,73,"",0,"",73,"",null,0,"",0,"",0,"",0,"","No"]
["Gwinnett County Board of Commissioners","Lawrenceville","GA",4138,40138,"City, County or Local Government Unit or Department of Transportation","Full Reporter",4515419,65,null,0,"",0,"",0,"",0,"",0,"",0,"",0,"",null,0,"",0,"",0,"",null,0,"",59.2,"",0,"",59.2,"","No"]
["Modesto Area Express","Modesto","CA",9007,90007,"City, County or Local Government Unit or Department of Transportation","Full Reporter",358172,64,null,0,"",0,"",0,"",0,"",0,"",0,"",0,"",null,0,"",0,"",0,"",null,0,"",0,"",0,"",0,"","No"]
["Greater Bridgeport Transit Authority","Bridgeport","CT",1050,10050,"Independent Public Agency or Authority of Transit Service","Full Reporter",923311,64,null,0,"",0,"",0,"",0,"",0,"",0,"",0,"",null,0,"",0,"",0,"",null,0,"",0,"",0,"",0,"","No"]
["Merrimack Valley Regional Transit Authority","Haverhill","MA",1013,10013,"Independent Public Agency or Authority of Transit Service","Full Reporter",4181019,64,null,0,"",0,"",0,"",0,"",0,"",0,"",0,"",null,0,"",0,"",0,"",null,0,"",0,"",0,"",0,"","No"]
["Gold Coast Transit","Oxnard","CA",9035,90035,"Independent Public Agency or Authority of Transit Service","Full Reporter",367260,64,null,0,"",0,"",0,"",0,"",0,"",0,"",0,"",null,0,"",0,"",0,"",null,0,"",0,"",0,"",0,"","No"]
["West Virginia University - Morgantown Personal Rapid Transit","Morgantown","WV",3107,30107,"University","Full Reporter",70350,64,null,4,"",0,"",4.7,"",0,"",0,"",0,"",8.6999999999999993,"",null,0,"",0,"",0,"",null,0,"",0,"",0,"",0,"","No"]
["Anaheim Transportation Network","Anaheim","CA",9211,90211,"Private-Non-Profit Corporation","Full Reporter",12150996,63,null,0,"",0,"",0,"",0,"",0,"",0,"",0,"",null,0,"",0,"",0,"",null,0,"",0,"",0,"",0,"","No"]
["Valley Regional Transit","Meridian","ID",11,11,"Independent Public Agency or Authority of Transit Service","Full Reporter",349684,63,null,0,"",0,"",0,"",0,"",0,"",0,"",0,"",null,0,"",0,"",0,"",null,0,"",0,"",0,"",0,"","No"]
["Stark Area Regional Transit Authority","Canton","OH",5011,50011,"Independent Public Agency or Authority of Transit Service","Full Reporter",279245,63,null,0,"",0,"",0,"",0,"",0,"",0,"",0,"",null,0,"",0,"",0,"",null,0,"",0,"",0,"",0,"","No"]
["Bergen County Community Transportation","Lodi","NJ",2192,20192,"City, County or Local Government Unit or Department of Transportation","Full Reporter",18351295,62,null,0,"",0,"",0,"",0,"",0,"",0,"",0,"",null,0,"",0,"",0,"",null,0,"",0,"",0,"",0,"","No"]
["Bay Metropolitan Transit Authority","Bay City","MI",5029,50029,"Independent Public Agency or Authority of Transit Service","Full Reporter",70585,62,null,0,"",0,"",0,"",0,"",0,"",0,"",0,"",null,0,"",0,"",0,"",null,0,"",0,"",0,"",0,"","No"]
["County of Lackawanna Transit System","Scranton","PA",3025,30025,"Independent Public Agency or Authority of Transit Service","Full Reporter",381502,62,null,0,"",0,"",0,"",0,"",0,"",0,"",0,"",null,0,"",0,"",0,"",null,0,"",0,"",0,"",0,"","No"]
["Escambia County Area Transit","Pensacola","FL",4038,40038,"City, County or Local Government Unit or Department of Transportation","Full Reporter",340067,61,null,0,"",0,"",0,"",0,"",0,"",0,"",0,"",null,0,"",0,"",0,"",null,0,"",0,"",0,"",0,"","No"]
["Rock Island County Metropolitan Mass Transit District","Moline ","IL",5057,50057,"Independent Public Agency or Authority of Transit Service","Full Reporter",280051,60,null,0,"",0,"",0,"",0,"",0,"",0,"",0,"",null,0,"",0,"",0,"",null,0,"",0,"",0,"",0,"",{"$f":"IF(OR(L258=\"Q\",N258=\"Q\",P258=\"Q\",R258=\"Q\",T258=\"Q\",V258=\"Q\",X258=\"Q\",AA258=\"Q\",AC258=\"Q\",AE258=\"Q\",AH258=\"Q\",AJ258=\"Q\",AL258=\"Q\",AN258=\"Q\"),\"Yes\",\"No\")","v":"No"}]
["JAUNT, Inc.","Charlottesville","VA",3045,30045,"Other Publicly-Owned or Privately Chartered Corporation","Full Reporter",92359,60,null,0,"",0,"",0,"",0,"",0,"",0,"",0,"",null,0,"",0,"",0,"",null,0,"",0,"",0,"",0,"","No"]
["Southwestern Pennsylvania Commission","Pittsburgh","PA",3078,30078,"MPO, COG or Other Planning Agency","Full Reporter",1733853,60,null,0,"",0,"",0,"",0,"",0,"",0,"",0,"",null,0,"",0,"",0,"",null,0,"",0,"",0,"",0,"","No"]
["Springfield Mass Transit District","Springfield","IL",5059,50059,"Independent Public Agency or Authority of Transit Service","Full Reporter",161316,60,null,0,"",0,"",0,"",0,"",0,"",0,"",0,"",null,0,"",0,"",0,"",null,0,"",0,"",0,"",0,"","No"]
["Douglas County Rideshare","Douglasville","GA",4082,40082,"City, County or Local Government Unit or Department of Transportation","Full Reporter",4515419,59,null,0,"",0,"",0,"",0,"",0,"",0,"",0,"",null,0,"",0,"",0,"",null,0,"",0,"",0,"",0,"","No"]
["Portage Area Regional Transportation Authority","Kent","OH",5021,50021,"Independent Public Agency or Authority of Transit Service","Full Reporter",569499,59,null,0,"",0,"",0,"",0,"",0,"",0,"",0,"",null,0,"",0,"",0,"",null,0,"",0,"",0,"",0,"","No"]
["Winston-Salem Transit Authority - Trans-Aid of Forsyth County","Winston-Salem","NC",4012,40012,"Independent Public Agency or Authority of Transit Service","Full Reporter",391024,59,null,0,"",0,"",0,"",0,"",0,"",0,"",0,"",null,0,"",0,"",0,"",null,0,"",0,"",0,"",0,"","No"]
["Port Imperial Ferry Corporation dba NY Waterway","Weehawken","NJ",2190,20190,"Private-For-Profit Corporation","Full Reporter",18351295,59,null,0,"",0,"",0,"",0,"",0,"",0,"",0,"",null,0,"",0,"",0,"",null,0,"",0,"",0,"",0,"","No"]
["Lakeland Bus Lines, Inc.","Dover","NJ",2163,20163,"Private-For-Profit Corporation","Full Reporter",18351295,59,null,0,"",0,"",0,"",0,"",0,"",0,"",0,"",null,0,"",0,"",0,"",null,0,"",0,"",2.9,"",2.9,"","No"]
["Washington County Transportation Authority","Washington","PA",3111,30111,"Independent Public Agency or Authority of Transit Service","Full Reporter",1733853,58,null,0,"",0,"",0,"",0,"",0,"",0,"",0,"",null,0,"",0,"",0,"",null,0,"",0,"",0,"",0,"","No"]
["Kanawha Valley Regional Transportation Authority","Charleston","WV",3001,30001,"Independent Public Agency or Authority of Transit Service","Full Reporter",153199,58,null,0,"",0,"",0,"",0,"",0,"",0,"",0,"",null,0,"",0,"",0,"",null,0,"",0,"",0,"",0,"","No"]
["DeCamp Bus Lines","Montclair","NJ",2161,20161,"Private-For-Profit Corporation","Full Reporter",18351295,57,null,0,"",0,"",0,"",0,"",0,"",0,"",0,"",null,0,"",0,"",0,"",null,0,"",0,"",2.9,"",2.9,"","No"]
["Transit Authority of Central Kentucky","Elizabethtown","KY",4191,40191,"Independent Public Agency or Authority of Transit Service","Full Reporter",73467,56,null,0,"",0,"",0,"",0,"",0,"",0,"",0,"",null,0,"",0,"",0,"",null,0,"",0,"",0,"",0,"","No"]
["Everett Transit","Everett","WA",5,5,"City, County or Local Government Unit or Department of Transportation","Full Reporter",3059393,56,null,0,"",0,"",0,"",0,"",0,"",0,"",0,"",null,0,"",0,"",0,"",null,0,"",0,"",0,"",0,"","No"]
["Transit Joint Powers Authority for Merced County","Merced","CA",9173,90173,"Independent Public Agency or Authority of Transit Service","Full Reporter",136969,55,null,0,"",0,"",0,"",0,"",0,"",0,"",0,"",null,0,"",0,"",0,"",null,0,"",0,"",0,"",0,"","No"]
["Greater Lafayette Public Transportation Corporation","Lafayette","IN",5051,50051,"Independent Public Agency or Authority of Transit Service","Full Reporter",147725,55,null,0,"",0,"",0,"",0,"",0,"",0,"",0,"",null,0,"",0,"",0,"",null,0,"",0,"",0,"",0,"","No"]
["Duluth Transit Authority","Duluth","MN",5025,50025,"Independent Public Agency or Authority of Transit Service","Full Reporter",120378,55,null,0,"",0,"",0,"",0,"",0,"",0,"",0,"",null,0,"",0,"",0,"",null,0,"",0,"",0,"",0,"","No"]
["Concho Valley Transit District","San Angelo","TX",6102,60102,"Independent Public Agency or Authority of Transit Service","Full Reporter",92984,55,null,0,"",0,"",0,"",0,"",0,"",0,"",0,"",null,0,"",0,"",0,"",null,0,"",0,"",0,"",0,"","No"]
["Cambria County Transit Authority","Johnstown","PA",3012,30012,"Independent Public Agency or Authority of Transit Service","Full Reporter",69014,54,null,0.3,"",0,"",0,"",0,"",0,"",0,"",0.3,"",null,0,"",0,"",0,"",null,0,"",0,"",0,"",0,"","No"]
["Alternativa de Transporte Integrado -ATI","San Juan","PR",4094,40094,"State Government Unit or Department of Transportation","Full Reporter",2148346,53,null,10.199999999999999,"",0,"",12.2,"",0,"",1.4,"",1.7,"",25.5,"",null,0,"",0,"",0,"",null,11.1,"",0,"",0,"",11.1,"","No"]
["Pasco County Public Transportation","Port Richey","FL",4074,40074,"City, County or Local Government Unit or Department of Transportation","Full Reporter",2441770,53,null,0,"",0,"",0,"",0,"",0,"",0,"",0,"",null,0,"",0,"",0,"",null,0,"",0,"",0,"",0,"","No"]
["Greater Roanoke Transit Company","Roanoke","VA",3007,30007,"Other Publicly-Owned or Privately Chartered Corporation","Full Reporter",210111,52,null,0,"",0,"",0,"",0,"",0,"",0,"",0,"",null,0,"",0,"",0,"",null,0,"",0,"",0,"",0,"","No"]
["City of Lawrence","Lawrence","KS",7048,70048,"Consolidated Reporter","Full Reporter",88053,52,null,0,"",0,"",0,"",0,"",0,"",0,"",0,"",null,0,"",0,"",0,"",null,0,"",0,"",0,"",0,"","No"]
["Orange-Newark-Elizabeth, Inc.","Elizabeth","NJ",2166,20166,"Private-For-Profit Corporation","Full Reporter",18351295,52,null,0,"",0,"",0,"",0,"",0,"",0,"",0,"",null,0,"",0,"",0,"",null,0,"",0,"",0,"",0,"","No"]
["Shreveport Area Transit System","Shreveport","LA",6024,60024,"City, County or Local Government Unit or Department of Transportation","Full Reporter",298317,52,null,0,"",0,"",0,"",0,"",0,"",0,"",0,"",null,0,"",0,"",0,"",null,0,"",0,"",0,"",0,"","No"]
["Laredo Transit Management, Inc.","Laredo","TX",6009,60009,"City, County or Local Government Unit or Department of Transportation","Full Reporter",235730,52,null,0,"",0,"",0,"",0,"",0,"",0,"",0,"",null,0,"",0,"",0,"",null,0,"",0,"",0,"",0,"","No"]
["Western Reserve Transit Authority","Youngstown","OH",5024,50024,"Independent Public Agency or Authority of Transit Service","Full Reporter",387550,52,null,0,"",0,"",0,"",0,"",0,"",0,"",0,"",null,0,"",0,"",0,"",null,0,"",0,"",0,"",0,"","No"]
["St. Cloud Metropolitan Transit Commission","St. Cloud","MN",5028,50028,"Independent Public Agency or Authority of Transit Service","Full Reporter",110621,51,null,0,"",0,"",0,"",0,"",0,"",0,"",0,"",null,0,"",0,"",0,"",null,0,"",0,"",0,"",0,"","No"]
["The Tri-County Council for the Lower Eastern Shore of Maryland","Salisbury","MD",3096,30096,"Independent Public Agency or Authority of Transit Service","Full Reporter",98081,51,null,0,"",0,"",0,"",0,"",0,"",0,"",0,"",null,0,"",0,"",0,"",null,0,"",0,"",0,"",0,"","No"]
["City of Elk Grove","Elk Grove","CA",9205,90205,"City, County or Local Government Unit or Department of Transportation","Full Reporter",1723634,51,null,0,"",0,"",0,"",0,"",0,"",0,"",0,"",null,0,"",0,"",0,"",null,0,"",0,"",0,"",0,"","No"]
["University of Georgia Transit System","Athens","GA",4180,40180,"University","Full Reporter",128754,51,null,0,"",0,"",0,"",0,"",0,"",0,"",0,"",null,0,"",0,"",0,"",null,0,"",0,"",0,"",0,"","No"]
["Trans-Bridge Lines, Inc. ","Bethlehem","PA",2169,20169,"Private-For-Profit Corporation","Full Reporter",18351295,51,null,0,"",0,"",0,"",0,"",0,"",0,"",0,"",null,0,"",0,"",0,"",null,0,"",2.9,"",0,"",2.9,"","No"]
["Broward County Community Bus Service","Plantation","FL",4179,40179,"Consolidated Reporter","Full Reporter",5502379,50,null,0,"",0,"",0,"",0,"",0,"",0,"",0,"",null,0,"",0,"",0,"",null,0,"",0,"",0,"",0,"","No"]
["City of Gardena Transportation Department","Gardena","CA",9042,90042,"City, County or Local Government Unit or Department of Transportation","Full Reporter",12150996,50,null,0,"",0,"",0,"",0,"",0,"",0,"",0,"",null,0,"",0,"",0,"",null,11.7,"",0,"",0,"",11.7,"","No"]
["Eau Claire Transit","Eau Claire","WI",5099,50099,"City, County or Local Government Unit or Department of Transportation","Full Reporter",102852,50,null,0,"",0,"",0,"",0,"",0,"",0,"",0,"",null,0,"",0,"",0,"",null,0,"",0,"",0,"",0,"","No"]
["Lake County Board of County Commissioners","Tavares","FL",4158,40158,"City, County or Local Government Unit or Department of Transportation","Full Reporter",131337,50,null,0,"",0,"",0,"",0,"",0,"",0,"",0,"",null,0,"",0,"",0,"",null,0,"",0,"",0,"",0,"","No"]
["DDOT - Progressive Transportation Services Administration","Washington","DC",3112,30112,"State Government Unit or Department of Transportation","Full Reporter",4586770,50,null,0,"",0,"",0,"",0,"",0,"",0,"",0,"",null,0,"",0,"",0,"",null,0,"",0,"",0,"",0,"","No"]
["Yuma County Intergovernmental Public Transportation Authority","Yuma","AZ",9233,90233,"Independent Public Agency or Authority of Transit Service","Full Reporter",135267,49,null,0,"",0,"",0,"",0,"",0,"",0,"",0,"",null,0,"",0,"",0,"",null,0,"",0,"",0,"",0,"","No"]
["Western Piedmont Regional Transit Authority ","Conover","NC",4172,40172,"Independent Public Agency or Authority of Transit Service","Full Reporter",212195,49,null,0,"",0,"",0,"",0,"",0,"",0,"",0,"",null,0,"",0,"",0,"",null,0,"",0,"",0,"",0,"","No"]
["Transfort ","Fort Collins","CO",8011,80011,"City, County or Local Government Unit or Department of Transportation","Full Reporter",264465,49,null,0,"",0,"",0,"",0,"",0,"",0,"",0,"",null,0,"",0,"",0,"",null,5.9,"",0,"",0,"",5.9,"","No"]
["Yolo County Transportation District","Woodland","CA",9090,90090,"Independent Public Agency or Authority of Transit Service","Full Reporter",1723634,49,null,0,"",0,"",0,"",0,"",0,"",0,"",0,"",null,0,"",0,"",0,"",null,0,"",0,"",0,"",0,"","No"]
["Central Midlands Transit","Columbia","SC",4141,40141,"Independent Public Agency or Authority of Transit Service","Full Reporter",549777,49,null,0,"",0,"",0,"",0,"",0,"",0,"",0,"",null,0,"",0,"",0,"",null,0,"",0,"",0,"",0,"","No"]
["Culver City Municipal Bus Lines","Culver City","CA",9039,90039,"City, County or Local Government Unit or Department of Transportation","Full Reporter",12150996,49,null,0,"",0,"",0,"",0,"",0,"",0,"",0,"",null,0,"",0,"",0,"",null,0,"",0,"",0,"",0,"","No"]
["Western Contra Costa Transit Authority","Pinole","CA",9159,90159,"Independent Public Agency or Authority of Transit Service","Full Reporter",3281212,48,null,0,"",0,"",0,"",0,"",0,"",0,"",0,"",null,0,"",0,"",0,"",null,0,"",0,"",0,"",0,"","No"]
["Las Vegas Monorail Company","Las Vegas","NV",9242,90242,"Private-Non-Profit Corporation","Full Reporter",1886011,48,null,0,"",0,"",15.4,"",0,"",0,"",0,"",15.4,"",null,0,"",0,"",0,"",null,0,"",0,"",0,"",0,"","No"]
["South Bend Public Transportation Corporation","South Bend","IN",5052,50052,"Independent Public Agency or Authority of Transit Service","Full Reporter",278165,48,null,0,"",0,"",0,"",0,"",0,"",0,"",0,"",null,0,"",0,"",0,"",null,0,"",0,"",0,"",0,"","No"]
["The Wave Transit System","Mobile","AL",4043,40043,"City, County or Local Government Unit or Department of Transportation","Full Reporter",326183,48,null,0,"",0,"",0,"",0,"",0,"",0,"",0,"",null,0,"",0,"",0,"",null,0,"",0,"",0,"",0,"","No"]
["Broome County Department of Public Transportation","Vestal","NY",2003,20003,"City, County or Local Government Unit or Department of Transportation","Full Reporter",158084,47,null,0,"",0,"",0,"",0,"",0,"",0,"",0,"",null,0,"",0,"",0,"",null,0,"",0,"",0,"",0,"","No"]
["Wake County DSS","Raleigh","NC","4R06-094",40222,"City, County or Local Government Unit or Department of Transportation","Full Reporter",884891,47,null,0,"",0,"",0,"",0,"",0,"",0,"",0,"",null,0,"",0,"",0,"",null,0,"",0,"",0,"",0,"","No"]
["Ventura Intercity Service Transit Authority","Ventura","CA",9164,90164,"Independent Public Agency or Authority of Transit Service","Full Reporter",367260,47,null,0,"",0,"",0,"",0,"",0,"",0,"",0,"",null,0,"",0,"",0,"",null,0,"",0,"",0,"",0,"","No"]
["Butte County Association of Governments","Chico","CA",9208,90208,"MPO, COG or Other Planning Agency","Full Reporter",98176,47,null,0,"",0,"",0,"",0,"",0,"",0,"",0,"",null,0,"",0,"",0,"",null,0,"",0,"",0,"",0,"","No"]
["Rockford Mass Transit District","Rockford","IL",5058,50058,"Independent Public Agency or Authority of Transit Service","Full Reporter",296863,47,null,0,"",0,"",0,"",0,"",0,"",0,"",0,"",null,0,"",0,"",0,"",null,0,"",0,"",0,"",0,"","No"]
["Kenosha Transit","Kenosha","WI",5003,50003,"City, County or Local Government Unit or Department of Transportation","Full Reporter",124064,47,null,2,"",0,"",0,"",0,"",0,"",0,"",2,"",null,14,"",0,"",14,"",null,0,"",0,"",0,"",0,"","No"]
["Senior Citizens United Community Services of Camden County, Inc.","Audubon","NJ",2204,20204,"Private-Non-Profit Corporation","Full Reporter",5441567,47,null,0,"",0,"",0,"",0,"",0,"",0,"",0,"",null,0,"",0,"",0,"",null,0,"",0,"",0,"",0,"","No"]
["Manatee County Area Transit","Bradenton","FL",4026,40026,"City, County or Local Government Unit or Department of Transportation","Full Reporter",643260,45,null,0,"",0,"",0,"",0,"",0,"",0,"",0,"",null,0,"",0,"",0,"",null,0,"",0,"",0,"",0,"","No"]
["Okaloosa County Board of County Commissioners","Fort Walton Beach","FL",4128,40128,"City, County or Local Government Unit or Department of Transportation","Full Reporter",191917,45,null,0,"",0,"",0,"",0,"",0,"",0,"",0,"",null,0,"",0,"",0,"",null,0,"",0,"",0,"",0,"","No"]
["Lower Rio Grande Valley Development Council","Weslaco","TX",6090,60090,"MPO, COG or Other Planning Agency","Full Reporter",728825,45,null,0,"",0,"",0,"",0,"",0,"",0,"",0,"",null,0,"",0,"",0,"",null,0,"",0,"",0,"",0,"","No"]
["Link Transit","Wenatchee","WA",43,43,"Independent Public Agency or Authority of Transit Service","Full Reporter",67227,45,null,0,"",0,"",0,"",0,"",0,"",0,"",0,"",null,0,"",0,"",0,"",null,0,"",0,"",0,"",0,"","No"]
["Wiregrass Transit Authority","Dothan","AL",4103,40103,"MPO, COG or Other Planning Agency","Full Reporter",68781,44,null,0,"",0,"",0,"",0,"",0,"",0,"",0,"",null,0,"",0,"",0,"",null,0,"",0,"",0,"",0,"","No"]
["Dutchess County Division of Mass Transportation","Poughkeepsie","NY",2010,20010,"City, County or Local Government Unit or Department of Transportation","Full Reporter",423566,44,null,0,"",0,"",0,"",0,"",0,"",0,"",0,"",null,0,"",0,"",0,"",null,0,"",0,"",0,"",0,"","No"]
["San Luis Obispo Regional Transit Authority","San Luis Obispo","CA",9206,90206,"Independent Public Agency or Authority of Transit Service","Full Reporter",59219,44,null,0,"",0,"",0,"",0,"",0,"",0,"",0,"",null,0,"",0,"",0,"",null,0,"",0,"",0,"",0,"","No"]
["Staten Island Rapid Transit Operating Authority, dba: MTA Staten Island Railway","Staten Island","NY",2099,20099,"Independent Public Agency or Authority of Transit Service","Full Reporter",18351295,44,null,3,"",0,"",2,"",12,"",14.5,"",0.2,"",31.7,"",null,0,"",0,"",0,"",null,0,"",0,"",0,"",0,"","No"]
["Jefferson Parish Department of Transit Administration","Gretna","LA",6088,60088,"City, County or Local Government Unit or Department of Transportation","Full Reporter",899703,44,null,0,"",0,"",0,"",0,"",0,"",0,"",0,"",null,0,"",0,"",0,"",null,0,"",0,"",7,"",7,"","No"]
["Cape Fear Public Transportation Authority","Wilmington","NC",4006,40006,"Independent Public Agency or Authority of Transit Service","Full Reporter",219957,44,null,0,"",0,"",0,"",0,"",0,"",0,"",0,"",null,0,"",0,"",0,"",null,0,"",0,"",0,"",0,"","No"]
["Blacksburg Transit","Blacksburg","VA",3091,30091,"City, County or Local Government Unit or Department of Transportation","Full Reporter",88542,43,null,0,"",0,"",0,"",0,"",0,"",0,"",0,"",null,0,"",0,"",0,"",null,0,"",0,"",0,"",0,"",{"$f":"IF(OR(L322=\"Q\",N322=\"Q\",P322=\"Q\",R322=\"Q\",T322=\"Q\",V322=\"Q\",X322=\"Q\",AA322=\"Q\",AC322=\"Q\",AE322=\"Q\",AH322=\"Q\",AJ322=\"Q\",AL322=\"Q\",AN322=\"Q\"),\"Yes\",\"No\")","v":"No"}]
["Connecticut Department of Transportation","Newington","CT",1102,10102,"State Government Unit or Department of Transportation","Full Reporter",924859,43,null,50.7,"",0,"",3.2,"",43.1,"",11.1,"",1,"",109.10000000000001,"",null,0,"",0,"",0,"",null,0,"",23.6,"",0,"",23.6,"","No"]
["Clermont Transportation Connection","Batavia","OH",5166,50166,"City, County or Local Government Unit or Department of Transportation","Full Reporter",1624827,43,null,0,"",0,"",0,"",0,"",0,"",0,"",0,"",null,0,"",0,"",0,"",null,0,"",0,"",0,"",0,"","No"]
["Santee Wateree Regional Transportation Authority","Sumter","SC",4100,40100,"Independent Public Agency or Authority of Transit Service","Full Reporter",73107,43,null,0,"",0,"",0,"",0,"",0,"",0,"",0,"",null,0,"",0,"",0,"",null,0,"",0,"",0,"",0,"","No"]
["Napa Valley Transportation Authority","Napa","CA",9088,90088,"Independent Public Agency or Authority of Transit Service","Full Reporter",83913,43,null,0,"",0,"",0,"",0,"",0,"",0,"",0,"",null,0,"",0,"",0,"",null,0,"",0,"",0,"",0,"","No"]
["Connecticut Department of Transportation - CTTRANSIT Stamford Division","Hartford","CT",1056,10056,"State Government Unit or Department of Transportation","Full Reporter",923311,42,null,0,"",0,"",0,"",0,"",0,"",0,"",0,"",null,0,"",0,"",0,"",null,0,"",0,"",0,"",0,"","No"]
["City of Rochester Public Transportation","Rochester","MN",5092,50092,"City, County or Local Government Unit or Department of Transportation","Full Reporter",107677,42,null,0,"",0,"",0,"",0,"",0,"",0,"",0,"",null,0,"",0,"",0,"",null,0,"",0,"",0,"",0,"","No"]
["Howard Transit","Ellicott City","MD",3048,30048,"City, County or Local Government Unit or Department of Transportation","Full Reporter",2203663,42,null,0,"",0,"",0,"",0,"",0,"",0,"",0,"",null,0,"",0,"",0,"",null,0,"",0,"",0,"",0,"","No"]
["Northwest Alabama Council of Local Governments","Muscle Shoals","AL",4068,40068,"MPO, COG or Other Planning Agency","Full Reporter",77074,42,null,0,"",0,"",0,"",0,"",0,"",0,"",0,"",null,0,"",0,"",0,"",null,0,"",0,"",0,"",0,"","No"]
["Fort Wayne Public Transportation Corporation","Fort Wayne","IN",5044,50044,"Independent Public Agency or Authority of Transit Service","Full Reporter",313492,42,null,0,"",0,"",0,"",0,"",0,"",0,"",0,"",null,0,"",0,"",0,"",null,0,"",0,"",0,"",0,"","No"]
["Su Tran LLC dba: Sioux Area Metro","Sioux Falls","SD",8002,80002,"Private Provider Reporting on Behalf of a Public Entity","Full Reporter",156777,42,null,0,"",0,"",0,"",0,"",0,"",0,"",0,"",null,0,"",0,"",0,"",null,0,"",0,"",0,"",0,"","No"]
["Spartanburg Regional Health Services, Inc.","Spartanburg","SC",null,40244,"Other Publicly-Owned or Privately Chartered Corporation","Full Reporter",180786,42,null,0,"",0,"",0,"",0,"",0,"",0,"",0,"",null,0,"",0,"",0,"",null,0,"",0,"",0,"",0,"","No"]
["City of Fairfield - Fairfield and Suisun Transit","Fairfield","CA",9092,90092,"City, County or Local Government Unit or Department of Transportation","Full Reporter",133683,42,null,0,"",0,"",0,"",0,"",0,"",0,"",0,"",null,0,"",0,"",0,"",null,0,"",0,"",0,"",0,"","No"]
["Topeka Metropolitan Transit Authority","Topeka","KS",7014,70014,"Independent Public Agency or Authority of Transit Service","Full Reporter",150003,41,null,0,"",0,"",0,"",0,"",0,"",0,"",0,"",null,0,"",0,"",0,"",null,0,"",0,"",0,"",0,"","No"]
["City of Waukesha Transit Commission","Waukesha","WI",5096,50096,"City, County or Local Government Unit or Department of Transportation","Full Reporter",1376476,41,null,0,"",0,"",0,"",0,"",0,"",0,"",0,"",null,0,"",0,"",0,"",null,10.7,"",0,"",0,"",10.7,"","No"]
["City of Visalia - Visalia City Coach","Visalia","CA",9091,90091,"City, County or Local Government Unit or Department of Transportation","Full Reporter",219454,41,null,0,"",0,"",0,"",0,"",0,"",0,"",0,"",null,0,"",0,"",0,"",null,0,"",0,"",0,"",0,"","No"]
["Central Oregon Intergovernmental Council","Bend","OR",57,57,"MPO, COG or Other Planning Agency","Full Reporter",83794,41,null,0,"",0,"",0,"",0,"",0,"",0,"",0,"",null,0,"",0,"",0,"",null,0,"",0,"",0,"",0,"","No"]
["Rogue Valley Transportation District","Medford","OR",34,34,"Independent Public Agency or Authority of Transit Service","Full Reporter",154081,41,null,0,"",0,"",0,"",0,"",0,"",0,"",0,"",null,0,"",0,"",0,"",null,0,"",0,"",0,"",0,"","No"]
["Knoxville-Knox County Community Action Committee","Knoxville","TN",4171,40171,"City, County or Local Government Unit or Department of Transportation","Full Reporter",558696,40,null,0,"",0,"",0,"",0,"",0,"",0,"",0,"",null,0,"",0,"",0,"",null,0,"",0,"",0,"",0,"","No"]
["University of Michigan Parking and Transportation Services","Ann Arbor","MI",5158,50158,"University","Full Reporter",306022,40,null,0,"",0,"",0,"",0,"",0,"",0,"",0,"",null,0,"",0,"",0,"",null,0,"",0,"",0,"",0,"","No"]
["Pennsylvania Department of Transportation","Harrisburg","PA",3057,30057,"State Government Unit or Department of Transportation","Full Reporter",5441567,40,null,137.80000000000001,"",0,"",6.6,"",0,"",0,"",0,"",144.4,"",null,1,"",0,"",1,"",null,0,"",0,"",0,"",0,"","No"]
["Solano County Transit","Vallejo","CA",9232,90232,"City, County or Local Government Unit or Department of Transportation","Full Reporter",165074,40,null,0,"",0,"",0,"",0,"",0,"",0,"",0,"",null,0,"",0,"",0,"",null,0,"",0,"",0,"",0,"","No"]
["Fort Bend County Public Transportation","Sugar Land","TX",6103,60103,"City, County or Local Government Unit or Department of Transportation","Full Reporter",4944332,40,null,0,"",0,"",0,"",0,"",0,"",0,"",0,"",null,0,"",0,"",0,"",null,0,"",0,"",12.2,"",12.2,"","No"]
["Alamo Area Council of Governments","San Antonio ","TX",6130,60130,"City, County or Local Government Unit or Department of Transportation","Full Reporter",1758210,40,null,0,"",0,"",0,"",0,"",0,"",0,"",0,"",null,0,"",0,"",0,"",null,0,"",0,"",0,"",0,"","No"]
["Monroe County Transportation  Authority","Scotrun","PA","3R04-012",30137,"Independent Public Agency or Authority of Transit Service","Full Reporter",54316,40,null,0,"",0,"",0,"",0,"",0,"",0,"",0,"",null,0,"",0,"",0,"",null,0,"",0,"",0,"",0,"","No"]
["Housatonic Area Regional Transit ","Danbury","CT",1051,10051,"Independent Public Agency or Authority of Transit Service","Full Reporter",168136,39,null,0,"",0,"",0,"",0,"",0,"",0,"",0,"",null,0,"",0,"",0,"",null,0,"",0,"",0,"",0,"","No"]
["Alaska Railroad Corporation","Anchorage","AK",41,41,"State Government Unit or Department of Transportation","Full Reporter",251243,39,null,676.1,"",2.6,"",0,"",0,"",0,"",4.0999999999999996,"",682.80000000000007,"",null,132,"",1,"",133,"",null,0,"",0,"",0,"",0,"","No"]
["Santa Fe Trails - City of Santa Fe","Santa Fe","NM",6077,60077,"City, County or Local Government Unit or Department of Transportation","Full Reporter",89284,39,null,0,"",0,"",0,"",0,"",0,"",0,"",0,"",null,0,"",0,"",0,"",null,0,"",0,"",0,"",0,"","No"]
["Belle Urban System - Racine","Racine","WI",5006,50006,"City, County or Local Government Unit or Department of Transportation","Full Reporter",133700,39,null,0,"",0,"",0,"",0,"",0,"",0,"",0,"",null,0,"",0,"",0,"",null,0,"",0,"",0,"",0,"","No"]
["Placer County Department of Public Works and Facilities","Auburn","CA",9196,90196,"City, County or Local Government Unit or Department of Transportation","Full Reporter",1723634,39,null,0,"",0,"",0,"",0,"",0,"",0,"",0,"",null,0,"",0,"",0,"",null,0,"",0,"",0,"",0,"","No"]
["Fayetteville Area System of Transit","Fayetteville","NC",4009,40009,"City, County or Local Government Unit or Department of Transportation","Full Reporter",310282,38,null,0,"",0,"",0,"",0,"",0,"",0,"",0,"",null,0,"",0,"",0,"",null,0,"",0,"",0,"",0,"","No"]
["Beaver County Transit Authority","Rochester","PA",3023,30023,"Independent Public Agency or Authority of Transit Service","Full Reporter",1733853,38,null,0,"",0,"",0,"",0,"",0,"",0,"",0,"",null,0,"",0,"",0,"",null,10.1,"",0,"",0,"",10.1,"","No"]
["City of Harrisonburg Department of Public Transportation","Harrisonburg","VA",3094,30094,"City, County or Local Government Unit or Department of Transportation","Full Reporter",66784,38,null,0,"",0,"",0,"",0,"",0,"",0,"",0,"",null,0,"",0,"",0,"",null,0,"",0,"",0,"",0,"","No"]
["Licking County Transit Board","Newark","OH",5163,50163,"City, County or Local Government Unit or Department of Transportation","Full Reporter",76068,38,null,0,"",0,"",0,"",0,"",0,"",0,"",0,"",null,0,"",0,"",0,"",null,0,"",0,"",0,"",0,"","No"]
["County of Atlantic","Northfield","NJ",2199,20199,"City, County or Local Government Unit or Department of Transportation","Full Reporter",248402,38,null,0,"",0,"",0,"",0,"",0,"",0,"",0,"",null,0,"",0,"",0,"",null,0,"",0,"",0,"",0,"","No"]
["River Bend Transit","Davenport","IA",7049,70049,"Private-Non-Profit Corporation","Full Reporter",280051,38,null,0,"",0,"",0,"",0,"",0,"",0,"",0,"",null,0,"",0,"",0,"",null,0,"",0,"",0,"",0,"","No"]
["Green Bay Metro","Green Bay","WI",5002,50002,"City, County or Local Government Unit or Department of Transportation","Full Reporter",206520,38,null,0,"",0,"",0,"",0,"",0,"",0,"",0,"",null,0,"",0,"",0,"",null,0,"",0,"",0,"",0,"","No"]
["Bloomington Public Transportation Corporation","Bloomington","IN",5110,50110,"Independent Public Agency or Authority of Transit Service","Full Reporter",108657,38,null,0,"",0,"",0,"",0,"",0,"",0,"",0,"",null,0,"",0,"",0,"",null,0,"",0,"",0,"",0,"","No"]
["Metropolitan Evansville Transit System","Evansville","IN",5043,50043,"City, County or Local Government Unit or Department of Transportation","Full Reporter",229351,38,null,0,"",0,"",0,"",0,"",0,"",0,"",0,"",null,0,"",0,"",0,"",null,0,"",0,"",0,"",0,"","No"]
["Butler County Regional Transit Authority","Hamilton","OH",5157,50157,"Independent Public Agency or Authority of Transit Service","Full Reporter",1624827,38,null,0,"",0,"",0,"",0,"",0,"",0,"",0,"",null,0,"",0,"",0,"",null,0,"",0,"",0,"",0,"","No"]
["Buncombe County","Asheville ","NC",4224,40224,"City, County or Local Government Unit or Department of Transportation","Full Reporter",280648,38,null,0,"",0,"",0,"",0,"",0,"",0,"",0,"",null,0,"",0,"",0,"",null,0,"",0,"",0,"",0,"","No"]
["Lakeland Area Mass Transit District ","Lakeland","FL",4031,40031,"Independent Public Agency or Authority of Transit Service","Full Reporter",262596,38,null,0,"",0,"",0,"",0,"",0,"",0,"",0,"",null,0,"",0,"",0,"",null,0,"",0,"",0,"",0,"","No"]
["Bloomington-Normal Public Transit System","Normal","IL",5047,50047,"Independent Public Agency or Authority of Transit Service","Full Reporter",132600,37,null,0,"",0,"",0,"",0,"",0,"",0,"",0,"",null,0,"",0,"",0,"",null,0,"",0,"",0,"",0,"","No"]
["Greater Lynchburg Transit Company","Lynchburg","VA",3008,30008,"Independent Public Agency or Authority of Transit Service","Full Reporter",116636,37,null,0,"",0,"",0,"",0,"",0,"",0,"",0,"",null,0,"",0,"",0,"",null,0,"",0,"",0,"",0,"","No"]
["City of Rome Transit Department","Rome","GA",4058,40058,"City, County or Local Government Unit or Department of Transportation","Full Reporter",60851,37,null,0,"",0,"",0,"",0,"",0,"",0,"",0,"",null,0,"",0,"",0,"",null,0,"",0,"",0,"",0,"","No"]
["Greene County Transit Board","Xenia","OH",5165,50165,"City, County or Local Government Unit or Department of Transportation","Full Reporter",724091,37,null,0,"",0,"",0,"",0,"",0,"",0,"",0,"",null,0,"",0,"",0,"",null,0,"",0,"",0,"",0,"","No"]
["The Tri-State Transit Authority","Huntington","WV",3002,30002,"Independent Public Agency or Authority of Transit Service","Full Reporter",202637,37,null,0,"",0,"",0,"",0,"",0,"",0,"",0,"",null,0,"",0,"",0,"",null,0,"",0,"",0,"",0,"","No"]
["Williamsburg Area Transit Authority","Williamsburg","VA",3076,30076,"Independent Public Agency or Authority of Transit Service","Full Reporter",75689,37,null,0,"",0,"",0,"",0,"",0,"",0,"",0,"",null,0,"",0,"",0,"",null,0,"",0,"",0,"",0,"","No"]
["Clay County Council on Aging, Inc., dba Clay Transit","Green Cove Springs","FL",null,40245,"Private-Non-Profit Corporation","Full Reporter",1065219,37,null,0,"",0,"",0,"",0,"",0,"",0,"",0,"",null,0,"",0,"",0,"",null,0,"",0,"",0,"",0,"","No"]
["Polk County Transit Services Division - Polk County Board of County Commissioners","Bartow","FL",4127,40127,"City, County or Local Government Unit or Department of Transportation","Full Reporter",201289,37,null,0,"",0,"",0,"",0,"",0,"",0,"",0,"",null,0,"",0,"",0,"",null,0,"",0,"",0,"",0,"","No"]
["City of Columbia","Columbia","MO",7016,70016,"City, County or Local Government Unit or Department of Transportation","Full Reporter",124748,37,null,0,"",0,"",0,"",0,"",0,"",0,"",0,"",null,0,"",0,"",0,"",null,0,"",0,"",0,"",0,"","No"]
["Collier Area Transit","Naples","FL",4140,40140,"City, County or Local Government Unit or Department of Transportation","Full Reporter",310298,36,null,0,"",0,"",0,"",0,"",0,"",0,"",0,"",null,0,"",0,"",0,"",null,0,"",0,"",0,"",0,"","No"]
["Unitrans - City of Davis/ASUCD","Davis","CA",9142,90142,"University","Full Reporter",72794,36,null,0,"",0,"",0,"",0,"",0,"",0,"",0,"",null,0,"",0,"",0,"",null,0,"",0,"",0,"",0,"","No"]
["City of Fargo, DBA:  Metropolitan Area Transit","Fargo","ND",8003,80003,"City, County or Local Government Unit or Department of Transportation","Full Reporter",176676,36,null,0,"",0,"",0,"",0,"",0,"",0,"",0,"",null,0,"",0,"",0,"",null,0,"",0,"",0,"",0,"","No"]
["Muncie Indiana Transit System","Muncie","IN",5054,50054,"City, County or Local Government Unit or Department of Transportation","Full Reporter",90580,36,null,0,"",0,"",0,"",0,"",0,"",0,"",0,"",null,0,"",0,"",0,"",null,0,"",0,"",0,"",0,"","No"]
["Decatur Public Transit System","Decatur","IL",5061,50061,"City, County or Local Government Unit or Department of Transportation","Full Reporter",93863,35,null,0,"",0,"",0,"",0,"",0,"",0,"",0,"",null,0,"",0,"",0,"",null,0,"",0,"",0,"",0,"","No"]
["Chula Vista Transit","Chula Vista","CA",9193,90193,"City, County or Local Government Unit or Department of Transportation","Full Reporter",2956746,35,null,0,"",0,"",0,"",0,"",0,"",0,"",0,"",null,0,"",0,"",0,"",null,0,"",0,"",0,"",0,"","No"]
["City of Plymouth","City of Plymouth","MN",5219,50516,"City, County or Local Government Unit or Department of Transportation","Full Reporter",2650890,35,null,0,"",0,"",0,"",0,"",0,"",0,"",0,"",null,0,"",0,"",0,"",null,0,"",0,"",36.6,"",36.6,"","No"]
["The Gulf Coast Center","Texas City","TX",6082,60082,"Independent Public Agency or Authority of Transit Service","Full Reporter",106383,35,null,0,"",0,"",0,"",0,"",0,"",0,"",0,"",null,0,"",0,"",0,"",null,0,"",0,"",0,"",0,"","No"]
["Regional Planning Commission of Greater Birmingham","Birmingham","AL",4169,40169,"MPO, COG or Other Planning Agency","Full Reporter",749495,35,null,0,"",0,"",0,"",0,"",0,"",0,"",0,"",null,0,"",0,"",0,"",null,0,"",0,"",0,"",0,"","No"]
["Transit Services of Frederick County","Frederick","MD",3072,30072,"City, County or Local Government Unit or Department of Transportation","Full Reporter",141576,34,null,0,"",0,"",0,"",0,"",0,"",0,"",0,"",null,0,"",0,"",0,"",null,0,"",0,"",0,"",0,"","No"]
["Altoona Metro Transit","Altoona","PA",3011,30011,"Independent Public Agency or Authority of Transit Service","Full Reporter",79930,34,null,0,"",0,"",0,"",0,"",0,"",0,"",0,"",null,0,"",0,"",0,"",null,0,"",0,"",0,"",0,"","No"]
["Yuba-Sutter Transit Authority","Marysville","CA",9061,90061,"Independent Public Agency or Authority of Transit Service","Full Reporter",116719,34,null,0,"",0,"",0,"",0,"",0,"",0,"",0,"",null,0,"",0,"",0,"",null,0,"",0,"",0,"",0,"","No"]
["Bay County Transportation Planning Organization","Panama City","FL",4185,40185,"MPO, COG or Other Planning Agency","Full Reporter",143280,34,null,0,"",0,"",0,"",0,"",0,"",0,"",0,"",null,0,"",0,"",0,"",null,0,"",0,"",0,"",0,"","No"]
["City of Santa Rosa","Santa Rosa","CA",9017,90017,"City, County or Local Government Unit or Department of Transportation","Full Reporter",308231,33,null,0,"",0,"",0,"",0,"",0,"",0,"",0,"",null,0,"",0,"",0,"",null,0,"",0,"",0,"",0,"",{"$f":"IF(OR(L386=\"Q\",N386=\"Q\",P386=\"Q\",R386=\"Q\",T386=\"Q\",V386=\"Q\",X386=\"Q\",AA386=\"Q\",AC386=\"Q\",AE386=\"Q\",AH386=\"Q\",AJ386=\"Q\",AL386=\"Q\",AN386=\"Q\"),\"Yes\",\"No\")","v":"No"}]
["City of Brownsville - Brownsville Metro","Brownsville","TX",6014,60014,"City, County or Local Government Unit or Department of Transportation","Full Reporter",217585,33,null,0,"",0,"",0,"",0,"",0,"",0,"",0,"",null,0,"",0,"",0,"",null,0,"",0,"",0,"",0,"","No"]
["North Carolina State University Transportation Department","Raleigh","NC",4147,40147,"University","Full Reporter",884891,33,null,0,"",0,"",0,"",0,"",0,"",0,"",0,"",null,0,"",0,"",0,"",null,0,"",0,"",0,"",0,"","No"]
["vRide, Inc. - Tucson","Tucson","AZ",9228,90228,"Private Provider Reporting on Behalf of a Public Entity","Full Reporter",843168,33,null,0,"",0,"",0,"",0,"",0,"",0,"",0,"",null,0,"",0,"",0,"",null,0,"",0,"",0,"",0,"","No"]
["Washington County Transit","West Bend","WI",5160,50160,"City, County or Local Government Unit or Department of Transportation","Full Reporter",1376476,33,null,0,"",0,"",0,"",0,"",0,"",0,"",0,"",null,0,"",0,"",0,"",null,0,"",0,"",0,"",0,"","No"]
["Council on Aging of St. Lucie, Inc.","Fort Pierce","FL",4097,40097,"Private Provider Reporting on Behalf of a Public Entity","Full Reporter",376047,32,null,0,"",0,"",0,"",0,"",0,"",0,"",0,"",null,0,"",0,"",0,"",null,0,"",0,"",0,"",0,"","No"]
["The Woodlands Township","The Woodlands","TX",6134,60134,"City, County or Local Government Unit or Department of Transportation","Full Reporter",239938,32,null,0,"",0,"",0,"",0,"",0,"",0,"",0,"",null,0,"",0,"",0,"",null,0,"",0,"",0,"",0,"","No"]
["GO Transit","Oshkosh","WI",5009,50009,"City, County or Local Government Unit or Department of Transportation","Full Reporter",74495,32,null,0,"",0,"",0,"",0,"",0,"",0,"",0,"",null,0,"",0,"",0,"",null,0,"",0,"",0,"",0,"","No"]
["Charlotte County Transit Division","Punta Gorda","FL",4129,40129,"City, County or Local Government Unit or Department of Transportation","Full Reporter",169541,32,null,0,"",0,"",0,"",0,"",0,"",0,"",0,"",null,0,"",0,"",0,"",null,0,"",0,"",0,"",0,"","No"]
["City of Huntsville, Alabama - Public Transportation Division","Huntsville","AL",4071,40071,"City, County or Local Government Unit or Department of Transportation","Full Reporter",286692,32,null,0,"",0,"",0,"",0,"",0,"",0,"",0,"",null,0,"",0,"",0,"",null,0,"",0,"",0,"",0,"","No"]
["North Township of Lake County Dial-A-Ride","Hammond","IN",5103,50103,"City, County or Local Government Unit or Department of Transportation","Full Reporter",8608208,32,null,0,"",0,"",0,"",0,"",0,"",0,"",0,"",null,0,"",0,"",0,"",null,0,"",0,"",0,"",0,"","No"]
["Monsey New Square Trails Corporation","Spring Valley","NY",2135,20135,"Private-For-Profit Corporation","Full Reporter",18351295,32,null,0,"",0,"",0,"",0,"",0,"",0,"",0,"",null,0,"",0,"",0,"",null,0,"",0,"",2.9,"",2.9,"","No"]
["Saginaw Transit Authority Regional Service","Saginaw","MI",5039,50039,"Independent Public Agency or Authority of Transit Service","Full Reporter",126265,32,null,0,"",0,"",0,"",0,"",0,"",0,"",0,"",null,0,"",0,"",0,"",null,0,"",0,"",0,"",0,"","No"]
["Billings Metropolitan Transit","Billings","MT",8004,80004,"City, County or Local Government Unit or Department of Transportation","Full Reporter",114773,31,null,0,"",0,"",0,"",0,"",0,"",0,"",0,"",null,0,"",0,"",0,"",null,0,"",0,"",0,"",0,"","No"]
["Fayette Area Coordinated Transportation","Lemont Furnace","PA",3087,30087,"City, County or Local Government Unit or Department of Transportation","Full Reporter",51370,31,null,0,"",0,"",0,"",0,"",0,"",0,"",0,"",null,0,"",0,"",0,"",null,0,"",2,"",0,"",2,"","No"]
["Centro of Oneida, Inc.","Syracuse","NY",2185,20185,"Subsidiary Unit of a Transit Agency, Reporting Separately","Full Reporter",117328,30,null,0,"",0,"",0,"",0,"",0,"",0,"",0,"",null,0,"",0,"",0,"",null,0,"",0,"",0,"",0,"","No"]
["Cedar Rapids Transit","Cedar Rapids","IA",7008,70008,"City, County or Local Government Unit or Department of Transportation","Full Reporter",177844,30,null,0,"",0,"",0,"",0,"",0,"",0,"",0,"",null,0,"",0,"",0,"",null,0,"",0,"",0,"",0,"","No"]
["Central Florida Commuter Rail","Sanford","FL",4232,40232,"State Government Unit or Department of Transportation","Full Reporter",1510516,30,null,33.5,"",0,"",0.2,"",0,"",0,"",0,"",33.700000000000003,"",null,91,"",0,"",91,"",null,0,"",0,"",0,"",0,"","No"]
["City of Jackson, Department of Planning and Development, Transit Services Division ","Jackson","MS",4015,40015,"City, County or Local Government Unit or Department of Transportation","Full Reporter",351478,30,null,0,"",0,"",0,"",0,"",0,"",0,"",0,"",null,0,"",0,"",0,"",null,0,"",0,"",0,"",0,"","No"]
["Ozaukee County Transit Services","Port Washington","WI",5161,50161,"City, County or Local Government Unit or Department of Transportation","Full Reporter",1376476,30,null,0,"",0,"",0,"",0,"",0,"",0,"",0,"",null,0,"",0,"",0,"",null,0,"",0,"",0,"",0,"","No"]
["LaCrosse Municipal Transit Utility","La Crosse","WI",5004,50004,"City, County or Local Government Unit or Department of Transportation","Full Reporter",100868,30,null,0,"",0,"",0,"",0,"",0,"",0,"",0,"",null,0,"",0,"",0,"",null,0,"",0,"",0,"",0,"","No"]
["Mid-Ohio Regional Planning Commission","Columbus","OH",5191,50191,"MPO, COG or Other Planning Agency","Full Reporter",1368035,29,null,0,"",0,"",0,"",0,"",0,"",0,"",0,"",null,0,"",0,"",0,"",null,0,"",0,"",0,"",0,"","No"]
["University of Iowa","Iowa City","IA",7019,70019,"University","Full Reporter",106621,29,null,0,"",0,"",0,"",0,"",0,"",0,"",0,"",null,0,"",0,"",0,"",null,0,"",0,"",0,"",0,"","No"]
["New York City Department of Transportation","New York","NY",2082,20082,"City, County or Local Government Unit or Department of Transportation","Full Reporter",18351295,29,null,0,"",0,"",0,"",0,"",0,"",0,"",0,"",null,0,"",0,"",0,"",null,0,"",0,"",0,"",0,"","No"]
["City of Kokomo","Kokomo","IN",5145,50145,"City, County or Local Government Unit or Department of Transportation","Full Reporter",62182,29,null,0,"",0,"",0,"",0,"",0,"",0,"",0,"",null,0,"",0,"",0,"",null,0,"",0,"",0,"",0,"","No"]
["Redding Area Bus Authority","Redding","CA",9093,90093,"Independent Public Agency or Authority of Transit Service","Full Reporter",117731,29,null,0,"",0,"",0,"",0,"",0,"",0,"",0,"",null,0,"",0,"",0,"",null,0,"",0,"",0,"",0,"","No"]
["Valley Metro Rail, Inc.","Phoenix","AZ",9209,90209,"Other Publicly-Owned or Privately Chartered Corporation","Full Reporter",3629114,28,null,42.199999999999996,"",0.1,"",0.7,"",0,"",0,"",0,"",42.999999999999993,"",null,139,"",1,"",140,"",null,0,"",0,"",0,"",0,"","No"]
["Sioux City Transit System","Sioux City","IA",7012,70012,"City, County or Local Government Unit or Department of Transportation","Full Reporter",106494,28,null,0,"",0,"",0,"",0,"",0,"",0,"",0,"",null,0,"",0,"",0,"",null,0,"",0,"",0,"",0,"","No"]
["Santa Maria Area Transit","Santa Maria","CA",9087,90087,"City, County or Local Government Unit or Department of Transportation","Full Reporter",130447,28,null,0,"",0,"",0,"",0,"",0,"",0,"",0,"",null,0,"",0,"",0,"",null,0,"",0,"",0,"",0,"","No"]
["Shoreline Metro","Sheboygan","WI",5088,50088,"City, County or Local Government Unit or Department of Transportation","Full Reporter",71313,28,null,0,"",0,"",0,"",0,"",0,"",0,"",0,"",null,0,"",0,"",0,"",null,0,"",0,"",0,"",0,"","No"]
["Missoula Urban Transportation District","Missoula","MT",8009,80009,"Independent Public Agency or Authority of Transit Service","Full Reporter",82157,28,null,0,"",0,"",0,"",0,"",0,"",0,"",0,"",null,0,"",0,"",0,"",null,0,"",0,"",0,"",0,"","No"]
["Indian River County","Vero Beach","FL",4104,40104,"City, County or Local Government Unit or Department of Transportation","Full Reporter",149422,28,null,0,"",0,"",0,"",0,"",0,"",0,"",0,"",null,0,"",0,"",0,"",null,0,"",0,"",0,"",0,"","No"]
["Ozark Regional Transit","Springdale","AR",6072,60072,"Independent Public Agency or Authority of Transit Service","Full Reporter",295083,28,null,0,"",0,"",0,"",0,"",0,"",0,"",0,"",null,0,"",0,"",0,"",null,0,"",0,"",0,"",0,"","No"]
["Handitran Special Transit Division - City of Arlington","Arlington","TX",6041,60041,"City, County or Local Government Unit or Department of Transportation","Full Reporter",5121892,28,null,0,"",0,"",0,"",0,"",0,"",0,"",0,"",null,0,"",0,"",0,"",null,0,"",0,"",0,"",0,"","No"]
["County Commissioners of Charles County, MD","Port Tobacco","MD",3088,30088,"City, County or Local Government Unit or Department of Transportation","Full Reporter",109919,27,null,0,"",0,"",0,"",0,"",0,"",0,"",0,"",null,0,"",0,"",0,"",null,0,"",0,"",0,"",0,"","No"]
["Shenango Valley Shuttle Service","Hermitage","PA",3055,30055,"City, County or Local Government Unit or Department of Transportation","Full Reporter",387550,27,null,0,"",0,"",0,"",0,"",0,"",0,"",0,"",null,0,"",0,"",0,"",null,0,"",0,"",0,"",0,"","No"]
["City of Montgomery-Montgomery Area Transit System","Montgomery","AL",4044,40044,"City, County or Local Government Unit or Department of Transportation","Full Reporter",263907,27,null,0,"",0,"",0,"",0,"",0,"",0,"",0,"",null,0,"",0,"",0,"",null,0,"",0,"",0,"",0,"","No"]
["Williamsport Bureau of Transportation","Williamsport","PA",3026,30026,"City, County or Local Government Unit or Department of Transportation","Full Reporter",56142,26,null,0,"",0,"",0,"",0,"",0,"",0,"",0,"",null,0,"",0,"",0,"",null,0,"",0,"",0,"",0,"","No"]
["Imperial County Transportation Commission","El Centro","CA",9226,90226,"Independent Public Agency or Authority of Transit Service","Full Reporter",107672,26,null,0,"",0,"",0,"",0,"",0,"",0,"",0,"",null,0,"",0,"",0,"",null,0,"",0,"",0,"",0,"","No"]
["Greater Portland Transit District","Portland","ME",1016,10016,"Independent Public Agency or Authority of Transit Service","Full Reporter",203914,26,null,0,"",0,"",0,"",0,"",0,"",0,"",0,"",null,0,"",0,"",0,"",null,0,"",0,"",0,"",0,"","No"]
["Flagler Co. Public Transportation","Bunnell","FL","4R02-028",41068,"City, County or Local Government Unit or Department of Transportation","Full Reporter",349064,26,null,0,"",0,"",0,"",0,"",0,"",0,"",0,"",null,0,"",0,"",0,"",null,0,"",0,"",0,"",0,"","No"]
["Adirondack Transit Lines, Inc,","Hurley","NY",2177,20177,"Private-For-Profit Corporation","Full Reporter",18351295,26,null,0,"",0,"",0,"",0,"",0,"",0,"",0,"",null,0,"",0,"",0,"",null,0,"",2.9,"",0,"",2.9,"","No"]
["Norwalk Transit System","Norwalk","CA",9022,90022,"City, County or Local Government Unit or Department of Transportation","Full Reporter",12150996,26,null,0,"",0,"",0,"",0,"",0,"",0,"",0,"",null,0,"",0,"",0,"",null,0,"",0,"",0,"",0,"","No"]
["Altamont Corridor Express","Stockton","CA",9182,90182,"Independent Public Agency or Authority of Transit Service","Full Reporter",370583,26,null,77.5,"",0,"",0.5,"",9.5,"",2,"",0.5,"",90,"",null,127,"",0,"",127,"",null,0,"",0,"",0,"",0,"","No"]
["City of Riverside Special Transportation","Riverside","CA",9086,90086,"City, County or Local Government Unit or Department of Transportation","Full Reporter",1932666,25,null,0,"",0,"",0,"",0,"",0,"",0,"",0,"",null,0,"",0,"",0,"",null,0,"",0,"",0,"",0,"","No"]
["Athens Transit System","Athens","GA",4047,40047,"City, County or Local Government Unit or Department of Transportation","Full Reporter",128754,25,null,0,"",0,"",0,"",0,"",0,"",0,"",0,"",null,0,"",0,"",0,"",null,0,"",0,"",0,"",0,"","No"]
["Laguna Beach Municipal Transit","Laguna Beach","CA",9119,90119,"City, County or Local Government Unit or Department of Transportation","Full Reporter",583681,25,null,0,"",0,"",0,"",0,"",0,"",0,"",0,"",null,0,"",0,"",0,"",null,0,"",0,"",0,"",0,"","No"]
["University Of New Hampshire - University Transportation Services","Durham","NH",1119,10119,"University","Full Reporter",88087,25,null,0,"",0,"",0,"",0,"",0,"",0,"",0,"",null,0,"",0,"",0,"",null,0,"",0,"",0,"",0,"","No"]
["Waco Transit System, Inc.","Waco","TX",6012,60012,"City, County or Local Government Unit or Department of Transportation","Full Reporter",172378,24,null,0,"",0,"",0,"",0,"",0,"",0,"",0,"",null,0,"",0,"",0,"",null,0,"",0,"",0,"",0,"","No"]
["County of Lebanon Transit Authority","Lebanon","PA",3095,30095,"Independent Public Agency or Authority of Transit Service","Full Reporter",77086,24,null,0,"",0,"",0,"",0,"",0,"",0,"",0,"",null,0,"",0,"",0,"",null,0,"",0,"",0,"",0,"","No"]
["City of Jackson Transportation Authority","Jackson","MI",5034,50034,"Independent Public Agency or Authority of Transit Service","Full Reporter",90057,24,null,0,"",0,"",0,"",0,"",0,"",0,"",0,"",null,0,"",0,"",0,"",null,0,"",0,"",0,"",0,"","No"]
["City Utilities of Springfield ","Springfield","MO",7003,70003,"City, County or Local Government Unit or Department of Transportation","Full Reporter",273724,24,null,0,"",0,"",0,"",0,"",0,"",0,"",0,"",null,0,"",0,"",0,"",null,0,"",0,"",0,"",0,"","No"]
["Pueblo Transit System","Pueblo","CO",8007,80007,"City, County or Local Government Unit or Department of Transportation","Full Reporter",136550,24,null,0,"",0,"",0,"",0,"",0,"",0,"",0,"",null,0,"",0,"",0,"",null,0,"",0,"",0,"",0,"","No"]
["RiverCities Transit","Longview","WA",16,16,"City, County or Local Government Unit or Department of Transportation","Full Reporter",63952,24,null,0,"",0,"",0,"",0,"",0,"",0,"",0,"",null,0,"",0,"",0,"",null,0,"",0,"",0,"",0,"","No"]
["Northern Arizona Intergovernmental Public Transportation Authority","Flagstaff","AZ",9219,90219,"Independent Public Agency or Authority of Transit Service","Full Reporter",71957,24,null,0,"",0,"",0,"",0,"",0,"",0,"",0,"",null,0,"",0,"",0,"",null,0,"",0,"",0,"",0,"","No"]
["Woods Hole, Martha's Vineyard and Nantucket Steamship Authority","Woods Hole","MA",null,10183,"Independent Public Agency or Authority of Transit Service","Full Reporter",246695,24,null,0,"",0,"",0,"",0,"",0,"",0,"",0,"",null,0,"",0,"",0,"",null,0,"",0,"",0,"",0,"","No"]
["Berkshire Regional Transit Authority","Pittsfield","MA",1007,10007,"Subsidiary Unit of a Transit Agency, Reporting Separately","Full Reporter",59124,23,null,0,"",0,"",0,"",0,"",0,"",0,"",0,"",null,0,"",0,"",0,"",null,0,"",0,"",0,"",0,"","No"]
["Connecticut Department of Transportation - CTTransit New Britain -Dattco.","New Britain","CT",1045,10045,"Private Provider Reporting on Behalf of a Public Entity","Full Reporter",924859,23,null,0,"",0,"",0,"",0,"",0,"",0,"",0,"",null,0,"",0,"",0,"",null,18.2,"",0,"",0,"",18.2,"","No"]
["Johnson County SEATS","Iowa City","IA",7045,70045,"City, County or Local Government Unit or Department of Transportation","Full Reporter",106621,23,null,0,"",0,"",0,"",0,"",0,"",0,"",0,"",null,0,"",0,"",0,"",null,0,"",0,"",0,"",0,"","No"]
["Lafayette Transit System","Lafayette","LA",6038,60038,"City, County or Local Government Unit or Department of Transportation","Full Reporter",252720,23,null,0,"",0,"",0,"",0,"",0,"",0,"",0,"",null,0,"",0,"",0,"",null,0,"",0,"",0,"",0,"","No"]
["Cache Valley Transit District","Logan","UT",8028,80028,"Independent Public Agency or Authority of Transit Service","Full Reporter",94983,22,null,0,"",0,"",0,"",0,"",0,"",0,"",0,"",null,0,"",0,"",0,"",null,0,"",0,"",0,"",0,"","No"]
["Ulster County Area Transit","Kingston","NY",2178,20178,"City, County or Local Government Unit or Department of Transportation","Full Reporter",423566,22,null,0,"",0,"",0,"",0,"",0,"",0,"",0,"",null,0,"",0,"",0,"",null,0,"",0,"",0,"",0,"","No"]
["Greenville Transit Authority","Greenville","SC",4053,40053,"Independent Public Agency or Authority of Transit Service","Full Reporter",400492,22,null,0,"",0,"",0,"",0,"",0,"",0,"",0,"",null,0,"",0,"",0,"",null,0,"",0,"",0,"",0,"","No"]
["Iowa City Transit","Iowa City","IA",7018,70018,"City, County or Local Government Unit or Department of Transportation","Full Reporter",106621,21,null,0,"",0,"",0,"",0,"",0,"",0,"",0,"",null,0,"",0,"",0,"",null,0,"",0,"",0,"",0,"","No"]
["Macatawa Area Express Transportation Authority","Holland","MI",5184,50184,"Independent Public Agency or Authority of Transit Service","Full Reporter",99941,21,null,0,"",0,"",0,"",0,"",0,"",0,"",0,"",null,0,"",0,"",0,"",null,0,"",0,"",0,"",0,"",{"$f":"IF(OR(L450=\"Q\",N450=\"Q\",P450=\"Q\",R450=\"Q\",T450=\"Q\",V450=\"Q\",X450=\"Q\",AA450=\"Q\",AC450=\"Q\",AE450=\"Q\",AH450=\"Q\",AJ450=\"Q\",AL450=\"Q\",AN450=\"Q\"),\"Yes\",\"No\")","v":"No"}]
["Huntington Area Rapid Transit","Huntington Station","NY",2071,20071,"City, County or Local Government Unit or Department of Transportation","Full Reporter",18351295,21,null,0,"",0,"",0,"",0,"",0,"",0,"",0,"",null,0,"",0,"",0,"",null,0,"",0,"",0,"",0,"","No"]
["Southeast Area Transit","Preston","CT",1040,10040,"Independent Public Agency or Authority of Transit Service","Full Reporter",209190,21,null,0,"",0,"",0,"",0,"",0,"",0,"",0,"",null,0,"",0,"",0,"",null,0,"",0,"",0,"",0,"","No"]
["Trumbull County Transit Board","Warren","OH",5197,50197,"City, County or Local Government Unit or Department of Transportation","Full Reporter",387550,21,null,0,"",0,"",0,"",0,"",0,"",0,"",0,"",null,0,"",0,"",0,"",null,0,"",0,"",0,"",0,"","No"]
["The Transportation Management Association Group","Franklin","TN",4178,40178,"Private Provider Reporting on Behalf of a Public Entity","Full Reporter",969587,21,null,0,"",0,"",0,"",0,"",0,"",0,"",0,"",null,0,"",0,"",0,"",null,0,"",0,"",0,"",0,"","No"]
["Great Falls Transit District","Great Falls","MT",8012,80012,"Independent Public Agency or Authority of Transit Service","Full Reporter",65207,20,null,0,"",0,"",0,"",0,"",0,"",0,"",0,"",null,0,"",0,"",0,"",null,0,"",0,"",0,"",0,"","No"]
["Northern New England Passenger Rail Authority","Portland","ME",1115,10115,"Independent Public Agency or Authority of Transit Service","Full Reporter",203914,20,null,142.6,"",0,"",0,"",0,"",0,"",0,"",142.6,"",null,103,"",0,"",103,"",null,0,"",0,"",0,"",0,"","No"]
["Cumberland Area Transit System","Bridgeton","NJ",2193,20193,"City, County or Local Government Unit or Department of Transportation","Full Reporter",5441567,20,null,0,"",0,"",0,"",0,"",0,"",0,"",0,"",null,0,"",0,"",0,"",null,0,"",0,"",0,"",0,"","No"]
["Kings County Area Public Transit Agency","Hanford","CA",9200,90200,"Independent Public Agency or Authority of Transit Service","Full Reporter",87941,20,null,0,"",0,"",0,"",0,"",0,"",0,"",0,"",null,0,"",0,"",0,"",null,0,"",0,"",0,"",0,"","No"]
["Gary Public Transportation Corporation","Gary","IN",5045,50045,"City, County or Local Government Unit or Department of Transportation","Full Reporter",8608208,20,null,0,"",0,"",0,"",0,"",0,"",0,"",0,"",null,0,"",0,"",0,"",null,0,"",0,"",0,"",0,"","No"]
["University of Minnesota Transit","Minneapolis","MN",5218,50515,"University","Full Reporter",2650890,20,null,0,"",0,"",0,"",0,"",0,"",0,"",0,"",null,0,"",0,"",0,"",null,6.4,"",0,"",0,"",6.4,"","No"]
["Washington State Ferries","Seattle","WA",35,35,"State Government Unit or Department of Transportation","Full Reporter",3059393,19,null,0,"",0,"",0,"",0,"",0,"",0,"",0,"",null,0,"",0,"",0,"",null,0,"",0,"",0,"",0,"","No"]
["Mid Mon Valley Transit Authority","Charleroi","PA",3061,30061,"Independent Public Agency or Authority of Transit Service","Full Reporter",66086,19,null,0,"",0,"",0,"",0,"",0,"",0,"",0,"",null,0,"",0,"",0,"",null,7.8,"",0,"",0,"",7.8,"","No"]
["Augusta Richmond County Transit Department","Augusta","GA",4023,40023,"City, County or Local Government Unit or Department of Transportation","Full Reporter",386787,19,null,0,"",0,"",0,"",0,"",0,"",0,"",0,"",null,0,"",0,"",0,"",null,0,"",0,"",0,"",0,"","No"]
["Plymouth & Brockton Street Railway Company","Plymouth","MA",1117,10117,"Private-For-Profit Corporation","Full Reporter",4181019,18,null,0,"",0,"",0,"",0,"",0,"",0,"",0,"",null,0,"",0,"",0,"",null,0,"",0,"",0,"",0,"","No"]
["City of Scottsdale - Scottsdale Trolley","Scottsdale","AZ",9131,90131,"City, County or Local Government Unit or Department of Transportation","Full Reporter",3629114,18,null,0,"",0,"",0,"",0,"",0,"",0,"",0,"",null,0,"",0,"",0,"",null,0,"",0,"",0,"",0,"","No"]
["Cities Area Transit","Grand Forks","ND",8008,80008,"City, County or Local Government Unit or Department of Transportation","Full Reporter",61270,18,null,0,"",0,"",0,"",0,"",0,"",0,"",0,"",null,0,"",0,"",0,"",null,0,"",0,"",0,"",0,"","No"]
["Waccamaw Regional Transportation Authority","Conway","SC",4102,40102,"Independent Public Agency or Authority of Transit Service","Full Reporter",215304,18,null,0,"",0,"",0,"",0,"",0,"",0,"",0,"",null,0,"",0,"",0,"",null,0,"",0,"",0,"",0,"","No"]
["Medina County Public Transit","Medina","OH",5198,50198,"City, County or Local Government Unit or Department of Transportation","Full Reporter",1780673,18,null,0,"",0,"",0,"",0,"",0,"",0,"",0,"",null,0,"",0,"",0,"",null,0,"",0,"",0,"",0,"","No"]
["City of Glendale Transit","Glendale","AZ",9034,90034,"City, County or Local Government Unit or Department of Transportation","Full Reporter",3629114,18,null,0,"",0,"",0,"",0,"",0,"",0,"",0,"",null,0,"",0,"",0,"",null,0,"",0,"",0,"",0,"","No"]
["Beaumont Municipal Transit System","Beaumont","TX",6016,60016,"City, County or Local Government Unit or Department of Transportation","Full Reporter",147922,18,null,0,"",0,"",0,"",0,"",0,"",0,"",0,"",null,0,"",0,"",0,"",null,0,"",0,"",0,"",0,"","No"]
["River Valley Metro Mass Transit District","Bourbonnais","IL",5159,50159,"City, County or Local Government Unit or Department of Transportation","Full Reporter",81926,17,null,0,"",0,"",0,"",0,"",0,"",0,"",0,"",null,0,"",0,"",0,"",null,0,"",0,"",0,"",0,"","No"]
["Miami County Public Transit","Troy","OH",5169,50169,"City, County or Local Government Unit or Department of Transportation","Full Reporter",724091,17,null,0,"",0,"",0,"",0,"",0,"",0,"",0,"",null,0,"",0,"",0,"",null,0,"",0,"",0,"",0,"","No"]
["Cooperative Alliance for Seacoast Transportation","Dover","NH",1086,10086,"Independent Public Agency or Authority of Transit Service","Full Reporter",88087,17,null,0,"",0,"",0,"",0,"",0,"",0,"",0,"",null,0,"",0,"",0,"",null,0,"",0,"",0,"",0,"","No"]
["Worcester Regional Transit Authority COA","Worcester","MA",1126,10126,"Consolidated Reporter","Full Reporter",486514,16,null,0,"",0,"",0,"",0,"",0,"",0,"",0,"",null,0,"",0,"",0,"",null,0,"",0,"",0,"",0,"","No"]
["Middletown Transit District","Middletown","CT",1063,10063,"Independent Public Agency or Authority of Transit Service","Full Reporter",924859,16,null,0,"",0,"",0,"",0,"",0,"",0,"",0,"",null,0,"",0,"",0,"",null,0,"",0,"",0,"",0,"","No"]
["City of Lodi - Transit Division","Lodi","CA",9175,90175,"City, County or Local Government Unit or Department of Transportation","Full Reporter",68738,16,null,0,"",0,"",0,"",0,"",0,"",0,"",0,"",null,0,"",0,"",0,"",null,0,"",0,"",0,"",0,"","No"]
["Ohio Valley Regional Transportation Authority","Wheeling","WV",3035,30035,"Independent Public Agency or Authority of Transit Service","Full Reporter",81249,16,null,0,"",0,"",0,"",0,"",0,"",0,"",0,"",null,0,"",0,"",0,"",null,0,"",0,"",0,"",0,"","No"]
["Mesa County","Grand Junction","CO",8016,80016,"City, County or Local Government Unit or Department of Transportation","Full Reporter",128124,16,null,0,"",0,"",0,"",0,"",0,"",0,"",0,"",null,0,"",0,"",0,"",null,0,"",0,"",0,"",0,"","No"]
["City of Arcadia Transit","Arcadia","CA",9044,90044,"City, County or Local Government Unit or Department of Transportation","Full Reporter",12150996,16,null,0,"",0,"",0,"",0,"",0,"",0,"",0,"",null,0,"",0,"",0,"",null,0,"",0,"",0,"",0,"","No"]
["Michiana Area Council of Governments","South Bend","IN",5149,50149,"MPO, COG or Other Planning Agency","Full Reporter",143592,16,null,0,"",0,"",0,"",0,"",0,"",0,"",0,"",null,0,"",0,"",0,"",null,0,"",0,"",0,"",0,"","No"]
["ART (Asheville Redefines Transit)","Asheville","NC",4005,40005,"City, County or Local Government Unit or Department of Transportation","Full Reporter",280648,16,null,0,"",0,"",0,"",0,"",0,"",0,"",0,"",null,0,"",0,"",0,"",null,0,"",0,"",0,"",0,"","No"]
["Nashua Transit System","Nashua","NH",1087,10087,"City, County or Local Government Unit or Department of Transportation","Full Reporter",226400,15,null,0,"",0,"",0,"",0,"",0,"",0,"",0,"",null,0,"",0,"",0,"",null,0,"",0,"",0,"",0,"","No"]
["Jackson Transit Authority","Jackson","TN",4057,40057,"Independent Public Agency or Authority of Transit Service","Full Reporter",71880,15,null,0,"",0,"",0,"",0,"",0,"",0,"",0,"",null,0,"",0,"",0,"",null,0,"",0,"",0,"",0,"","No"]
["Opportunity Enterprises, Inc.","Valparaiso","IN",5131,50131,"Private-Non-Profit Corporation","Full Reporter",8608208,15,null,0,"",0,"",0,"",0,"",0,"",0,"",0,"",null,0,"",0,"",0,"",null,0,"",0,"",0,"",0,"","No"]
["Delaware County Transit Board","Delaware","OH",5199,50199,"Independent Public Agency or Authority of Transit Service","Full Reporter",1368035,15,null,0,"",0,"",0,"",0,"",0,"",0,"",0,"",null,0,"",0,"",0,"",null,0,"",0,"",0,"",0,"","No"]
["City of Portland","Portland","OR",58,58,"City, County or Local Government Unit or Department of Transportation","Full Reporter",1849898,14,null,0,"",14.8,"",0,"",0,"",0,"",0,"",14.8,"",null,0,"",191,"",191,"",null,0,"",0,"",0,"",0,"","No"]
["Milford Transit District","Milford","CT",1107,10107,"Independent Public Agency or Authority of Transit Service","Full Reporter",923311,14,null,0,"",0,"",0,"",0,"",0,"",0,"",0,"",null,0,"",0,"",0,"",null,0,"",0,"",0,"",0,"","No"]
["City of Redondo Beach - Beach Cities Transit","Redondo Beach","CA",9214,90214,"City, County or Local Government Unit or Department of Transportation","Full Reporter",12150996,14,null,0,"",0,"",0,"",0,"",0,"",0,"",0,"",null,0,"",0,"",0,"",null,0,"",0,"",0,"",0,"","No"]
["City of Commerce Municipal Buslines","Commerce","CA",9043,90043,"City, County or Local Government Unit or Department of Transportation","Full Reporter",12150996,14,null,0,"",0,"",0,"",0,"",0,"",0,"",0,"",null,0,"",0,"",0,"",null,0,"",0,"",0,"",0,"","No"]
["South Lake County Community Services, Inc.","Crown Point","IN",5167,50167,"Private-Non-Profit Corporation","Full Reporter",8608208,14,null,0,"",0,"",0,"",0,"",0,"",0,"",0,"",null,0,"",0,"",0,"",null,0,"",0,"",0,"",0,"","No"]
["Albany Transit System","Albany","GA",4021,40021,"City, County or Local Government Unit or Department of Transportation","Full Reporter",95779,14,null,0,"",0,"",0,"",0,"",0,"",0,"",0,"",null,0,"",0,"",0,"",null,0,"",0,"",0,"",0,"","No"]
["City of Petaluma","Petaluma","CA",9213,90213,"City, County or Local Government Unit or Department of Transportation","Full Reporter",64078,14,null,0,"",0,"",0,"",0,"",0,"",0,"",0,"",null,0,"",0,"",0,"",null,0,"",0,"",0,"",0,"","No"]
["Putnam County Transit","Carmel","NY",2096,20096,"City, County or Local Government Unit or Department of Transportation","Full Reporter",18351295,14,null,0,"",0,"",0,"",0,"",0,"",0,"",0,"",null,0,"",0,"",0,"",null,0,"",0,"",0,"",0,"","No"]
["Connecticut Department of Transportation -CTTRANSIT New Britain ","Berlin","CT",1130,10130,"Private Provider Reporting on Behalf of a Public Entity","Full Reporter",924859,13,null,0,"",0,"",0,"",0,"",0,"",0,"",0,"",null,0,"",0,"",0,"",null,0,"",0,"",0,"",0,"","No"]
["Valley Transit District","Derby","CT",1042,10042,"Independent Public Agency or Authority of Transit Service","Full Reporter",923311,12,null,0,"",0,"",0,"",0,"",0,"",0,"",0,"",null,0,"",0,"",0,"",null,0,"",0,"",0,"",0,"","No"]
["Monroe Bus Corporation","Brooklyn","NY",2137,20137,"Private-For-Profit Corporation","Full Reporter",423566,12,null,0,"",0,"",0,"",0,"",0,"",0,"",0,"",null,0,"",0,"",0,"",null,0,"",0,"",0,"",0,"","No"]
["Centro of Oswego, Inc.","Syracuse","NY",2172,20172,"Subsidiary Unit of a Transit Agency, Reporting Separately","Full Reporter",412317,11,null,0,"",0,"",0,"",0,"",0,"",0,"",0,"",null,0,"",0,"",0,"",null,0,"",0,"",0,"",0,"","No"]
["Centro of Cayuga, Inc.","Syracuse","NY",2116,20116,"Subsidiary Unit of a Transit Agency, Reporting Separately","Full Reporter",412317,11,null,0,"",0,"",0,"",0,"",0,"",0,"",0,"",null,0,"",0,"",0,"",null,0,"",0,"",0,"",0,"","No"]
["City of Corvallis","Corvallis","OR",47,47,"City, County or Local Government Unit or Department of Transportation","Full Reporter",62433,11,null,0,"",0,"",0,"",0,"",0,"",0,"",0,"",null,0,"",0,"",0,"",null,0,"",0,"",0,"",0,"","No"]
["City of Moorhead, DBA: Metropolitan Area Transit","Moorhead","MN",5026,50026,"City, County or Local Government Unit or Department of Transportation","Full Reporter",176676,11,null,0,"",0,"",0,"",0,"",0,"",0,"",0,"",null,0,"",0,"",0,"",null,0,"",0,"",0,"",0,"","No"]
["Detroit Transportation Corporation","Detroit","MI",5141,50141,"Independent Public Agency or Authority of Transit Service","Full Reporter",3734090,10,null,0,"",0,"",2.9,"",0,"",0,"",0,"",2.9,"",null,0,"",0,"",0,"",null,0,"",0,"",0,"",0,"","No"]
["City of San Luis Obispo","San Luis Obispo","CA",9156,90156,"City, County or Local Government Unit or Department of Transportation","Full Reporter",59219,10,null,0,"",0,"",0,"",0,"",0,"",0,"",0,"",null,0,"",0,"",0,"",null,0,"",0,"",0,"",0,"","No"]
["Terre Haute Transit Utility","Terre Haute","IN",5053,50053,"City, County or Local Government Unit or Department of Transportation","Full Reporter",92742,10,null,0,"",0,"",0,"",0,"",0,"",0,"",0,"",null,0,"",0,"",0,"",null,0,"",0,"",0,"",0,"","No"]
["City of Tulare","Tulare","CA",9244,90244,"City, County or Local Government Unit or Department of Transportation","Full Reporter",219454,10,null,0,"",0,"",0,"",0,"",0,"",0,"",0,"",null,0,"",0,"",0,"",null,0,"",0,"",0,"",0,"","No"]
["Plaquemines Parish Government","Belle Chasse","LA",6127,60127,"City, County or Local Government Unit or Department of Transportation","Full Reporter",899703,10,null,0,"",0,"",0,"",0,"",0,"",0,"",0,"",null,0,"",0,"",0,"",null,0,"",0,"",0,"",0,"","No"]
["Martin County","Stuart","FL",4192,40192,"City, County or Local Government Unit or Department of Transportation","Full Reporter",376047,9,null,0,"",0,"",0,"",0,"",0,"",0,"",0,"",null,0,"",0,"",0,"",null,0,"",0,"",0,"",0,"","No"]
["City of Washington","Washington","PA",3101,30101,"City, County or Local Government Unit or Department of Transportation","Full Reporter",1733853,9,null,0,"",0,"",0,"",0,"",0,"",0,"",0,"",null,0,"",0,"",0,"",null,0,"",0,"",0,"",0,"","No"]
["City of Long Beach","Long Beach","NY",2006,20006,"City, County or Local Government Unit or Department of Transportation","Full Reporter",18351295,9,null,0,"",0,"",0,"",0,"",0,"",0,"",0,"",null,0,"",0,"",0,"",null,0,"",0,"",0,"",0,"","No"]
["Puerto Rico Maritime Transport Authority ","Puerto Real","PR",4175,40175,"State Government Unit or Department of Transportation","Full Reporter",2148346,9,null,0,"",0,"",0,"",0,"",0,"",0,"",0,"",null,0,"",0,"",0,"",null,0,"",0,"",0,"",0,"","No"]
["City of Turlock","Turlock","CA",9201,90201,"City, County or Local Government Unit or Department of Transportation","Full Reporter",99904,8,null,0,"",0,"",0,"",0,"",0,"",0,"",0,"",null,0,"",0,"",0,"",null,0,"",0,"",0,"",0,"","No"]
["City of Valparaiso","Valparaiso","IN",5183,50183,"City, County or Local Government Unit or Department of Transportation","Full Reporter",8608208,8,null,0,"",0,"",0,"",0,"",0,"",0,"",0,"",null,0,"",0,"",0,"",null,0,"",0,"",0,"",0,"","No"]
["City of Seattle - Seattle Center Monorail Transit","Seattle","WA",23,23,"City, County or Local Government Unit or Department of Transportation","Full Reporter",3059393,8,null,0,"",0,"",1.8,"",0,"",0,"",0,"",1.8,"",null,0,"",0,"",0,"",null,0,"",0,"",0,"",0,"","No"]
["City of Fairfax CUE Bus","Fairfax","VA",3058,30058,"City, County or Local Government Unit or Department of Transportation","Full Reporter",4586770,8,null,0,"",0,"",0,"",0,"",0,"",0,"",0,"",null,0,"",0,"",0,"",null,0,"",0,"",0,"",0,"","No"]
["City of Ocala, Florida","Ocala","FL",4120,40120,"City, County or Local Government Unit or Department of Transportation","Full Reporter",156909,8,null,0,"",0,"",0,"",0,"",0,"",0,"",0,"",null,0,"",0,"",0,"",null,0,"",0,"",0,"",0,"",{"$f":"IF(OR(L514=\"Q\",N514=\"Q\",P514=\"Q\",R514=\"Q\",T514=\"Q\",V514=\"Q\",X514=\"Q\",AA514=\"Q\",AC514=\"Q\",AE514=\"Q\",AH514=\"Q\",AJ514=\"Q\",AL514=\"Q\",AN514=\"Q\"),\"Yes\",\"No\")","v":"No"}]
["San Francisco Bay Area Water Emergency Transportation Authority","San Francisco","CA",9225,90225,"Independent Public Agency or Authority of Transit Service","Full Reporter",3281212,8,null,0,"",0,"",0,"",0,"",0,"",0,"",0,"",null,0,"",0,"",0,"",null,0,"",0,"",0,"",0,"","No"]
["Porter County Aging and Community Services, Inc.","Valparaiso","IN",5179,50179,"Private-Non-Profit Corporation","Full Reporter",8608208,7,null,0,"",0,"",0,"",0,"",0,"",0,"",0,"",null,0,"",0,"",0,"",null,0,"",0,"",0,"",0,"","No"]
["City of La Mirada Transit","La Mirada","CA",9024,90024,"City, County or Local Government Unit or Department of Transportation","Full Reporter",12150996,7,null,0,"",0,"",0,"",0,"",0,"",0,"",0,"",null,0,"",0,"",0,"",null,0,"",0,"",0,"",0,"","No"]
["Coralville Transit System","Coralville","IA",7030,70030,"City, County or Local Government Unit or Department of Transportation","Full Reporter",106621,7,null,0,"",0,"",0,"",0,"",0,"",0,"",0,"",null,0,"",0,"",0,"",null,0,"",0,"",0,"",0,"","No"]
["Borough of Pottstown - Pottstown Area Rapid Transit","Pottstown","PA",3077,30077,"City, County or Local Government Unit or Department of Transportation","Full Reporter",107682,6,null,0,"",0,"",0,"",0,"",0,"",0,"",0,"",null,0,"",0,"",0,"",null,0,"",0,"",0,"",0,"","No"]
["Private Transportation Corporation","Brooklyn","NY",2175,20175,"Private-For-Profit Corporation","Full Reporter",18351295,6,null,0,"",0,"",0,"",0,"",0,"",0,"",0,"",null,0,"",0,"",0,"",null,0,"",0,"",0,"",0,"","No"]
["City of Fort Lauderdale","Fort Lauderdale","FL",null,44929,"City, County or Local Government Unit or Department of Transportation","Full Reporter",5502379,6,null,0,"",0,"",0,"",0,"",0,"",0,"",0,"",null,0,"",0,"",0,"",null,0,"",0,"",0,"",0,"","No"]
["The University of Montana - ASUM Transportation","Missoula","MT",8107,80107,"University","Full Reporter",82157,6,null,0,"",0,"",0,"",0,"",0,"",0,"",0,"",null,0,"",0,"",0,"",null,0,"",0,"",0,"",0,"","No"]
["City of Maple Grove","Maple Grove","MN",5220,50517,"City, County or Local Government Unit or Department of Transportation","Full Reporter",2650890,6,null,0,"",0,"",0,"",0,"",0,"",0,"",0,"",null,0,"",0,"",0,"",null,0,"",0,"",0,"",0,"","No"]
["BillyBey Ferry Company, LLC","New York","NY",2189,20189,"Private-For-Profit Corporation","Full Reporter",18351295,6,null,0,"",0,"",0,"",0,"",0,"",0,"",0,"",null,0,"",0,"",0,"",null,0,"",0,"",0,"",0,"","No"]
["Peoria Transit","Peoria","AZ",9140,90140,"City, County or Local Government Unit or Department of Transportation","Full Reporter",3629114,5,null,0,"",0,"",0,"",0,"",0,"",0,"",0,"",null,0,"",0,"",0,"",null,0,"",0,"",0,"",0,"","No"]
["City of Loveland Transit","Loveland","CO",8025,80025,"City, County or Local Government Unit or Department of Transportation","Full Reporter",264465,5,null,0,"",0,"",0,"",0,"",0,"",0,"",0,"",null,0,"",0,"",0,"",null,0,"",0,"",0,"",0,"","No"]
["Casco Bay Island Transit District","Portland","ME",1088,10088,"Independent Public Agency or Authority of Transit Service","Full Reporter",203914,4,null,0,"",0,"",0,"",0,"",0,"",0,"",0,"",null,0,"",0,"",0,"",null,0,"",0,"",0,"",0,"","No"]
["East Chicago Transit","East Chicago","IN",5042,50042,"City, County or Local Government Unit or Department of Transportation","Full Reporter",8608208,4,null,0,"",0,"",0,"",0,"",0,"",0,"",0,"",null,0,"",0,"",0,"",null,0,"",0,"",0,"",0,"","No"]
["New York City Economic Development Corporation","New York","NY",null,22930,"Private-Non-Profit Corporation","Full Reporter",18351295,3,null,0,"",0,"",0,"",0,"",0,"",0,"",0,"",null,0,"",0,"",0,"",null,0,"",0,"",0,"",0,"","No"]
["City of Atlanta - Department of Public Works - Transit Division","Atlanta","GA",4230,40230,"City, County or Local Government Unit or Department of Transportation","Full Reporter",4515419,3,null,0.1,"",2.6,"",0,"",0,"",0,"",0,"",2.7,"",null,0,"",33,"",33,"",null,0,"",0,"",0,"",0,"","No"]
["McKinney Avenue Transit Authority","Dallas","TX",6133,60133,"Private-Non-Profit Corporation","Full Reporter",5121892,3,null,0,"",4.5,"",0,"",0,"",0,"",0,"",4.5,"",null,0,"",55,"",55,"",null,0,"",0,"",0,"",0,"","No"]
["King County Ferry District","Seattle","WA",54,54,"Independent Public Agency or Authority of Transit Service","Full Reporter",3059393,2,null,0,"",0,"",0,"",0,"",0,"",0,"",0,"",null,0,"",0,"",0,"",null,0,"",0,"",0,"",0,"","No"]
["Brunswick Transit Alternative","Brunswick","OH",5143,50143,"City, County or Local Government Unit or Department of Transportation","Full Reporter",1780673,2,null,0,"",0,"",0,"",0,"",0,"",0,"",0,"",null,0,"",0,"",0,"",null,0,"",0,"",0,"",0,"","No"]
["Pierce County Ferry Operations","Tacoma","WA",28,28,"City, County or Local Government Unit or Department of Transportation","Full Reporter",3059393,2,null,0,"",0,"",0,"",0,"",0,"",0,"",0,"",null,0,"",0,"",0,"",null,0,"",0,"",0,"",0,"","No"]

{"sheet":"Summary Tables","index":5,"n_rows":121,"n_cols":24,"rows_kept":121,"cut":false,"hidden":false,"merged":[[63,6,63,12],[63,13,63,15],[63,16,63,19],[48,0,48,2],[22,6,22,12],[22,13,22,15],[47,6,47,12],[47,13,47,15],[22,16,22,19],[47,16,47,19],[7,0,7,2],[1,16,1,19],[1,6,1,12],[1,13,1,15],[6,6,6,12],[6,13,6,15],[6,16,6,19]]}
["To bring up the accessible control panel, press ctrl + a. Some screen reading functionality will not work while the sheet is protected. To unprotect the sheet press alt h o p and enter the password ntd.",null,null,null,null,"National Totals","At Grade: Restricted Right-of-Way","Street Running","Elevated on Structure","Elevated on Fill","Open Cut","Subway","Total Track Miles","At Grade: Restricted Right-of-Way","Street Running","Total Crossings","Permanent Busway","Permanent HOV","Part-Time Busway or HOV","Total Roadway Miles"]
[null,null,null,null,null,null,"Miles of Track",null,null,null,null,null,null,"Number of Crossings",null,null,"Miles of Roadway",null,null,null,null,null,null,{"$f":"IF(X5=1,0,1)","v":0}]
[null,null,null,null,null,"VOMS","At Grade: Restricted Right-of-Way\nTrack Miles","\n\nStreet Running\nTrack Miles","\n\nElevated on Structure\nTrack Miles","\n\nElevated on Fill\nTrack Miles","\n\n\nOpen Cut\nTrack Miles","\n\n\nSubway\nTrack Miles","Total Track Miles","At Grade: Restricted Right-of-Way\nCrossings","\n\nStreet Running\nCrossings","Total Crossings","\n\nPermanent Busway\nRoadway Miles","\n\nPermanent HOV\nRoadway Miles","\nPart-Time Busway or HOV\nRoadway Miles","Total Roadway Miles",null,null,null,"Include questionable data"]
[null,null,null,null,null,{"$f":"IF($X$2,SUMIFS('Track by Mode'!L:L,'Track by Mode'!AI:AI,\"=No\")+SUMIFS('Roadway by Mode'!L:L,'Roadway by Mode'!V:V,\"=No\"),SUM('Track by Mode'!L:L)+SUM('Roadway by Mode'!L:L))","v":68532},{"$f":"IF($X$2,SUMIFS('Track by Mode'!N:N,'Track by Mode'!$AI:$AI,\"=No\"),SUM('Track by Mode'!N:N))","v":9948.2000000000007},{"$f":"IF($X$2,SUMIFS('Track by Mode'!P:P,'Track by Mode'!$AI:$AI,\"=No\"),SUM('Track by Mode'!P:P))","v":331.6},{"$f":"IF($X$2,SUMIFS('Track by Mode'!R:R,'Track by Mode'!$AI:$AI,\"=No\"),SUM('Track by Mode'!R:R))","v":800.60000000000014},{"$f":"IF($X$2,SUMIFS('Track by Mode'!T:T,'Track by Mode'!$AI:$AI,\"=No\"),SUM('Track by Mode'!T:T))","v":662.49999999999989},{"$f":"IF($X$2,SUMIFS('Track by Mode'!V:V,'Track by Mode'!$AI:$AI,\"=No\"),SUM('Track by Mode'!V:V))","v":198.9},{"$f":"IF($X$2,SUMIFS('Track by Mode'!X:X,'Track by Mode'!$AI:$AI,\"=No\"),SUM('Track by Mode'!X:X))","v":935.90000000000009},{"$f":"IF($X$2,SUMIFS('Track by Mode'!Z:Z,'Track by Mode'!$AI:$AI,\"=No\"),SUM('Track by Mode'!Z:Z))","v":12877.700000000008},{"$f":"IF($X$2,SUMIFS('Track by Mode'!AC:AC,'Track by Mode'!$AI:$AI,\"=No\"),SUM('Track by Mode'!AC:AC))","v":5696},{"$f":"IF($X$2,SUMIFS('Track by Mode'!AE:AE,'Track by Mode'!$AI:$AI,\"=No\"),SUM('Track by Mode'!AE:AE))","v":1780},{"$f":"IF($X$2,SUMIFS('Track by Mode'!AG:AG,'Track by Mode'!$AI:$AI,\"=No\"),SUM('Track by Mode'!AG:AG))","v":7476},{"$f":"IF($X$2,SUMIFS('Roadway by Mode'!N:N,'Roadway by Mode'!$V:$V,\"=No\"),SUM('Roadway by Mode'!N:N))","v":1009.9000000000007},{"$f":"IF($X$2,SUMIFS('Roadway by Mode'!P:P,'Roadway by Mode'!$V:$V,\"=No\"),SUM('Roadway by Mode'!P:P))","v":1446.3999999999999},{"$f":"IF($X$2,SUMIFS('Roadway by Mode'!R:R,'Roadway by Mode'!$V:$V,\"=No\"),SUM('Roadway by Mode'!R:R))","v":2057.8000000000006},{"$f":"IF($X$2,SUMIFS('Roadway by Mode'!T:T,'Roadway by Mode'!$V:$V,\"=No\"),SUM('Roadway by Mode'!T:T))","v":4514.0999999999967},null,null,null,"Exclude questionable data"]
[null,null,null,null,null,{"$f":"IFERROR(G5&CHAR(10)&H5&CHAR(10)&I5&CHAR(10)&J5&CHAR(10)&K5&CHAR(10)&L5,\"\")","v":"At Grade: Restricted Right-of-Way: 77%\nStreet Running: 3%\nElevated on Structure: 6%\nElevated on Fill: 5%\nOpen Cut: 2%\nSubway: 7%"},{"$f":"G1&\": \"&FIXED(100*G4/SUM($G$4:$L$4),0,0)&\"%\"","v":"At Grade: Restricted Right-of-Way: 77%"},{"$f":"H1&\": \"&FIXED(100*H4/SUM($G$4:$L$4),0,0)&\"%\"","v":"Street Running: 3%"},"Elevated on Structure: 6%","Elevated on Fill: 5%","Open Cut: 2%","Subway: 7%",null,null,null,null,null,null,null,null,null,null,null,1]
["By Urbanized Area Size"]
[null,null,null,null,null,null,"Miles of Track",null,null,null,null,null,null,"Number of Crossings",null,null,"Miles of Roadway"]
[null,null,null,"enter bins below","click to graph","VOMS","At Grade: Restricted Right-of-Way\nTrack Miles","\n\nStreet Running\nTrack Miles","\n\nElevated on Structure\nTrack Miles","\n\nElevated on Fill\nTrack Miles","\n\n\nOpen Cut\nTrack Miles","\n\n\nSubway\nTrack Miles","Total Track Miles","At Grade: Restricted Right-of-Way\nCrossings","\n\nStreet Running\nCrossings","Total Crossings","\n\nPermanent Busway\nRoadway Miles","\n\nPermanent HOV\nRoadway Miles","\nPart-Time Busway or HOV\nRoadway Miles","Total Roadway Miles"]
["under",{"$f":"D9","v":200000},null,200000,{"$f":"IFERROR(IF(A9=\"between\",A9&\" \"&FIXED(B9,0,0)&\" \"&C9&\" \"&FIXED(D9,0,0),A9&\" \"&FIXED(B9,0,0)),\"invalid bin\")","v":"under 200,000"},{"$f":"IF($X$2,SUMIFS('Track by Mode'!L:L,'Track by Mode'!$H:$H,\"<\"&$D9,'Track by Mode'!$AI:$AI,\"=No\"),SUMIFS('Track by Mode'!L:L,'Track by Mode'!$H:$H,\"<\"&$D9))+IF($X$2,SUMIFS('Roadway by Mode'!L:L,'Roadway by Mode'!$H:$H,\"<\"&$D9,'Roadway by Mode'!$V:$V,\"=No\"),SUMIFS('Roadway by Mode'!L:L,'Roadway by Mode'!$H:$H,\"<\"&$D9))","v":3516},{"$f":"IF($X$2,SUMIFS('Track by Mode'!N:N,'Track by Mode'!$H:$H,\"<\"&$D9,'Track by Mode'!$AI:$AI,\"=No\"),SUMIFS('Track by Mode'!N:N,'Track by Mode'!$H:$H,\"<\"&$D9))","v":6.3},{"$f":"IF($X$2,SUMIFS('Track by Mode'!P:P,'Track by Mode'!$H:$H,\"<\"&$D9,'Track by Mode'!$AI:$AI,\"=No\"),SUMIFS('Track by Mode'!P:P,'Track by Mode'!$H:$H,\"<\"&$D9))","v":0},{"$f":"IF($X$2,SUMIFS('Track by Mode'!R:R,'Track by Mode'!$H:$H,\"<\"&$D9,'Track by Mode'!$AI:$AI,\"=No\"),SUMIFS('Track by Mode'!R:R,'Track by Mode'!$H:$H,\"<\"&$D9))","v":4.7},{"$f":"IF($X$2,SUMIFS('Track by Mode'!T:T,'Track by Mode'!$H:$H,\"<\"&$D9,'Track by Mode'!$AI:$AI,\"=No\"),SUMIFS('Track by Mode'!T:T,'Track by Mode'!$H:$H,\"<\"&$D9))","v":0},{"$f":"IF($X$2,SUMIFS('Track by Mode'!V:V,'Track by Mode'!$H:$H,\"<\"&$D9,'Track by Mode'!$AI:$AI,\"=No\"),SUMIFS('Track by Mode'!V:V,'Track by Mode'!$H:$H,\"<\"&$D9))","v":0},{"$f":"IF($X$2,SUMIFS('Track by Mode'!X:X,'Track by Mode'!$H:$H,\"<\"&$D9,'Track by Mode'!$AI:$AI,\"=No\"),SUMIFS('Track by Mode'!X:X,'Track by Mode'!$H:$H,\"<\"&$D9))","v":0},{"$f":"IF($X$2,SUMIFS('Track by Mode'!Z:Z,'Track by Mode'!$H:$H,\"<\"&$D9,'Track by Mode'!$AI:$AI,\"=No\"),SUMIFS('Track by Mode'!Z:Z,'Track by Mode'!$H:$H,\"<\"&$D9))","v":11},{"$f":"IF($X$2,SUMIFS('Track by Mode'!AC:AC,'Track by Mode'!$H:$H,\"<\"&$D9,'Track by Mode'!$AI:$AI,\"=No\"),SUMIFS('Track by Mode'!AC:AC,'Track by Mode'!$H:$H,\"<\"&$D9))","v":14},{"$f":"IF($X$2,SUMIFS('Track by Mode'!AE:AE,'Track by Mode'!$H:$H,\"<\"&$D9,'Track by Mode'!$AI:$AI,\"=No\"),SUMIFS('Track by Mode'!AE:AE,'Track by Mode'!$H:$H,\"<\"&$D9))","v":0},{"$f":"IF($X$2,SUMIFS('Track by Mode'!AG:AG,'Track by Mode'!$H:$H,\"<\"&$D9,'Track by Mode'!$AI:$AI,\"=No\"),SUMIFS('Track by Mode'!AG:AG,'Track by Mode'!$H:$H,\"<\"&$D9))","v":14},{"$f":"IF($X$2,SUMIFS('Roadway by Mode'!N:N,'Roadway by Mode'!$H:$H,\"<\"&$D9,'Roadway by Mode'!$V:$V,\"=No\"),SUMIFS('Roadway by Mode'!N:N,'Roadway by Mode'!$H:$H,\"<\"&$D9))","v":7.8},{"$f":"IF($X$2,SUMIFS('Roadway by Mode'!P:P,'Roadway by Mode'!$H:$H,\"<\"&$D9,'Roadway by Mode'!$V:$V,\"=No\"),SUMIFS('Roadway by Mode'!P:P,'Roadway by Mode'!$H:$H,\"<\"&$D9))","v":2},{"$f":"IF($X$2,SUMIFS('Roadway by Mode'!R:R,'Roadway by Mode'!$H:$H,\"<\"&$D9,'Roadway by Mode'!$V:$V,\"=No\"),SUMIFS('Roadway by Mode'!R:R,'Roadway by Mode'!$H:$H,\"<\"&$D9))","v":0},{"$f":"IF($X$2,SUMIFS('Roadway by Mode'!T:T,'Roadway by Mode'!$H:$H,\"<\"&$D9,'Roadway by Mode'!$V:$V,\"=No\"),SUMIFS('Roadway by Mode'!T:T,'Roadway by Mode'!$H:$H,\"<\"&$D9))","v":9.8000000000000007}]
[{"$f":"IF(D10<>\"\",\"between\",\"over\")","v":"between"},{"$f":"D9","v":200000},{"$f":"IF(D10<>\"\",\"and\",\"\")","v":"and"},1000000,{"$f":"IFERROR(IF(A10=\"between\",A10&\" \"&FIXED(B10,0,0)&\" \"&C10&\" \"&FIXED(D10,0,0),A10&\" \"&FIXED(B10,0,0)),\"invalid bin\")","v":"between 200,000 and 1,000,000"},{"$f":"IF($X$2,IF($A10=\"between\",SUMIFS('Track by Mode'!L:L,'Track by Mode'!$H:$H,\">=\"&$B10,'Track by Mode'!$H:$H,\"<\"&$D10,'Track by Mode'!$AI:$AI,\"=No\"),SUMIFS('Track by Mode'!L:L,'Track by Mode'!$H:$H,\">=\"&$B10,'Track by Mode'!$AI:$AI,\"=No\")),IF($A10=\"between\",SUMIFS('Track by Mode'!L:L,'Track by Mode'!$H:$H,\">=\"&$B10,'Track by Mode'!$H:$H,\"<\"&$D10),SUMIFS('Track by Mode'!L:L,'Track by Mode'!$H:$H,\">=\"&$B10)))+IF($X$2,IF($A10=\"between\",SUMIFS('Roadway by Mode'!L:L,'Roadway by Mode'!$H:$H,\">=\"&$B10,'Roadway by Mode'!$H:$H,\"<\"&$D10,'Roadway by Mode'!$V:$V,\"=No\"),SUMIFS('Roadway by Mode'!L:L,'Roadway by Mode'!$H:$H,\">=\"&$B10,'Roadway by Mode'!$V:$V,\"=No\")),IF($A10=\"between\",SUMIFS('Roadway by Mode'!L:L,'Roadway by Mode'!$H:$H,\">=\"&$B10,'Roadway by Mode'!$H:$H,\"<\"&$D10),SUMIFS('Roadway by Mode'!L:L,'Roadway by Mode'!$H:$H,\">=\"&$B10)))","v":8869},{"$f":"IF($X$2,IF($A10=\"between\",SUMIFS('Track by Mode'!N:N,'Track by Mode'!$H:$H,\">=\"&$B10,'Track by Mode'!$H:$H,\"<\"&$D10,'Track by Mode'!$AI:$AI,\"=No\"),SUMIFS('Track by Mode'!N:N,'Track by Mode'!$H:$H,\">=\"&$B10,'Track by Mode'!$AI:$AI,\"=No\")),IF($A10=\"between\",SUMIFS('Track by Mode'!N:N,'Track by Mode'!$H:$H,\">=\"&$B10,'Track by Mode'!$H:$H,\"<\"&$D10),SUMIFS('Track by Mode'!N:N,'Track by Mode'!$H:$H,\">=\"&$B10)))","v":1133.8999999999999},{"$f":"IF($X$2,IF($A10=\"between\",SUMIFS('Track by Mode'!P:P,'Track by Mode'!$H:$H,\">=\"&$B10,'Track by Mode'!$H:$H,\"<\"&$D10,'Track by Mode'!$AI:$AI,\"=No\"),SUMIFS('Track by Mode'!P:P,'Track by Mode'!$H:$H,\">=\"&$B10,'Track by Mode'!$AI:$AI,\"=No\")),IF($A10=\"between\",SUMIFS('Track by Mode'!P:P,'Track by Mode'!$H:$H,\">=\"&$B10,'Track by Mode'!$H:$H,\"<\"&$D10),SUMIFS('Track by Mode'!P:P,'Track by Mode'!$H:$H,\">=\"&$B10)))","v":9.7000000000000011},{"$f":"IF($X$2,IF($A10=\"between\",SUMIFS('Track by Mode'!R:R,'Track by Mode'!$H:$H,\">=\"&$B10,'Track by Mode'!$H:$H,\"<\"&$D10,'Track by Mode'!$AI:$AI,\"=No\"),SUMIFS('Track by Mode'!R:R,'Track by Mode'!$H:$H,\">=\"&$B10,'Track by Mode'!$AI:$AI,\"=No\")),IF($A10=\"between\",SUMIFS('Track by Mode'!R:R,'Track by Mode'!$H:$H,\">=\"&$B10,'Track by Mode'!$H:$H,\"<\"&$D10),SUMIFS('Track by Mode'!R:R,'Track by Mode'!$H:$H,\">=\"&$B10)))","v":5.8000000000000007},{"$f":"IF($X$2,IF($A10=\"between\",SUMIFS('Track by Mode'!T:T,'Track by Mode'!$H:$H,\">=\"&$B10,'Track by Mode'!$H:$H,\"<\"&$D10,'Track by Mode'!$AI:$AI,\"=No\"),SUMIFS('Track by Mode'!T:T,'Track by Mode'!$H:$H,\">=\"&$B10,'Track by Mode'!$AI:$AI,\"=No\")),IF($A10=\"between\",SUMIFS('Track by Mode'!T:T,'Track by Mode'!$H:$H,\">=\"&$B10,'Track by Mode'!$H:$H,\"<\"&$D10),SUMIFS('Track by Mode'!T:T,'Track by Mode'!$H:$H,\">=\"&$B10)))","v":59.7},{"$f":"IF($X$2,IF($A10=\"between\",SUMIFS('Track by Mode'!V:V,'Track by Mode'!$H:$H,\">=\"&$B10,'Track by Mode'!$H:$H,\"<\"&$D10,'Track by Mode'!$AI:$AI,\"=No\"),SUMIFS('Track by Mode'!V:V,'Track by Mode'!$H:$H,\">=\"&$B10,'Track by Mode'!$AI:$AI,\"=No\")),IF($A10=\"between\",SUMIFS('Track by Mode'!V:V,'Track by Mode'!$H:$H,\">=\"&$B10,'Track by Mode'!$H:$H,\"<\"&$D10),SUMIFS('Track by Mode'!V:V,'Track by Mode'!$H:$H,\">=\"&$B10)))","v":13.299999999999999},{"$f":"IF($X$2,IF($A10=\"between\",SUMIFS('Track by Mode'!X:X,'Track by Mode'!$H:$H,\">=\"&$B10,'Track by Mode'!$H:$H,\"<\"&$D10,'Track by Mode'!$AI:$AI,\"=No\"),SUMIFS('Track by Mode'!X:X,'Track by Mode'!$H:$H,\">=\"&$B10,'Track by Mode'!$AI:$AI,\"=No\")),IF($A10=\"between\",SUMIFS('Track by Mode'!X:X,'Track by Mode'!$H:$H,\">=\"&$B10,'Track by Mode'!$H:$H,\"<\"&$D10),SUMIFS('Track by Mode'!X:X,'Track by Mode'!$H:$H,\">=\"&$B10)))","v":16},{"$f":"IF($X$2,IF($A10=\"between\",SUMIFS('Track by Mode'!Z:Z,'Track by Mode'!$H:$H,\">=\"&$B10,'Track by Mode'!$H:$H,\"<\"&$D10,'Track by Mode'!$AI:$AI,\"=No\"),SUMIFS('Track by Mode'!Z:Z,'Track by Mode'!$H:$H,\">=\"&$B10,'Track by Mode'!$AI:$AI,\"=No\")),IF($A10=\"between\",SUMIFS('Track by Mode'!Z:Z,'Track by Mode'!$H:$H,\">=\"&$B10,'Track by Mode'!$H:$H,\"<\"&$D10),SUMIFS('Track by Mode'!Z:Z,'Track by Mode'!$H:$H,\">=\"&$B10)))","v":1238.4000000000001},{"$f":"IF($X$2,IF($A10=\"between\",SUMIFS('Track by Mode'!AC:AC,'Track by Mode'!$H:$H,\">=\"&$B10,'Track by Mode'!$H:$H,\"<\"&$D10,'Track by Mode'!$AI:$AI,\"=No\"),SUMIFS('Track by Mode'!AC:AC,'Track by Mode'!$H:$H,\">=\"&$B10,'Track by Mode'!$AI:$AI,\"=No\")),IF($A10=\"between\",SUMIFS('Track by Mode'!AC:AC,'Track by Mode'!$H:$H,\">=\"&$B10,'Track by Mode'!$H:$H,\"<\"&$D10),SUMIFS('Track by Mode'!AC:AC,'Track by Mode'!$H:$H,\">=\"&$B10)))","v":775},{"$f":"IF($X$2,IF($A10=\"between\",SUMIFS('Track by Mode'!AE:AE,'Track by Mode'!$H:$H,\">=\"&$B10,'Track by Mode'!$H:$H,\"<\"&$D10,'Track by Mode'!$AI:$AI,\"=No\"),SUMIFS('Track by Mode'!AE:AE,'Track by Mode'!$H:$H,\">=\"&$B10,'Track by Mode'!$AI:$AI,\"=No\")),IF($A10=\"between\",SUMIFS('Track by Mode'!AE:AE,'Track by Mode'!$H:$H,\">=\"&$B10,'Track by Mode'!$H:$H,\"<\"&$D10),SUMIFS('Track by Mode'!AE:AE,'Track by Mode'!$H:$H,\">=\"&$B10)))","v":73},{"$f":"IF($X$2,IF($A10=\"between\",SUMIFS('Track by Mode'!AG:AG,'Track by Mode'!$H:$H,\">=\"&$B10,'Track by Mode'!$H:$H,\"<\"&$D10,'Track by Mode'!$AI:$AI,\"=No\"),SUMIFS('Track by Mode'!AG:AG,'Track by Mode'!$H:$H,\">=\"&$B10,'Track by Mode'!$AI:$AI,\"=No\")),IF($A10=\"between\",SUMIFS('Track by Mode'!AG:AG,'Track by Mode'!$H:$H,\">=\"&$B10,'Track by Mode'!$H:$H,\"<\"&$D10),SUMIFS('Track by Mode'!AG:AG,'Track by Mode'!$H:$H,\">=\"&$B10)))","v":848},{"$f":"IF($O$2,IF($A10=\"between\",SUMIFS('Roadway by Mode'!N:N,'Roadway by Mode'!$H:$H,\">=\"&$B10,'Roadway by Mode'!$H:$H,\"<\"&$D10,'Roadway by Mode'!$V:$V,\"=No\"),SUMIFS('Roadway by Mode'!N:N,'Roadway by Mode'!$H:$H,\">=\"&$B10,'Roadway by Mode'!$V:$V,\"=No\")),IF($A10=\"between\",SUMIFS('Roadway by Mode'!N:N,'Roadway by Mode'!$H:$H,\">=\"&$B10,'Roadway by Mode'!$H:$H,\"<\"&$D10),SUMIFS('Roadway by Mode'!N:N,'Roadway by Mode'!$H:$H,\">=\"&$B10)))","v":220},{"$f":"IF($O$2,IF($A10=\"between\",SUMIFS('Roadway by Mode'!P:P,'Roadway by Mode'!$H:$H,\">=\"&$B10,'Roadway by Mode'!$H:$H,\"<\"&$D10,'Roadway by Mode'!$V:$V,\"=No\"),SUMIFS('Roadway by Mode'!P:P,'Roadway by Mode'!$H:$H,\">=\"&$B10,'Roadway by Mode'!$V:$V,\"=No\")),IF($A10=\"between\",SUMIFS('Roadway by Mode'!P:P,'Roadway by Mode'!$H:$H,\">=\"&$B10,'Roadway by Mode'!$H:$H,\"<\"&$D10),SUMIFS('Roadway by Mode'!P:P,'Roadway by Mode'!$H:$H,\">=\"&$B10)))","v":59.4},{"$f":"IF($O$2,IF($A10=\"between\",SUMIFS('Roadway by Mode'!R:R,'Roadway by Mode'!$H:$H,\">=\"&$B10,'Roadway by Mode'!$H:$H,\"<\"&$D10,'Roadway by Mode'!$V:$V,\"=No\"),SUMIFS('Roadway by Mode'!R:R,'Roadway by Mode'!$H:$H,\">=\"&$B10,'Roadway by Mode'!$V:$V,\"=No\")),IF($A10=\"between\",SUMIFS('Roadway by Mode'!R:R,'Roadway by Mode'!$H:$H,\">=\"&$B10,'Roadway by Mode'!$H:$H,\"<\"&$D10),SUMIFS('Roadway by Mode'!R:R,'Roadway by Mode'!$H:$H,\">=\"&$B10)))","v":154.6},{"$f":"IF($O$2,IF($A10=\"between\",SUMIFS('Roadway by Mode'!T:T,'Roadway by Mode'!$H:$H,\">=\"&$B10,'Roadway by Mode'!$H:$H,\"<\"&$D10,'Roadway by Mode'!$V:$V,\"=No\"),SUMIFS('Roadway by Mode'!T:T,'Roadway by Mode'!$H:$H,\">=\"&$B10,'Roadway by Mode'!$V:$V,\"=No\")),IF($A10=\"between\",SUMIFS('Roadway by Mode'!T:T,'Roadway by Mode'!$H:$H,\">=\"&$B10,'Roadway by Mode'!$H:$H,\"<\"&$D10),SUMIFS('Roadway by Mode'!T:T,'Roadway by Mode'!$H:$H,\">=\"&$B10)))","v":433.99999999999994}]
[{"$f":"IF(OR(A10=\"over\",A10=\"\"),\"\",IF(D11=\"\",\"over\",\"between\"))","v":"over"},{"$f":"IF(D10=\"\",\"\",D10)","v":1000000},{"$f":"IF(D11<>\"\",\"and\",\"\")","v":""},null,"over 1,000,000",{"$f":"IFERROR(IF($X$2,IF($A11=\"\",\"\",IF($A11=\"between\",SUMIFS('Track by Mode'!L:L,'Track by Mode'!$H:$H,\">=\"&$B11,'Track by Mode'!$H:$H,\"<\"&$D11,'Track by Mode'!$AI:$AI,\"=No\"),SUMIFS('Track by Mode'!L:L,'Track by Mode'!$H:$H,\">=\"&$B11,'Track by Mode'!$AI:$AI,\"=No\"))),IF($A11=\"\",\"\",IF($A11=\"between\",SUMIFS('Track by Mode'!L:L,'Track by Mode'!$H:$H,\">=\"&$B11,'Track by Mode'!$H:$H,\"<\"&$D11),SUMIFS('Track by Mode'!L:L,'Track by Mode'!$H:$H,\">=\"&$B11))))+IF($X$2,IF($A11=\"\",\"\",IF($A11=\"between\",SUMIFS('Roadway by Mode'!L:L,'Roadway by Mode'!$H:$H,\">=\"&$B11,'Roadway by Mode'!$H:$H,\"<\"&$D11,'Roadway by Mode'!$V:$V,\"=No\"),SUMIFS('Roadway by Mode'!L:L,'Roadway by Mode'!$H:$H,\">=\"&$B11,'Roadway by Mode'!$V:$V,\"=No\"))),IF($A11=\"\",\"\",IF($A11=\"between\",SUMIFS('Roadway by Mode'!L:L,'Roadway by Mode'!$H:$H,\">=\"&$B11,'Roadway by Mode'!$H:$H,\"<\"&$D11),SUMIFS('Roadway by Mode'!L:L,'Roadway by Mode'!$H:$H,\">=\"&$B11)))),\"\")","v":56147},{"$f":"IFERROR(IF($X$2,IF($A11=\"\",\"\",IF($A11=\"between\",SUMIFS('Track by Mode'!N:N,'Track by Mode'!$H:$H,\">=\"&$B11,'Track by Mode'!$H:$H,\"<\"&$D11,'Track by Mode'!$AI:$AI,\"=No\"),SUMIFS('Track by Mode'!N:N,'Track by Mode'!$H:$H,\">=\"&$B11,'Track by Mode'!$AI:$AI,\"=No\"))),IF($A11=\"\",\"\",IF($A11=\"between\",SUMIFS('Track by Mode'!N:N,'Track by Mode'!$H:$H,\">=\"&$B11,'Track by Mode'!$H:$H,\"<\"&$D11),SUMIFS('Track by Mode'!N:N,'Track by Mode'!$H:$H,\">=\"&$B11)))),\"\")","v":8808},{"$f":"IFERROR(IF($X$2,IF($A11=\"\",\"\",IF($A11=\"between\",SUMIFS('Track by Mode'!P:P,'Track by Mode'!$H:$H,\">=\"&$B11,'Track by Mode'!$H:$H,\"<\"&$D11,'Track by Mode'!$AI:$AI,\"=No\"),SUMIFS('Track by Mode'!P:P,'Track by Mode'!$H:$H,\">=\"&$B11,'Track by Mode'!$AI:$AI,\"=No\"))),IF($A11=\"\",\"\",IF($A11=\"between\",SUMIFS('Track by Mode'!P:P,'Track by Mode'!$H:$H,\">=\"&$B11,'Track by Mode'!$H:$H,\"<\"&$D11),SUMIFS('Track by Mode'!P:P,'Track by Mode'!$H:$H,\">=\"&$B11)))),\"\")","v":321.90000000000003},{"$f":"IFERROR(IF($X$2,IF($A11=\"\",\"\",IF($A11=\"between\",SUMIFS('Track by Mode'!R:R,'Track by Mode'!$H:$H,\">=\"&$B11,'Track by Mode'!$H:$H,\"<\"&$D11,'Track by Mode'!$AI:$AI,\"=No\"),SUMIFS('Track by Mode'!R:R,'Track by Mode'!$H:$H,\">=\"&$B11,'Track by Mode'!$AI:$AI,\"=No\"))),IF($A11=\"\",\"\",IF($A11=\"between\",SUMIFS('Track by Mode'!R:R,'Track by Mode'!$H:$H,\">=\"&$B11,'Track by Mode'!$H:$H,\"<\"&$D11),SUMIFS('Track by Mode'!R:R,'Track by Mode'!$H:$H,\">=\"&$B11)))),\"\")","v":790.10000000000014},{"$f":"IFERROR(IF($X$2,IF($A11=\"\",\"\",IF($A11=\"between\",SUMIFS('Track by Mode'!T:T,'Track by Mode'!$H:$H,\">=\"&$B11,'Track by Mode'!$H:$H,\"<\"&$D11,'Track by Mode'!$AI:$AI,\"=No\"),SUMIFS('Track by Mode'!T:T,'Track by Mode'!$H:$H,\">=\"&$B11,'Track by Mode'!$AI:$AI,\"=No\"))),IF($A11=\"\",\"\",IF($A11=\"between\",SUMIFS('Track by Mode'!T:T,'Track by Mode'!$H:$H,\">=\"&$B11,'Track by Mode'!$H:$H,\"<\"&$D11),SUMIFS('Track by Mode'!T:T,'Track by Mode'!$H:$H,\">=\"&$B11)))),\"\")","v":602.79999999999984},{"$f":"IFERROR(IF($X$2,IF($A11=\"\",\"\",IF($A11=\"between\",SUMIFS('Track by Mode'!V:V,'Track by Mode'!$H:$H,\">=\"&$B11,'Track by Mode'!$H:$H,\"<\"&$D11,'Track by Mode'!$AI:$AI,\"=No\"),SUMIFS('Track by Mode'!V:V,'Track by Mode'!$H:$H,\">=\"&$B11,'Track by Mode'!$AI:$AI,\"=No\"))),IF($A11=\"\",\"\",IF($A11=\"between\",SUMIFS('Track by Mode'!V:V,'Track by Mode'!$H:$H,\">=\"&$B11,'Track by Mode'!$H:$H,\"<\"&$D11),SUMIFS('Track by Mode'!V:V,'Track by Mode'!$H:$H,\">=\"&$B11)))),\"\")","v":185.60000000000002},{"$f":"IFERROR(IF($X$2,IF($A11=\"\",\"\",IF($A11=\"between\",SUMIFS('Track by Mode'!X:X,'Track by Mode'!$H:$H,\">=\"&$B11,'Track by Mode'!$H:$H,\"<\"&$D11,'Track by Mode'!$AI:$AI,\"=No\"),SUMIFS('Track by Mode'!X:X,'Track by Mode'!$H:$H,\">=\"&$B11,'Track by Mode'!$AI:$AI,\"=No\"))),IF($A11=\"\",\"\",IF($A11=\"between\",SUMIFS('Track by Mode'!X:X,'Track by Mode'!$H:$H,\">=\"&$B11,'Track by Mode'!$H:$H,\"<\"&$D11),SUMIFS('Track by Mode'!X:X,'Track by Mode'!$H:$H,\">=\"&$B11)))),\"\")","v":919.90000000000009},{"$f":"IFERROR(IF($X$2,IF($A11=\"\",\"\",IF($A11=\"between\",SUMIFS('Track by Mode'!Z:Z,'Track by Mode'!$H:$H,\">=\"&$B11,'Track by Mode'!$H:$H,\"<\"&$D11,'Track by Mode'!$AI:$AI,\"=No\"),SUMIFS('Track by Mode'!Z:Z,'Track by Mode'!$H:$H,\">=\"&$B11,'Track by Mode'!$AI:$AI,\"=No\"))),IF($A11=\"\",\"\",IF($A11=\"between\",SUMIFS('Track by Mode'!Z:Z,'Track by Mode'!$H:$H,\">=\"&$B11,'Track by Mode'!$H:$H,\"<\"&$D11),SUMIFS('Track by Mode'!Z:Z,'Track by Mode'!$H:$H,\">=\"&$B11)))),\"\")","v":11628.300000000007},{"$f":"IFERROR(IF($X$2,IF($A11=\"\",\"\",IF($A11=\"between\",SUMIFS('Track by Mode'!AC:AC,'Track by Mode'!$H:$H,\">=\"&$B11,'Track by Mode'!$H:$H,\"<\"&$D11,'Track by Mode'!$AI:$AI,\"=No\"),SUMIFS('Track by Mode'!AC:AC,'Track by Mode'!$H:$H,\">=\"&$B11,'Track by Mode'!$AI:$AI,\"=No\"))),IF($A11=\"\",\"\",IF($A11=\"between\",SUMIFS('Track by Mode'!AC:AC,'Track by Mode'!$H:$H,\">=\"&$B11,'Track by Mode'!$H:$H,\"<\"&$D11),SUMIFS('Track by Mode'!AC:AC,'Track by Mode'!$H:$H,\">=\"&$B11)))),\"\")","v":4907},{"$f":"IFERROR(IF($X$2,IF($A11=\"\",\"\",IF($A11=\"between\",SUMIFS('Track by Mode'!AE:AE,'Track by Mode'!$H:$H,\">=\"&$B11,'Track by Mode'!$H:$H,\"<\"&$D11,'Track by Mode'!$AI:$AI,\"=No\"),SUMIFS('Track by Mode'!AE:AE,'Track by Mode'!$H:$H,\">=\"&$B11,'Track by Mode'!$AI:$AI,\"=No\"))),IF($A11=\"\",\"\",IF($A11=\"between\",SUMIFS('Track by Mode'!AE:AE,'Track by Mode'!$H:$H,\">=\"&$B11,'Track by Mode'!$H:$H,\"<\"&$D11),SUMIFS('Track by Mode'!AE:AE,'Track by Mode'!$H:$H,\">=\"&$B11)))),\"\")","v":1707},{"$f":"IFERROR(IF($X$2,IF($A11=\"\",\"\",IF($A11=\"between\",SUMIFS('Track by Mode'!AG:AG,'Track by Mode'!$H:$H,\">=\"&$B11,'Track by Mode'!$H:$H,\"<\"&$D11,'Track by Mode'!$AI:$AI,\"=No\"),SUMIFS('Track by Mode'!AG:AG,'Track by Mode'!$H:$H,\">=\"&$B11,'Track by Mode'!$AI:$AI,\"=No\"))),IF($A11=\"\",\"\",IF($A11=\"between\",SUMIFS('Track by Mode'!AG:AG,'Track by Mode'!$H:$H,\">=\"&$B11,'Track by Mode'!$H:$H,\"<\"&$D11),SUMIFS('Track by Mode'!AG:AG,'Track by Mode'!$H:$H,\">=\"&$B11)))),\"\")","v":6614},{"$f":"IFERROR(IF($O$2,IF($A11=\"\",\"\",IF($A11=\"between\",SUMIFS('Roadway by Mode'!N:N,'Roadway by Mode'!$H:$H,\">=\"&$B11,'Roadway by Mode'!$H:$H,\"<\"&$D11,'Roadway by Mode'!$V:$V,\"=No\"),SUMIFS('Roadway by Mode'!N:N,'Roadway by Mode'!$H:$H,\">=\"&$B11,'Roadway by Mode'!$V:$V,\"=No\"))),IF($A11=\"\",\"\",IF($A11=\"between\",SUMIFS('Roadway by Mode'!N:N,'Roadway by Mode'!$H:$H,\">=\"&$B11,'Roadway by Mode'!$H:$H,\"<\"&$D11),SUMIFS('Roadway by Mode'!N:N,'Roadway by Mode'!$H:$H,\">=\"&$B11)))),\"\")","v":782.10000000000048},{"$f":"IFERROR(IF($O$2,IF($A11=\"\",\"\",IF($A11=\"between\",SUMIFS('Roadway by Mode'!P:P,'Roadway by Mode'!$H:$H,\">=\"&$B11,'Roadway by Mode'!$H:$H,\"<\"&$D11,'Roadway by Mode'!$V:$V,\"=No\"),SUMIFS('Roadway by Mode'!P:P,'Roadway by Mode'!$H:$H,\">=\"&$B11,'Roadway by Mode'!$V:$V,\"=No\"))),IF($A11=\"\",\"\",IF($A11=\"between\",SUMIFS('Roadway by Mode'!P:P,'Roadway by Mode'!$H:$H,\">=\"&$B11,'Roadway by Mode'!$H:$H,\"<\"&$D11),SUMIFS('Roadway by Mode'!P:P,'Roadway by Mode'!$H:$H,\">=\"&$B11)))),\"\")","v":1385},{"$f":"IFERROR(IF($O$2,IF($A11=\"\",\"\",IF($A11=\"between\",SUMIFS('Roadway by Mode'!R:R,'Roadway by Mode'!$H:$H,\">=\"&$B11,'Roadway by Mode'!$H:$H,\"<\"&$D11,'Roadway by Mode'!$V:$V,\"=No\"),SUMIFS('Roadway by Mode'!R:R,'Roadway by Mode'!$H:$H,\">=\"&$B11,'Roadway by Mode'!$V:$V,\"=No\"))),IF($A11=\"\",\"\",IF($A11=\"between\",SUMIFS('Roadway by Mode'!R:R,'Roadway by Mode'!$H:$H,\">=\"&$B11,'Roadway by Mode'!$H:$H,\"<\"&$D11),SUMIFS('Roadway by Mode'!R:R,'Roadway by Mode'!$H:$H,\">=\"&$B11)))),\"\")","v":1903.2000000000003},{"$f":"IFERROR(IF($O$2,IF($A11=\"\",\"\",IF($A11=\"between\",SUMIFS('Roadway by Mode'!T:T,'Roadway by Mode'!$H:$H,\">=\"&$B11,'Roadway by Mode'!$H:$H,\"<\"&$D11,'Roadway by Mode'!$V:$V,\"=No\"),SUMIFS('Roadway by Mode'!T:T,'Roadway by Mode'!$H:$H,\">=\"&$B11,'Roadway by Mode'!$V:$V,\"=No\"))),IF($A11=\"\",\"\",IF($A11=\"between\",SUMIFS('Roadway by Mode'!T:T,'Roadway by Mode'!$H:$H,\">=\"&$B11,'Roadway by Mode'!$H:$H,\"<\"&$D11),SUMIFS('Roadway by Mode'!T:T,'Roadway by Mode'!$H:$H,\">=\"&$B11)))),\"\")","v":4070.2999999999997}]
["","",{"$f":"IF(D12<>\"\",\"and\",\"\")","v":""},null,"invalid bin",{"$f":"IFERROR(IF($X$2,IF($A12=\"\",\"\",IF($A12=\"between\",SUMIFS('Track by Mode'!L:L,'Track by Mode'!$H:$H,\">=\"&$B12,'Track by Mode'!$H:$H,\"<\"&$D12,'Track by Mode'!$AI:$AI,\"=No\"),SUMIFS('Track by Mode'!L:L,'Track by Mode'!$H:$H,\">=\"&$B12,'Track by Mode'!$AI:$AI,\"=No\"))),IF($A12=\"\",\"\",IF($A12=\"between\",SUMIFS('Track by Mode'!L:L,'Track by Mode'!$H:$H,\">=\"&$B12,'Track by Mode'!$H:$H,\"<\"&$D12),SUMIFS('Track by Mode'!L:L,'Track by Mode'!$H:$H,\">=\"&$B12))))+IF($X$2,IF($A12=\"\",\"\",IF($A12=\"between\",SUMIFS('Roadway by Mode'!L:L,'Roadway by Mode'!$H:$H,\">=\"&$B12,'Roadway by Mode'!$H:$H,\"<\"&$D12,'Roadway by Mode'!$V:$V,\"=No\"),SUMIFS('Roadway by Mode'!L:L,'Roadway by Mode'!$H:$H,\">=\"&$B12,'Roadway by Mode'!$V:$V,\"=No\"))),IF($A12=\"\",\"\",IF($A12=\"between\",SUMIFS('Roadway by Mode'!L:L,'Roadway by Mode'!$H:$H,\">=\"&$B12,'Roadway by Mode'!$H:$H,\"<\"&$D12),SUMIFS('Roadway by Mode'!L:L,'Roadway by Mode'!$H:$H,\">=\"&$B12)))),\"\")","v":""},{"$f":"IFERROR(IF($X$2,IF($A12=\"\",\"\",IF($A12=\"between\",SUMIFS('Track by Mode'!N:N,'Track by Mode'!$H:$H,\">=\"&$B12,'Track by Mode'!$H:$H,\"<\"&$D12,'Track by Mode'!$AI:$AI,\"=No\"),SUMIFS('Track by Mode'!N:N,'Track by Mode'!$H:$H,\">=\"&$B12,'Track by Mode'!$AI:$AI,\"=No\"))),IF($A12=\"\",\"\",IF($A12=\"between\",SUMIFS('Track by Mode'!N:N,'Track by Mode'!$H:$H,\">=\"&$B12,'Track by Mode'!$H:$H,\"<\"&$D12),SUMIFS('Track by Mode'!N:N,'Track by Mode'!$H:$H,\">=\"&$B12)))),\"\")","v":""},{"$f":"IFERROR(IF($X$2,IF($A12=\"\",\"\",IF($A12=\"between\",SUMIFS('Track by Mode'!P:P,'Track by Mode'!$H:$H,\">=\"&$B12,'Track by Mode'!$H:$H,\"<\"&$D12,'Track by Mode'!$AI:$AI,\"=No\"),SUMIFS('Track by Mode'!P:P,'Track by Mode'!$H:$H,\">=\"&$B12,'Track by Mode'!$AI:$AI,\"=No\"))),IF($A12=\"\",\"\",IF($A12=\"between\",SUMIFS('Track by Mode'!P:P,'Track by Mode'!$H:$H,\">=\"&$B12,'Track by Mode'!$H:$H,\"<\"&$D12),SUMIFS('Track by Mode'!P:P,'Track by Mode'!$H:$H,\">=\"&$B12)))),\"\")","v":""},{"$f":"IFERROR(IF($X$2,IF($A12=\"\",\"\",IF($A12=\"between\",SUMIFS('Track by Mode'!R:R,'Track by Mode'!$H:$H,\">=\"&$B12,'Track by Mode'!$H:$H,\"<\"&$D12,'Track by Mode'!$AI:$AI,\"=No\"),SUMIFS('Track by Mode'!R:R,'Track by Mode'!$H:$H,\">=\"&$B12,'Track by Mode'!$AI:$AI,\"=No\"))),IF($A12=\"\",\"\",IF($A12=\"between\",SUMIFS('Track by Mode'!R:R,'Track by Mode'!$H:$H,\">=\"&$B12,'Track by Mode'!$H:$H,\"<\"&$D12),SUMIFS('Track by Mode'!R:R,'Track by Mode'!$H:$H,\">=\"&$B12)))),\"\")","v":""},{"$f":"IFERROR(IF($X$2,IF($A12=\"\",\"\",IF($A12=\"between\",SUMIFS('Track by Mode'!T:T,'Track by Mode'!$H:$H,\">=\"&$B12,'Track by Mode'!$H:$H,\"<\"&$D12,'Track by Mode'!$AI:$AI,\"=No\"),SUMIFS('Track by Mode'!T:T,'Track by Mode'!$H:$H,\">=\"&$B12,'Track by Mode'!$AI:$AI,\"=No\"))),IF($A12=\"\",\"\",IF($A12=\"between\",SUMIFS('Track by Mode'!T:T,'Track by Mode'!$H:$H,\">=\"&$B12,'Track by Mode'!$H:$H,\"<\"&$D12),SUMIFS('Track by Mode'!T:T,'Track by Mode'!$H:$H,\">=\"&$B12)))),\"\")","v":""},{"$f":"IFERROR(IF($X$2,IF($A12=\"\",\"\",IF($A12=\"between\",SUMIFS('Track by Mode'!V:V,'Track by Mode'!$H:$H,\">=\"&$B12,'Track by Mode'!$H:$H,\"<\"&$D12,'Track by Mode'!$AI:$AI,\"=No\"),SUMIFS('Track by Mode'!V:V,'Track by Mode'!$H:$H,\">=\"&$B12,'Track by Mode'!$AI:$AI,\"=No\"))),IF($A12=\"\",\"\",IF($A12=\"between\",SUMIFS('Track by Mode'!V:V,'Track by Mode'!$H:$H,\">=\"&$B12,'Track by Mode'!$H:$H,\"<\"&$D12),SUMIFS('Track by Mode'!V:V,'Track by Mode'!$H:$H,\">=\"&$B12)))),\"\")","v":""},{"$f":"IFERROR(IF($X$2,IF($A12=\"\",\"\",IF($A12=\"between\",SUMIFS('Track by Mode'!X:X,'Track by Mode'!$H:$H,\">=\"&$B12,'Track by Mode'!$H:$H,\"<\"&$D12,'Track by Mode'!$AI:$AI,\"=No\"),SUMIFS('Track by Mode'!X:X,'Track by Mode'!$H:$H,\">=\"&$B12,'Track by Mode'!$AI:$AI,\"=No\"))),IF($A12=\"\",\"\",IF($A12=\"between\",SUMIFS('Track by Mode'!X:X,'Track by Mode'!$H:$H,\">=\"&$B12,'Track by Mode'!$H:$H,\"<\"&$D12),SUMIFS('Track by Mode'!X:X,'Track by Mode'!$H:$H,\">=\"&$B12)))),\"\")","v":""},{"$f":"IFERROR(IF($X$2,IF($A12=\"\",\"\",IF($A12=\"between\",SUMIFS('Track by Mode'!Z:Z,'Track by Mode'!$H:$H,\">=\"&$B12,'Track by Mode'!$H:$H,\"<\"&$D12,'Track by Mode'!$AI:$AI,\"=No\"),SUMIFS('Track by Mode'!Z:Z,'Track by Mode'!$H:$H,\">=\"&$B12,'Track by Mode'!$AI:$AI,\"=No\"))),IF($A12=\"\",\"\",IF($A12=\"between\",SUMIFS('Track by Mode'!Z:Z,'Track by Mode'!$H:$H,\">=\"&$B12,'Track by Mode'!$H:$H,\"<\"&$D12),SUMIFS('Track by Mode'!Z:Z,'Track by Mode'!$H:$H,\">=\"&$B12)))),\"\")","v":""},{"$f":"IFERROR(IF($X$2,IF($A12=\"\",\"\",IF($A12=\"between\",SUMIFS('Track by Mode'!AC:AC,'Track by Mode'!$H:$H,\">=\"&$B12,'Track by Mode'!$H:$H,\"<\"&$D12,'Track by Mode'!$AI:$AI,\"=No\"),SUMIFS('Track by Mode'!AC:AC,'Track by Mode'!$H:$H,\">=\"&$B12,'Track by Mode'!$AI:$AI,\"=No\"))),IF($A12=\"\",\"\",IF($A12=\"between\",SUMIFS('Track by Mode'!AC:AC,'Track by Mode'!$H:$H,\">=\"&$B12,'Track by Mode'!$H:$H,\"<\"&$D12),SUMIFS('Track by Mode'!AC:AC,'Track by Mode'!$H:$H,\">=\"&$B12)))),\"\")","v":""},{"$f":"IFERROR(IF($X$2,IF($A12=\"\",\"\",IF($A12=\"between\",SUMIFS('Track by Mode'!AE:AE,'Track by Mode'!$H:$H,\">=\"&$B12,'Track by Mode'!$H:$H,\"<\"&$D12,'Track by Mode'!$AI:$AI,\"=No\"),SUMIFS('Track by Mode'!AE:AE,'Track by Mode'!$H:$H,\">=\"&$B12,'Track by Mode'!$AI:$AI,\"=No\"))),IF($A12=\"\",\"\",IF($A12=\"between\",SUMIFS('Track by Mode'!AE:AE,'Track by Mode'!$H:$H,\">=\"&$B12,'Track by Mode'!$H:$H,\"<\"&$D12),SUMIFS('Track by Mode'!AE:AE,'Track by Mode'!$H:$H,\">=\"&$B12)))),\"\")","v":""},{"$f":"IFERROR(IF($X$2,IF($A12=\"\",\"\",IF($A12=\"between\",SUMIFS('Track by Mode'!AG:AG,'Track by Mode'!$H:$H,\">=\"&$B12,'Track by Mode'!$H:$H,\"<\"&$D12,'Track by Mode'!$AI:$AI,\"=No\"),SUMIFS('Track by Mode'!AG:AG,'Track by Mode'!$H:$H,\">=\"&$B12,'Track by Mode'!$AI:$AI,\"=No\"))),IF($A12=\"\",\"\",IF($A12=\"between\",SUMIFS('Track by Mode'!AG:AG,'Track by Mode'!$H:$H,\">=\"&$B12,'Track by Mode'!$H:$H,\"<\"&$D12),SUMIFS('Track by Mode'!AG:AG,'Track by Mode'!$H:$H,\">=\"&$B12)))),\"\")","v":""},{"$f":"IFERROR(IF($O$2,IF($A12=\"\",\"\",IF($A12=\"between\",SUMIFS('Roadway by Mode'!N:N,'Roadway by Mode'!$H:$H,\">=\"&$B12,'Roadway by Mode'!$H:$H,\"<\"&$D12,'Roadway by Mode'!$V:$V,\"=No\"),SUMIFS('Roadway by Mode'!N:N,'Roadway by Mode'!$H:$H,\">=\"&$B12,'Roadway by Mode'!$V:$V,\"=No\"))),IF($A12=\"\",\"\",IF($A12=\"between\",SUMIFS('Roadway by Mode'!N:N,'Roadway by Mode'!$H:$H,\">=\"&$B12,'Roadway by Mode'!$H:$H,\"<\"&$D12),SUMIFS('Roadway by Mode'!N:N,'Roadway by Mode'!$H:$H,\">=\"&$B12)))),\"\")","v":""},{"$f":"IFERROR(IF($O$2,IF($A12=\"\",\"\",IF($A12=\"between\",SUMIFS('Roadway by Mode'!P:P,'Roadway by Mode'!$H:$H,\">=\"&$B12,'Roadway by Mode'!$H:$H,\"<\"&$D12,'Roadway by Mode'!$V:$V,\"=No\"),SUMIFS('Roadway by Mode'!P:P,'Roadway by Mode'!$H:$H,\">=\"&$B12,'Roadway by Mode'!$V:$V,\"=No\"))),IF($A12=\"\",\"\",IF($A12=\"between\",SUMIFS('Roadway by Mode'!P:P,'Roadway by Mode'!$H:$H,\">=\"&$B12,'Roadway by Mode'!$H:$H,\"<\"&$D12),SUMIFS('Roadway by Mode'!P:P,'Roadway by Mode'!$H:$H,\">=\"&$B12)))),\"\")","v":""},{"$f":"IFERROR(IF($O$2,IF($A12=\"\",\"\",IF($A12=\"between\",SUMIFS('Roadway by Mode'!R:R,'Roadway by Mode'!$H:$H,\">=\"&$B12,'Roadway by Mode'!$H:$H,\"<\"&$D12,'Roadway by Mode'!$V:$V,\"=No\"),SUMIFS('Roadway by Mode'!R:R,'Roadway by Mode'!$H:$H,\">=\"&$B12,'Roadway by Mode'!$V:$V,\"=No\"))),IF($A12=\"\",\"\",IF($A12=\"between\",SUMIFS('Roadway by Mode'!R:R,'Roadway by Mode'!$H:$H,\">=\"&$B12,'Roadway by Mode'!$H:$H,\"<\"&$D12),SUMIFS('Roadway by Mode'!R:R,'Roadway by Mode'!$H:$H,\">=\"&$B12)))),\"\")","v":""},{"$f":"IFERROR(IF($O$2,IF($A12=\"\",\"\",IF($A12=\"between\",SUMIFS('Roadway by Mode'!T:T,'Roadway by Mode'!$H:$H,\">=\"&$B12,'Roadway by Mode'!$H:$H,\"<\"&$D12,'Roadway by Mode'!$V:$V,\"=No\"),SUMIFS('Roadway by Mode'!T:T,'Roadway by Mode'!$H:$H,\">=\"&$B12,'Roadway by Mode'!$V:$V,\"=No\"))),IF($A12=\"\",\"\",IF($A12=\"between\",SUMIFS('Roadway by Mode'!T:T,'Roadway by Mode'!$H:$H,\">=\"&$B12,'Roadway by Mode'!$H:$H,\"<\"&$D12),SUMIFS('Roadway by Mode'!T:T,'Roadway by Mode'!$H:$H,\">=\"&$B12)))),\"\")","v":""}]
["","","",null,"invalid bin",{"$f":"IFERROR(IF($X$2,IF($A13=\"\",\"\",IF($A13=\"between\",SUMIFS('Track by Mode'!L:L,'Track by Mode'!$H:$H,\">=\"&$B13,'Track by Mode'!$H:$H,\"<\"&$D13,'Track by Mode'!$AI:$AI,\"=No\"),SUMIFS('Track by Mode'!L:L,'Track by Mode'!$H:$H,\">=\"&$B13,'Track by Mode'!$AI:$AI,\"=No\"))),IF($A13=\"\",\"\",IF($A13=\"between\",SUMIFS('Track by Mode'!L:L,'Track by Mode'!$H:$H,\">=\"&$B13,'Track by Mode'!$H:$H,\"<\"&$D13),SUMIFS('Track by Mode'!L:L,'Track by Mode'!$H:$H,\">=\"&$B13))))+IF($X$2,IF($A13=\"\",\"\",IF($A13=\"between\",SUMIFS('Roadway by Mode'!L:L,'Roadway by Mode'!$H:$H,\">=\"&$B13,'Roadway by Mode'!$H:$H,\"<\"&$D13,'Roadway by Mode'!$V:$V,\"=No\"),SUMIFS('Roadway by Mode'!L:L,'Roadway by Mode'!$H:$H,\">=\"&$B13,'Roadway by Mode'!$V:$V,\"=No\"))),IF($A13=\"\",\"\",IF($A13=\"between\",SUMIFS('Roadway by Mode'!L:L,'Roadway by Mode'!$H:$H,\">=\"&$B13,'Roadway by Mode'!$H:$H,\"<\"&$D13),SUMIFS('Roadway by Mode'!L:L,'Roadway by Mode'!$H:$H,\">=\"&$B13)))),\"\")","v":""},{"$f":"IFERROR(IF($X$2,IF($A13=\"\",\"\",IF($A13=\"between\",SUMIFS('Track by Mode'!N:N,'Track by Mode'!$H:$H,\">=\"&$B13,'Track by Mode'!$H:$H,\"<\"&$D13,'Track by Mode'!$AI:$AI,\"=No\"),SUMIFS('Track by Mode'!N:N,'Track by Mode'!$H:$H,\">=\"&$B13,'Track by Mode'!$AI:$AI,\"=No\"))),IF($A13=\"\",\"\",IF($A13=\"between\",SUMIFS('Track by Mode'!N:N,'Track by Mode'!$H:$H,\">=\"&$B13,'Track by Mode'!$H:$H,\"<\"&$D13),SUMIFS('Track by Mode'!N:N,'Track by Mode'!$H:$H,\">=\"&$B13)))),\"\")","v":""},{"$f":"IFERROR(IF($X$2,IF($A13=\"\",\"\",IF($A13=\"between\",SUMIFS('Track by Mode'!P:P,'Track by Mode'!$H:$H,\">=\"&$B13,'Track by Mode'!$H:$H,\"<\"&$D13,'Track by Mode'!$AI:$AI,\"=No\"),SUMIFS('Track by Mode'!P:P,'Track by Mode'!$H:$H,\">=\"&$B13,'Track by Mode'!$AI:$AI,\"=No\"))),IF($A13=\"\",\"\",IF($A13=\"between\",SUMIFS('Track by Mode'!P:P,'Track by Mode'!$H:$H,\">=\"&$B13,'Track by Mode'!$H:$H,\"<\"&$D13),SUMIFS('Track by Mode'!P:P,'Track by Mode'!$H:$H,\">=\"&$B13)))),\"\")","v":""},{"$f":"IFERROR(IF($X$2,IF($A13=\"\",\"\",IF($A13=\"between\",SUMIFS('Track by Mode'!R:R,'Track by Mode'!$H:$H,\">=\"&$B13,'Track by Mode'!$H:$H,\"<\"&$D13,'Track by Mode'!$AI:$AI,\"=No\"),SUMIFS('Track by Mode'!R:R,'Track by Mode'!$H:$H,\">=\"&$B13,'Track by Mode'!$AI:$AI,\"=No\"))),IF($A13=\"\",\"\",IF($A13=\"between\",SUMIFS('Track by Mode'!R:R,'Track by Mode'!$H:$H,\">=\"&$B13,'Track by Mode'!$H:$H,\"<\"&$D13),SUMIFS('Track by Mode'!R:R,'Track by Mode'!$H:$H,\">=\"&$B13)))),\"\")","v":""},{"$f":"IFERROR(IF($X$2,IF($A13=\"\",\"\",IF($A13=\"between\",SUMIFS('Track by Mode'!T:T,'Track by Mode'!$H:$H,\">=\"&$B13,'Track by Mode'!$H:$H,\"<\"&$D13,'Track by Mode'!$AI:$AI,\"=No\"),SUMIFS('Track by Mode'!T:T,'Track by Mode'!$H:$H,\">=\"&$B13,'Track by Mode'!$AI:$AI,\"=No\"))),IF($A13=\"\",\"\",IF($A13=\"between\",SUMIFS('Track by Mode'!T:T,'Track by Mode'!$H:$H,\">=\"&$B13,'Track by Mode'!$H:$H,\"<\"&$D13),SUMIFS('Track by Mode'!T:T,'Track by Mode'!$H:$H,\">=\"&$B13)))),\"\")","v":""},{"$f":"IFERROR(IF($X$2,IF($A13=\"\",\"\",IF($A13=\"between\",SUMIFS('Track by Mode'!V:V,'Track by Mode'!$H:$H,\">=\"&$B13,'Track by Mode'!$H:$H,\"<\"&$D13,'Track by Mode'!$AI:$AI,\"=No\"),SUMIFS('Track by Mode'!V:V,'Track by Mode'!$H:$H,\">=\"&$B13,'Track by Mode'!$AI:$AI,\"=No\"))),IF($A13=\"\",\"\",IF($A13=\"between\",SUMIFS('Track by Mode'!V:V,'Track by Mode'!$H:$H,\">=\"&$B13,'Track by Mode'!$H:$H,\"<\"&$D13),SUMIFS('Track by Mode'!V:V,'Track by Mode'!$H:$H,\">=\"&$B13)))),\"\")","v":""},{"$f":"IFERROR(IF($X$2,IF($A13=\"\",\"\",IF($A13=\"between\",SUMIFS('Track by Mode'!X:X,'Track by Mode'!$H:$H,\">=\"&$B13,'Track by Mode'!$H:$H,\"<\"&$D13,'Track by Mode'!$AI:$AI,\"=No\"),SUMIFS('Track by Mode'!X:X,'Track by Mode'!$H:$H,\">=\"&$B13,'Track by Mode'!$AI:$AI,\"=No\"))),IF($A13=\"\",\"\",IF($A13=\"between\",SUMIFS('Track by Mode'!X:X,'Track by Mode'!$H:$H,\">=\"&$B13,'Track by Mode'!$H:$H,\"<\"&$D13),SUMIFS('Track by Mode'!X:X,'Track by Mode'!$H:$H,\">=\"&$B13)))),\"\")","v":""},{"$f":"IFERROR(IF($X$2,IF($A13=\"\",\"\",IF($A13=\"between\",SUMIFS('Track by Mode'!Z:Z,'Track by Mode'!$H:$H,\">=\"&$B13,'Track by Mode'!$H:$H,\"<\"&$D13,'Track by Mode'!$AI:$AI,\"=No\"),SUMIFS('Track by Mode'!Z:Z,'Track by Mode'!$H:$H,\">=\"&$B13,'Track by Mode'!$AI:$AI,\"=No\"))),IF($A13=\"\",\"\",IF($A13=\"between\",SUMIFS('Track by Mode'!Z:Z,'Track by Mode'!$H:$H,\">=\"&$B13,'Track by Mode'!$H:$H,\"<\"&$D13),SUMIFS('Track by Mode'!Z:Z,'Track by Mode'!$H:$H,\">=\"&$B13)))),\"\")","v":""},{"$f":"IFERROR(IF($X$2,IF($A13=\"\",\"\",IF($A13=\"between\",SUMIFS('Track by Mode'!AC:AC,'Track by Mode'!$H:$H,\">=\"&$B13,'Track by Mode'!$H:$H,\"<\"&$D13,'Track by Mode'!$AI:$AI,\"=No\"),SUMIFS('Track by Mode'!AC:AC,'Track by Mode'!$H:$H,\">=\"&$B13,'Track by Mode'!$AI:$AI,\"=No\"))),IF($A13=\"\",\"\",IF($A13=\"between\",SUMIFS('Track by Mode'!AC:AC,'Track by Mode'!$H:$H,\">=\"&$B13,'Track by Mode'!$H:$H,\"<\"&$D13),SUMIFS('Track by Mode'!AC:AC,'Track by Mode'!$H:$H,\">=\"&$B13)))),\"\")","v":""},{"$f":"IFERROR(IF($X$2,IF($A13=\"\",\"\",IF($A13=\"between\",SUMIFS('Track by Mode'!AE:AE,'Track by Mode'!$H:$H,\">=\"&$B13,'Track by Mode'!$H:$H,\"<\"&$D13,'Track by Mode'!$AI:$AI,\"=No\"),SUMIFS('Track by Mode'!AE:AE,'Track by Mode'!$H:$H,\">=\"&$B13,'Track by Mode'!$AI:$AI,\"=No\"))),IF($A13=\"\",\"\",IF($A13=\"between\",SUMIFS('Track by Mode'!AE:AE,'Track by Mode'!$H:$H,\">=\"&$B13,'Track by Mode'!$H:$H,\"<\"&$D13),SUMIFS('Track by Mode'!AE:AE,'Track by Mode'!$H:$H,\">=\"&$B13)))),\"\")","v":""},{"$f":"IFERROR(IF($X$2,IF($A13=\"\",\"\",IF($A13=\"between\",SUMIFS('Track by Mode'!AG:AG,'Track by Mode'!$H:$H,\">=\"&$B13,'Track by Mode'!$H:$H,\"<\"&$D13,'Track by Mode'!$AI:$AI,\"=No\"),SUMIFS('Track by Mode'!AG:AG,'Track by Mode'!$H:$H,\">=\"&$B13,'Track by Mode'!$AI:$AI,\"=No\"))),IF($A13=\"\",\"\",IF($A13=\"between\",SUMIFS('Track by Mode'!AG:AG,'Track by Mode'!$H:$H,\">=\"&$B13,'Track by Mode'!$H:$H,\"<\"&$D13),SUMIFS('Track by Mode'!AG:AG,'Track by Mode'!$H:$H,\">=\"&$B13)))),\"\")","v":""},{"$f":"IFERROR(IF($O$2,IF($A13=\"\",\"\",IF($A13=\"between\",SUMIFS('Roadway by Mode'!N:N,'Roadway by Mode'!$H:$H,\">=\"&$B13,'Roadway by Mode'!$H:$H,\"<\"&$D13,'Roadway by Mode'!$V:$V,\"=No\"),SUMIFS('Roadway by Mode'!N:N,'Roadway by Mode'!$H:$H,\">=\"&$B13,'Roadway by Mode'!$V:$V,\"=No\"))),IF($A13=\"\",\"\",IF($A13=\"between\",SUMIFS('Roadway by Mode'!N:N,'Roadway by Mode'!$H:$H,\">=\"&$B13,'Roadway by Mode'!$H:$H,\"<\"&$D13),SUMIFS('Roadway by Mode'!N:N,'Roadway by Mode'!$H:$H,\">=\"&$B13)))),\"\")","v":""},{"$f":"IFERROR(IF($O$2,IF($A13=\"\",\"\",IF($A13=\"between\",SUMIFS('Roadway by Mode'!P:P,'Roadway by Mode'!$H:$H,\">=\"&$B13,'Roadway by Mode'!$H:$H,\"<\"&$D13,'Roadway by Mode'!$V:$V,\"=No\"),SUMIFS('Roadway by Mode'!P:P,'Roadway by Mode'!$H:$H,\">=\"&$B13,'Roadway by Mode'!$V:$V,\"=No\"))),IF($A13=\"\",\"\",IF($A13=\"between\",SUMIFS('Roadway by Mode'!P:P,'Roadway by Mode'!$H:$H,\">=\"&$B13,'Roadway by Mode'!$H:$H,\"<\"&$D13),SUMIFS('Roadway by Mode'!P:P,'Roadway by Mode'!$H:$H,\">=\"&$B13)))),\"\")","v":""},{"$f":"IFERROR(IF($O$2,IF($A13=\"\",\"\",IF($A13=\"between\",SUMIFS('Roadway by Mode'!R:R,'Roadway by Mode'!$H:$H,\">=\"&$B13,'Roadway by Mode'!$H:$H,\"<\"&$D13,'Roadway by Mode'!$V:$V,\"=No\"),SUMIFS('Roadway by Mode'!R:R,'Roadway by Mode'!$H:$H,\">=\"&$B13,'Roadway by Mode'!$V:$V,\"=No\"))),IF($A13=\"\",\"\",IF($A13=\"between\",SUMIFS('Roadway by Mode'!R:R,'Roadway by Mode'!$H:$H,\">=\"&$B13,'Roadway by Mode'!$H:$H,\"<\"&$D13),SUMIFS('Roadway by Mode'!R:R,'Roadway by Mode'!$H:$H,\">=\"&$B13)))),\"\")","v":""},{"$f":"IFERROR(IF($O$2,IF($A13=\"\",\"\",IF($A13=\"between\",SUMIFS('Roadway by Mode'!T:T,'Roadway by Mode'!$H:$H,\">=\"&$B13,'Roadway by Mode'!$H:$H,\"<\"&$D13,'Roadway by Mode'!$V:$V,\"=No\"),SUMIFS('Roadway by Mode'!T:T,'Roadway by Mode'!$H:$H,\">=\"&$B13,'Roadway by Mode'!$V:$V,\"=No\"))),IF($A13=\"\",\"\",IF($A13=\"between\",SUMIFS('Roadway by Mode'!T:T,'Roadway by Mode'!$H:$H,\">=\"&$B13,'Roadway by Mode'!$H:$H,\"<\"&$D13),SUMIFS('Roadway by Mode'!T:T,'Roadway by Mode'!$H:$H,\">=\"&$B13)))),\"\")","v":""}]
["","","",null,"invalid bin",{"$f":"IFERROR(IF($X$2,IF($A14=\"\",\"\",IF($A14=\"between\",SUMIFS('Track by Mode'!L:L,'Track by Mode'!$H:$H,\">=\"&$B14,'Track by Mode'!$H:$H,\"<\"&$D14,'Track by Mode'!$AI:$AI,\"=No\"),SUMIFS('Track by Mode'!L:L,'Track by Mode'!$H:$H,\">=\"&$B14,'Track by Mode'!$AI:$AI,\"=No\"))),IF($A14=\"\",\"\",IF($A14=\"between\",SUMIFS('Track by Mode'!L:L,'Track by Mode'!$H:$H,\">=\"&$B14,'Track by Mode'!$H:$H,\"<\"&$D14),SUMIFS('Track by Mode'!L:L,'Track by Mode'!$H:$H,\">=\"&$B14))))+IF($X$2,IF($A14=\"\",\"\",IF($A14=\"between\",SUMIFS('Roadway by Mode'!L:L,'Roadway by Mode'!$H:$H,\">=\"&$B14,'Roadway by Mode'!$H:$H,\"<\"&$D14,'Roadway by Mode'!$V:$V,\"=No\"),SUMIFS('Roadway by Mode'!L:L,'Roadway by Mode'!$H:$H,\">=\"&$B14,'Roadway by Mode'!$V:$V,\"=No\"))),IF($A14=\"\",\"\",IF($A14=\"between\",SUMIFS('Roadway by Mode'!L:L,'Roadway by Mode'!$H:$H,\">=\"&$B14,'Roadway by Mode'!$H:$H,\"<\"&$D14),SUMIFS('Roadway by Mode'!L:L,'Roadway by Mode'!$H:$H,\">=\"&$B14)))),\"\")","v":""},{"$f":"IFERROR(IF($X$2,IF($A14=\"\",\"\",IF($A14=\"between\",SUMIFS('Track by Mode'!N:N,'Track by Mode'!$H:$H,\">=\"&$B14,'Track by Mode'!$H:$H,\"<\"&$D14,'Track by Mode'!$AI:$AI,\"=No\"),SUMIFS('Track by Mode'!N:N,'Track by Mode'!$H:$H,\">=\"&$B14,'Track by Mode'!$AI:$AI,\"=No\"))),IF($A14=\"\",\"\",IF($A14=\"between\",SUMIFS('Track by Mode'!N:N,'Track by Mode'!$H:$H,\">=\"&$B14,'Track by Mode'!$H:$H,\"<\"&$D14),SUMIFS('Track by Mode'!N:N,'Track by Mode'!$H:$H,\">=\"&$B14)))),\"\")","v":""},{"$f":"IFERROR(IF($X$2,IF($A14=\"\",\"\",IF($A14=\"between\",SUMIFS('Track by Mode'!P:P,'Track by Mode'!$H:$H,\">=\"&$B14,'Track by Mode'!$H:$H,\"<\"&$D14,'Track by Mode'!$AI:$AI,\"=No\"),SUMIFS('Track by Mode'!P:P,'Track by Mode'!$H:$H,\">=\"&$B14,'Track by Mode'!$AI:$AI,\"=No\"))),IF($A14=\"\",\"\",IF($A14=\"between\",SUMIFS('Track by Mode'!P:P,'Track by Mode'!$H:$H,\">=\"&$B14,'Track by Mode'!$H:$H,\"<\"&$D14),SUMIFS('Track by Mode'!P:P,'Track by Mode'!$H:$H,\">=\"&$B14)))),\"\")","v":""},{"$f":"IFERROR(IF($X$2,IF($A14=\"\",\"\",IF($A14=\"between\",SUMIFS('Track by Mode'!R:R,'Track by Mode'!$H:$H,\">=\"&$B14,'Track by Mode'!$H:$H,\"<\"&$D14,'Track by Mode'!$AI:$AI,\"=No\"),SUMIFS('Track by Mode'!R:R,'Track by Mode'!$H:$H,\">=\"&$B14,'Track by Mode'!$AI:$AI,\"=No\"))),IF($A14=\"\",\"\",IF($A14=\"between\",SUMIFS('Track by Mode'!R:R,'Track by Mode'!$H:$H,\">=\"&$B14,'Track by Mode'!$H:$H,\"<\"&$D14),SUMIFS('Track by Mode'!R:R,'Track by Mode'!$H:$H,\">=\"&$B14)))),\"\")","v":""},{"$f":"IFERROR(IF($X$2,IF($A14=\"\",\"\",IF($A14=\"between\",SUMIFS('Track by Mode'!T:T,'Track by Mode'!$H:$H,\">=\"&$B14,'Track by Mode'!$H:$H,\"<\"&$D14,'Track by Mode'!$AI:$AI,\"=No\"),SUMIFS('Track by Mode'!T:T,'Track by Mode'!$H:$H,\">=\"&$B14,'Track by Mode'!$AI:$AI,\"=No\"))),IF($A14=\"\",\"\",IF($A14=\"between\",SUMIFS('Track by Mode'!T:T,'Track by Mode'!$H:$H,\">=\"&$B14,'Track by Mode'!$H:$H,\"<\"&$D14),SUMIFS('Track by Mode'!T:T,'Track by Mode'!$H:$H,\">=\"&$B14)))),\"\")","v":""},{"$f":"IFERROR(IF($X$2,IF($A14=\"\",\"\",IF($A14=\"between\",SUMIFS('Track by Mode'!V:V,'Track by Mode'!$H:$H,\">=\"&$B14,'Track by Mode'!$H:$H,\"<\"&$D14,'Track by Mode'!$AI:$AI,\"=No\"),SUMIFS('Track by Mode'!V:V,'Track by Mode'!$H:$H,\">=\"&$B14,'Track by Mode'!$AI:$AI,\"=No\"))),IF($A14=\"\",\"\",IF($A14=\"between\",SUMIFS('Track by Mode'!V:V,'Track by Mode'!$H:$H,\">=\"&$B14,'Track by Mode'!$H:$H,\"<\"&$D14),SUMIFS('Track by Mode'!V:V,'Track by Mode'!$H:$H,\">=\"&$B14)))),\"\")","v":""},{"$f":"IFERROR(IF($X$2,IF($A14=\"\",\"\",IF($A14=\"between\",SUMIFS('Track by Mode'!X:X,'Track by Mode'!$H:$H,\">=\"&$B14,'Track by Mode'!$H:$H,\"<\"&$D14,'Track by Mode'!$AI:$AI,\"=No\"),SUMIFS('Track by Mode'!X:X,'Track by Mode'!$H:$H,\">=\"&$B14,'Track by Mode'!$AI:$AI,\"=No\"))),IF($A14=\"\",\"\",IF($A14=\"between\",SUMIFS('Track by Mode'!X:X,'Track by Mode'!$H:$H,\">=\"&$B14,'Track by Mode'!$H:$H,\"<\"&$D14),SUMIFS('Track by Mode'!X:X,'Track by Mode'!$H:$H,\">=\"&$B14)))),\"\")","v":""},{"$f":"IFERROR(IF($X$2,IF($A14=\"\",\"\",IF($A14=\"between\",SUMIFS('Track by Mode'!Z:Z,'Track by Mode'!$H:$H,\">=\"&$B14,'Track by Mode'!$H:$H,\"<\"&$D14,'Track by Mode'!$AI:$AI,\"=No\"),SUMIFS('Track by Mode'!Z:Z,'Track by Mode'!$H:$H,\">=\"&$B14,'Track by Mode'!$AI:$AI,\"=No\"))),IF($A14=\"\",\"\",IF($A14=\"between\",SUMIFS('Track by Mode'!Z:Z,'Track by Mode'!$H:$H,\">=\"&$B14,'Track by Mode'!$H:$H,\"<\"&$D14),SUMIFS('Track by Mode'!Z:Z,'Track by Mode'!$H:$H,\">=\"&$B14)))),\"\")","v":""},{"$f":"IFERROR(IF($X$2,IF($A14=\"\",\"\",IF($A14=\"between\",SUMIFS('Track by Mode'!AC:AC,'Track by Mode'!$H:$H,\">=\"&$B14,'Track by Mode'!$H:$H,\"<\"&$D14,'Track by Mode'!$AI:$AI,\"=No\"),SUMIFS('Track by Mode'!AC:AC,'Track by Mode'!$H:$H,\">=\"&$B14,'Track by Mode'!$AI:$AI,\"=No\"))),IF($A14=\"\",\"\",IF($A14=\"between\",SUMIFS('Track by Mode'!AC:AC,'Track by Mode'!$H:$H,\">=\"&$B14,'Track by Mode'!$H:$H,\"<\"&$D14),SUMIFS('Track by Mode'!AC:AC,'Track by Mode'!$H:$H,\">=\"&$B14)))),\"\")","v":""},{"$f":"IFERROR(IF($X$2,IF($A14=\"\",\"\",IF($A14=\"between\",SUMIFS('Track by Mode'!AE:AE,'Track by Mode'!$H:$H,\">=\"&$B14,'Track by Mode'!$H:$H,\"<\"&$D14,'Track by Mode'!$AI:$AI,\"=No\"),SUMIFS('Track by Mode'!AE:AE,'Track by Mode'!$H:$H,\">=\"&$B14,'Track by Mode'!$AI:$AI,\"=No\"))),IF($A14=\"\",\"\",IF($A14=\"between\",SUMIFS('Track by Mode'!AE:AE,'Track by Mode'!$H:$H,\">=\"&$B14,'Track by Mode'!$H:$H,\"<\"&$D14),SUMIFS('Track by Mode'!AE:AE,'Track by Mode'!$H:$H,\">=\"&$B14)))),\"\")","v":""},{"$f":"IFERROR(IF($X$2,IF($A14=\"\",\"\",IF($A14=\"between\",SUMIFS('Track by Mode'!AG:AG,'Track by Mode'!$H:$H,\">=\"&$B14,'Track by Mode'!$H:$H,\"<\"&$D14,'Track by Mode'!$AI:$AI,\"=No\"),SUMIFS('Track by Mode'!AG:AG,'Track by Mode'!$H:$H,\">=\"&$B14,'Track by Mode'!$AI:$AI,\"=No\"))),IF($A14=\"\",\"\",IF($A14=\"between\",SUMIFS('Track by Mode'!AG:AG,'Track by Mode'!$H:$H,\">=\"&$B14,'Track by Mode'!$H:$H,\"<\"&$D14),SUMIFS('Track by Mode'!AG:AG,'Track by Mode'!$H:$H,\">=\"&$B14)))),\"\")","v":""},{"$f":"IFERROR(IF($O$2,IF($A14=\"\",\"\",IF($A14=\"between\",SUMIFS('Roadway by Mode'!N:N,'Roadway by Mode'!$H:$H,\">=\"&$B14,'Roadway by Mode'!$H:$H,\"<\"&$D14,'Roadway by Mode'!$V:$V,\"=No\"),SUMIFS('Roadway by Mode'!N:N,'Roadway by Mode'!$H:$H,\">=\"&$B14,'Roadway by Mode'!$V:$V,\"=No\"))),IF($A14=\"\",\"\",IF($A14=\"between\",SUMIFS('Roadway by Mode'!N:N,'Roadway by Mode'!$H:$H,\">=\"&$B14,'Roadway by Mode'!$H:$H,\"<\"&$D14),SUMIFS('Roadway by Mode'!N:N,'Roadway by Mode'!$H:$H,\">=\"&$B14)))),\"\")","v":""},{"$f":"IFERROR(IF($O$2,IF($A14=\"\",\"\",IF($A14=\"between\",SUMIFS('Roadway by Mode'!P:P,'Roadway by Mode'!$H:$H,\">=\"&$B14,'Roadway by Mode'!$H:$H,\"<\"&$D14,'Roadway by Mode'!$V:$V,\"=No\"),SUMIFS('Roadway by Mode'!P:P,'Roadway by Mode'!$H:$H,\">=\"&$B14,'Roadway by Mode'!$V:$V,\"=No\"))),IF($A14=\"\",\"\",IF($A14=\"between\",SUMIFS('Roadway by Mode'!P:P,'Roadway by Mode'!$H:$H,\">=\"&$B14,'Roadway by Mode'!$H:$H,\"<\"&$D14),SUMIFS('Roadway by Mode'!P:P,'Roadway by Mode'!$H:$H,\">=\"&$B14)))),\"\")","v":""},{"$f":"IFERROR(IF($O$2,IF($A14=\"\",\"\",IF($A14=\"between\",SUMIFS('Roadway by Mode'!R:R,'Roadway by Mode'!$H:$H,\">=\"&$B14,'Roadway by Mode'!$H:$H,\"<\"&$D14,'Roadway by Mode'!$V:$V,\"=No\"),SUMIFS('Roadway by Mode'!R:R,'Roadway by Mode'!$H:$H,\">=\"&$B14,'Roadway by Mode'!$V:$V,\"=No\"))),IF($A14=\"\",\"\",IF($A14=\"between\",SUMIFS('Roadway by Mode'!R:R,'Roadway by Mode'!$H:$H,\">=\"&$B14,'Roadway by Mode'!$H:$H,\"<\"&$D14),SUMIFS('Roadway by Mode'!R:R,'Roadway by Mode'!$H:$H,\">=\"&$B14)))),\"\")","v":""},{"$f":"IFERROR(IF($O$2,IF($A14=\"\",\"\",IF($A14=\"between\",SUMIFS('Roadway by Mode'!T:T,'Roadway by Mode'!$H:$H,\">=\"&$B14,'Roadway by Mode'!$H:$H,\"<\"&$D14,'Roadway by Mode'!$V:$V,\"=No\"),SUMIFS('Roadway by Mode'!T:T,'Roadway by Mode'!$H:$H,\">=\"&$B14,'Roadway by Mode'!$V:$V,\"=No\"))),IF($A14=\"\",\"\",IF($A14=\"between\",SUMIFS('Roadway by Mode'!T:T,'Roadway by Mode'!$H:$H,\">=\"&$B14,'Roadway by Mode'!$H:$H,\"<\"&$D14),SUMIFS('Roadway by Mode'!T:T,'Roadway by Mode'!$H:$H,\">=\"&$B14)))),\"\")","v":""}]
["","","",null,"invalid bin",{"$f":"IFERROR(IF($X$2,IF($A15=\"\",\"\",IF($A15=\"between\",SUMIFS('Track by Mode'!L:L,'Track by Mode'!$H:$H,\">=\"&$B15,'Track by Mode'!$H:$H,\"<\"&$D15,'Track by Mode'!$AI:$AI,\"=No\"),SUMIFS('Track by Mode'!L:L,'Track by Mode'!$H:$H,\">=\"&$B15,'Track by Mode'!$AI:$AI,\"=No\"))),IF($A15=\"\",\"\",IF($A15=\"between\",SUMIFS('Track by Mode'!L:L,'Track by Mode'!$H:$H,\">=\"&$B15,'Track by Mode'!$H:$H,\"<\"&$D15),SUMIFS('Track by Mode'!L:L,'Track by Mode'!$H:$H,\">=\"&$B15))))+IF($X$2,IF($A15=\"\",\"\",IF($A15=\"between\",SUMIFS('Roadway by Mode'!L:L,'Roadway by Mode'!$H:$H,\">=\"&$B15,'Roadway by Mode'!$H:$H,\"<\"&$D15,'Roadway by Mode'!$V:$V,\"=No\"),SUMIFS('Roadway by Mode'!L:L,'Roadway by Mode'!$H:$H,\">=\"&$B15,'Roadway by Mode'!$V:$V,\"=No\"))),IF($A15=\"\",\"\",IF($A15=\"between\",SUMIFS('Roadway by Mode'!L:L,'Roadway by Mode'!$H:$H,\">=\"&$B15,'Roadway by Mode'!$H:$H,\"<\"&$D15),SUMIFS('Roadway by Mode'!L:L,'Roadway by Mode'!$H:$H,\">=\"&$B15)))),\"\")","v":""},{"$f":"IFERROR(IF($X$2,IF($A15=\"\",\"\",IF($A15=\"between\",SUMIFS('Track by Mode'!N:N,'Track by Mode'!$H:$H,\">=\"&$B15,'Track by Mode'!$H:$H,\"<\"&$D15,'Track by Mode'!$AI:$AI,\"=No\"),SUMIFS('Track by Mode'!N:N,'Track by Mode'!$H:$H,\">=\"&$B15,'Track by Mode'!$AI:$AI,\"=No\"))),IF($A15=\"\",\"\",IF($A15=\"between\",SUMIFS('Track by Mode'!N:N,'Track by Mode'!$H:$H,\">=\"&$B15,'Track by Mode'!$H:$H,\"<\"&$D15),SUMIFS('Track by Mode'!N:N,'Track by Mode'!$H:$H,\">=\"&$B15)))),\"\")","v":""},{"$f":"IFERROR(IF($X$2,IF($A15=\"\",\"\",IF($A15=\"between\",SUMIFS('Track by Mode'!P:P,'Track by Mode'!$H:$H,\">=\"&$B15,'Track by Mode'!$H:$H,\"<\"&$D15,'Track by Mode'!$AI:$AI,\"=No\"),SUMIFS('Track by Mode'!P:P,'Track by Mode'!$H:$H,\">=\"&$B15,'Track by Mode'!$AI:$AI,\"=No\"))),IF($A15=\"\",\"\",IF($A15=\"between\",SUMIFS('Track by Mode'!P:P,'Track by Mode'!$H:$H,\">=\"&$B15,'Track by Mode'!$H:$H,\"<\"&$D15),SUMIFS('Track by Mode'!P:P,'Track by Mode'!$H:$H,\">=\"&$B15)))),\"\")","v":""},{"$f":"IFERROR(IF($X$2,IF($A15=\"\",\"\",IF($A15=\"between\",SUMIFS('Track by Mode'!R:R,'Track by Mode'!$H:$H,\">=\"&$B15,'Track by Mode'!$H:$H,\"<\"&$D15,'Track by Mode'!$AI:$AI,\"=No\"),SUMIFS('Track by Mode'!R:R,'Track by Mode'!$H:$H,\">=\"&$B15,'Track by Mode'!$AI:$AI,\"=No\"))),IF($A15=\"\",\"\",IF($A15=\"between\",SUMIFS('Track by Mode'!R:R,'Track by Mode'!$H:$H,\">=\"&$B15,'Track by Mode'!$H:$H,\"<\"&$D15),SUMIFS('Track by Mode'!R:R,'Track by Mode'!$H:$H,\">=\"&$B15)))),\"\")","v":""},{"$f":"IFERROR(IF($X$2,IF($A15=\"\",\"\",IF($A15=\"between\",SUMIFS('Track by Mode'!T:T,'Track by Mode'!$H:$H,\">=\"&$B15,'Track by Mode'!$H:$H,\"<\"&$D15,'Track by Mode'!$AI:$AI,\"=No\"),SUMIFS('Track by Mode'!T:T,'Track by Mode'!$H:$H,\">=\"&$B15,'Track by Mode'!$AI:$AI,\"=No\"))),IF($A15=\"\",\"\",IF($A15=\"between\",SUMIFS('Track by Mode'!T:T,'Track by Mode'!$H:$H,\">=\"&$B15,'Track by Mode'!$H:$H,\"<\"&$D15),SUMIFS('Track by Mode'!T:T,'Track by Mode'!$H:$H,\">=\"&$B15)))),\"\")","v":""},{"$f":"IFERROR(IF($X$2,IF($A15=\"\",\"\",IF($A15=\"between\",SUMIFS('Track by Mode'!V:V,'Track by Mode'!$H:$H,\">=\"&$B15,'Track by Mode'!$H:$H,\"<\"&$D15,'Track by Mode'!$AI:$AI,\"=No\"),SUMIFS('Track by Mode'!V:V,'Track by Mode'!$H:$H,\">=\"&$B15,'Track by Mode'!$AI:$AI,\"=No\"))),IF($A15=\"\",\"\",IF($A15=\"between\",SUMIFS('Track by Mode'!V:V,'Track by Mode'!$H:$H,\">=\"&$B15,'Track by Mode'!$H:$H,\"<\"&$D15),SUMIFS('Track by Mode'!V:V,'Track by Mode'!$H:$H,\">=\"&$B15)))),\"\")","v":""},{"$f":"IFERROR(IF($X$2,IF($A15=\"\",\"\",IF($A15=\"between\",SUMIFS('Track by Mode'!X:X,'Track by Mode'!$H:$H,\">=\"&$B15,'Track by Mode'!$H:$H,\"<\"&$D15,'Track by Mode'!$AI:$AI,\"=No\"),SUMIFS('Track by Mode'!X:X,'Track by Mode'!$H:$H,\">=\"&$B15,'Track by Mode'!$AI:$AI,\"=No\"))),IF($A15=\"\",\"\",IF($A15=\"between\",SUMIFS('Track by Mode'!X:X,'Track by Mode'!$H:$H,\">=\"&$B15,'Track by Mode'!$H:$H,\"<\"&$D15),SUMIFS('Track by Mode'!X:X,'Track by Mode'!$H:$H,\">=\"&$B15)))),\"\")","v":""},{"$f":"IFERROR(IF($X$2,IF($A15=\"\",\"\",IF($A15=\"between\",SUMIFS('Track by Mode'!Z:Z,'Track by Mode'!$H:$H,\">=\"&$B15,'Track by Mode'!$H:$H,\"<\"&$D15,'Track by Mode'!$AI:$AI,\"=No\"),SUMIFS('Track by Mode'!Z:Z,'Track by Mode'!$H:$H,\">=\"&$B15,'Track by Mode'!$AI:$AI,\"=No\"))),IF($A15=\"\",\"\",IF($A15=\"between\",SUMIFS('Track by Mode'!Z:Z,'Track by Mode'!$H:$H,\">=\"&$B15,'Track by Mode'!$H:$H,\"<\"&$D15),SUMIFS('Track by Mode'!Z:Z,'Track by Mode'!$H:$H,\">=\"&$B15)))),\"\")","v":""},{"$f":"IFERROR(IF($X$2,IF($A15=\"\",\"\",IF($A15=\"between\",SUMIFS('Track by Mode'!AC:AC,'Track by Mode'!$H:$H,\">=\"&$B15,'Track by Mode'!$H:$H,\"<\"&$D15,'Track by Mode'!$AI:$AI,\"=No\"),SUMIFS('Track by Mode'!AC:AC,'Track by Mode'!$H:$H,\">=\"&$B15,'Track by Mode'!$AI:$AI,\"=No\"))),IF($A15=\"\",\"\",IF($A15=\"between\",SUMIFS('Track by Mode'!AC:AC,'Track by Mode'!$H:$H,\">=\"&$B15,'Track by Mode'!$H:$H,\"<\"&$D15),SUMIFS('Track by Mode'!AC:AC,'Track by Mode'!$H:$H,\">=\"&$B15)))),\"\")","v":""},{"$f":"IFERROR(IF($X$2,IF($A15=\"\",\"\",IF($A15=\"between\",SUMIFS('Track by Mode'!AE:AE,'Track by Mode'!$H:$H,\">=\"&$B15,'Track by Mode'!$H:$H,\"<\"&$D15,'Track by Mode'!$AI:$AI,\"=No\"),SUMIFS('Track by Mode'!AE:AE,'Track by Mode'!$H:$H,\">=\"&$B15,'Track by Mode'!$AI:$AI,\"=No\"))),IF($A15=\"\",\"\",IF($A15=\"between\",SUMIFS('Track by Mode'!AE:AE,'Track by Mode'!$H:$H,\">=\"&$B15,'Track by Mode'!$H:$H,\"<\"&$D15),SUMIFS('Track by Mode'!AE:AE,'Track by Mode'!$H:$H,\">=\"&$B15)))),\"\")","v":""},{"$f":"IFERROR(IF($X$2,IF($A15=\"\",\"\",IF($A15=\"between\",SUMIFS('Track by Mode'!AG:AG,'Track by Mode'!$H:$H,\">=\"&$B15,'Track by Mode'!$H:$H,\"<\"&$D15,'Track by Mode'!$AI:$AI,\"=No\"),SUMIFS('Track by Mode'!AG:AG,'Track by Mode'!$H:$H,\">=\"&$B15,'Track by Mode'!$AI:$AI,\"=No\"))),IF($A15=\"\",\"\",IF($A15=\"between\",SUMIFS('Track by Mode'!AG:AG,'Track by Mode'!$H:$H,\">=\"&$B15,'Track by Mode'!$H:$H,\"<\"&$D15),SUMIFS('Track by Mode'!AG:AG,'Track by Mode'!$H:$H,\">=\"&$B15)))),\"\")","v":""},{"$f":"IFERROR(IF($O$2,IF($A15=\"\",\"\",IF($A15=\"between\",SUMIFS('Roadway by Mode'!N:N,'Roadway by Mode'!$H:$H,\">=\"&$B15,'Roadway by Mode'!$H:$H,\"<\"&$D15,'Roadway by Mode'!$V:$V,\"=No\"),SUMIFS('Roadway by Mode'!N:N,'Roadway by Mode'!$H:$H,\">=\"&$B15,'Roadway by Mode'!$V:$V,\"=No\"))),IF($A15=\"\",\"\",IF($A15=\"between\",SUMIFS('Roadway by Mode'!N:N,'Roadway by Mode'!$H:$H,\">=\"&$B15,'Roadway by Mode'!$H:$H,\"<\"&$D15),SUMIFS('Roadway by Mode'!N:N,'Roadway by Mode'!$H:$H,\">=\"&$B15)))),\"\")","v":""},{"$f":"IFERROR(IF($O$2,IF($A15=\"\",\"\",IF($A15=\"between\",SUMIFS('Roadway by Mode'!P:P,'Roadway by Mode'!$H:$H,\">=\"&$B15,'Roadway by Mode'!$H:$H,\"<\"&$D15,'Roadway by Mode'!$V:$V,\"=No\"),SUMIFS('Roadway by Mode'!P:P,'Roadway by Mode'!$H:$H,\">=\"&$B15,'Roadway by Mode'!$V:$V,\"=No\"))),IF($A15=\"\",\"\",IF($A15=\"between\",SUMIFS('Roadway by Mode'!P:P,'Roadway by Mode'!$H:$H,\">=\"&$B15,'Roadway by Mode'!$H:$H,\"<\"&$D15),SUMIFS('Roadway by Mode'!P:P,'Roadway by Mode'!$H:$H,\">=\"&$B15)))),\"\")","v":""},{"$f":"IFERROR(IF($O$2,IF($A15=\"\",\"\",IF($A15=\"between\",SUMIFS('Roadway by Mode'!R:R,'Roadway by Mode'!$H:$H,\">=\"&$B15,'Roadway by Mode'!$H:$H,\"<\"&$D15,'Roadway by Mode'!$V:$V,\"=No\"),SUMIFS('Roadway by Mode'!R:R,'Roadway by Mode'!$H:$H,\">=\"&$B15,'Roadway by Mode'!$V:$V,\"=No\"))),IF($A15=\"\",\"\",IF($A15=\"between\",SUMIFS('Roadway by Mode'!R:R,'Roadway by Mode'!$H:$H,\">=\"&$B15,'Roadway by Mode'!$H:$H,\"<\"&$D15),SUMIFS('Roadway by Mode'!R:R,'Roadway by Mode'!$H:$H,\">=\"&$B15)))),\"\")","v":""},{"$f":"IFERROR(IF($O$2,IF($A15=\"\",\"\",IF($A15=\"between\",SUMIFS('Roadway by Mode'!T:T,'Roadway by Mode'!$H:$H,\">=\"&$B15,'Roadway by Mode'!$H:$H,\"<\"&$D15,'Roadway by Mode'!$V:$V,\"=No\"),SUMIFS('Roadway by Mode'!T:T,'Roadway by Mode'!$H:$H,\">=\"&$B15,'Roadway by Mode'!$V:$V,\"=No\"))),IF($A15=\"\",\"\",IF($A15=\"between\",SUMIFS('Roadway by Mode'!T:T,'Roadway by Mode'!$H:$H,\">=\"&$B15,'Roadway by Mode'!$H:$H,\"<\"&$D15),SUMIFS('Roadway by Mode'!T:T,'Roadway by Mode'!$H:$H,\">=\"&$B15)))),\"\")","v":""}]
["","","",null,"invalid bin",{"$f":"IFERROR(IF($X$2,IF($A16=\"\",\"\",IF($A16=\"between\",SUMIFS('Track by Mode'!L:L,'Track by Mode'!$H:$H,\">=\"&$B16,'Track by Mode'!$H:$H,\"<\"&$D16,'Track by Mode'!$AI:$AI,\"=No\"),SUMIFS('Track by Mode'!L:L,'Track by Mode'!$H:$H,\">=\"&$B16,'Track by Mode'!$AI:$AI,\"=No\"))),IF($A16=\"\",\"\",IF($A16=\"between\",SUMIFS('Track by Mode'!L:L,'Track by Mode'!$H:$H,\">=\"&$B16,'Track by Mode'!$H:$H,\"<\"&$D16),SUMIFS('Track by Mode'!L:L,'Track by Mode'!$H:$H,\">=\"&$B16))))+IF($X$2,IF($A16=\"\",\"\",IF($A16=\"between\",SUMIFS('Roadway by Mode'!L:L,'Roadway by Mode'!$H:$H,\">=\"&$B16,'Roadway by Mode'!$H:$H,\"<\"&$D16,'Roadway by Mode'!$V:$V,\"=No\"),SUMIFS('Roadway by Mode'!L:L,'Roadway by Mode'!$H:$H,\">=\"&$B16,'Roadway by Mode'!$V:$V,\"=No\"))),IF($A16=\"\",\"\",IF($A16=\"between\",SUMIFS('Roadway by Mode'!L:L,'Roadway by Mode'!$H:$H,\">=\"&$B16,'Roadway by Mode'!$H:$H,\"<\"&$D16),SUMIFS('Roadway by Mode'!L:L,'Roadway by Mode'!$H:$H,\">=\"&$B16)))),\"\")","v":""},{"$f":"IFERROR(IF($X$2,IF($A16=\"\",\"\",IF($A16=\"between\",SUMIFS('Track by Mode'!N:N,'Track by Mode'!$H:$H,\">=\"&$B16,'Track by Mode'!$H:$H,\"<\"&$D16,'Track by Mode'!$AI:$AI,\"=No\"),SUMIFS('Track by Mode'!N:N,'Track by Mode'!$H:$H,\">=\"&$B16,'Track by Mode'!$AI:$AI,\"=No\"))),IF($A16=\"\",\"\",IF($A16=\"between\",SUMIFS('Track by Mode'!N:N,'Track by Mode'!$H:$H,\">=\"&$B16,'Track by Mode'!$H:$H,\"<\"&$D16),SUMIFS('Track by Mode'!N:N,'Track by Mode'!$H:$H,\">=\"&$B16)))),\"\")","v":""},{"$f":"IFERROR(IF($X$2,IF($A16=\"\",\"\",IF($A16=\"between\",SUMIFS('Track by Mode'!P:P,'Track by Mode'!$H:$H,\">=\"&$B16,'Track by Mode'!$H:$H,\"<\"&$D16,'Track by Mode'!$AI:$AI,\"=No\"),SUMIFS('Track by Mode'!P:P,'Track by Mode'!$H:$H,\">=\"&$B16,'Track by Mode'!$AI:$AI,\"=No\"))),IF($A16=\"\",\"\",IF($A16=\"between\",SUMIFS('Track by Mode'!P:P,'Track by Mode'!$H:$H,\">=\"&$B16,'Track by Mode'!$H:$H,\"<\"&$D16),SUMIFS('Track by Mode'!P:P,'Track by Mode'!$H:$H,\">=\"&$B16)))),\"\")","v":""},{"$f":"IFERROR(IF($X$2,IF($A16=\"\",\"\",IF($A16=\"between\",SUMIFS('Track by Mode'!R:R,'Track by Mode'!$H:$H,\">=\"&$B16,'Track by Mode'!$H:$H,\"<\"&$D16,'Track by Mode'!$AI:$AI,\"=No\"),SUMIFS('Track by Mode'!R:R,'Track by Mode'!$H:$H,\">=\"&$B16,'Track by Mode'!$AI:$AI,\"=No\"))),IF($A16=\"\",\"\",IF($A16=\"between\",SUMIFS('Track by Mode'!R:R,'Track by Mode'!$H:$H,\">=\"&$B16,'Track by Mode'!$H:$H,\"<\"&$D16),SUMIFS('Track by Mode'!R:R,'Track by Mode'!$H:$H,\">=\"&$B16)))),\"\")","v":""},{"$f":"IFERROR(IF($X$2,IF($A16=\"\",\"\",IF($A16=\"between\",SUMIFS('Track by Mode'!T:T,'Track by Mode'!$H:$H,\">=\"&$B16,'Track by Mode'!$H:$H,\"<\"&$D16,'Track by Mode'!$AI:$AI,\"=No\"),SUMIFS('Track by Mode'!T:T,'Track by Mode'!$H:$H,\">=\"&$B16,'Track by Mode'!$AI:$AI,\"=No\"))),IF($A16=\"\",\"\",IF($A16=\"between\",SUMIFS('Track by Mode'!T:T,'Track by Mode'!$H:$H,\">=\"&$B16,'Track by Mode'!$H:$H,\"<\"&$D16),SUMIFS('Track by Mode'!T:T,'Track by Mode'!$H:$H,\">=\"&$B16)))),\"\")","v":""},{"$f":"IFERROR(IF($X$2,IF($A16=\"\",\"\",IF($A16=\"between\",SUMIFS('Track by Mode'!V:V,'Track by Mode'!$H:$H,\">=\"&$B16,'Track by Mode'!$H:$H,\"<\"&$D16,'Track by Mode'!$AI:$AI,\"=No\"),SUMIFS('Track by Mode'!V:V,'Track by Mode'!$H:$H,\">=\"&$B16,'Track by Mode'!$AI:$AI,\"=No\"))),IF($A16=\"\",\"\",IF($A16=\"between\",SUMIFS('Track by Mode'!V:V,'Track by Mode'!$H:$H,\">=\"&$B16,'Track by Mode'!$H:$H,\"<\"&$D16),SUMIFS('Track by Mode'!V:V,'Track by Mode'!$H:$H,\">=\"&$B16)))),\"\")","v":""},{"$f":"IFERROR(IF($X$2,IF($A16=\"\",\"\",IF($A16=\"between\",SUMIFS('Track by Mode'!X:X,'Track by Mode'!$H:$H,\">=\"&$B16,'Track by Mode'!$H:$H,\"<\"&$D16,'Track by Mode'!$AI:$AI,\"=No\"),SUMIFS('Track by Mode'!X:X,'Track by Mode'!$H:$H,\">=\"&$B16,'Track by Mode'!$AI:$AI,\"=No\"))),IF($A16=\"\",\"\",IF($A16=\"between\",SUMIFS('Track by Mode'!X:X,'Track by Mode'!$H:$H,\">=\"&$B16,'Track by Mode'!$H:$H,\"<\"&$D16),SUMIFS('Track by Mode'!X:X,'Track by Mode'!$H:$H,\">=\"&$B16)))),\"\")","v":""},{"$f":"IFERROR(IF($X$2,IF($A16=\"\",\"\",IF($A16=\"between\",SUMIFS('Track by Mode'!Z:Z,'Track by Mode'!$H:$H,\">=\"&$B16,'Track by Mode'!$H:$H,\"<\"&$D16,'Track by Mode'!$AI:$AI,\"=No\"),SUMIFS('Track by Mode'!Z:Z,'Track by Mode'!$H:$H,\">=\"&$B16,'Track by Mode'!$AI:$AI,\"=No\"))),IF($A16=\"\",\"\",IF($A16=\"between\",SUMIFS('Track by Mode'!Z:Z,'Track by Mode'!$H:$H,\">=\"&$B16,'Track by Mode'!$H:$H,\"<\"&$D16),SUMIFS('Track by Mode'!Z:Z,'Track by Mode'!$H:$H,\">=\"&$B16)))),\"\")","v":""},{"$f":"IFERROR(IF($X$2,IF($A16=\"\",\"\",IF($A16=\"between\",SUMIFS('Track by Mode'!AC:AC,'Track by Mode'!$H:$H,\">=\"&$B16,'Track by Mode'!$H:$H,\"<\"&$D16,'Track by Mode'!$AI:$AI,\"=No\"),SUMIFS('Track by Mode'!AC:AC,'Track by Mode'!$H:$H,\">=\"&$B16,'Track by Mode'!$AI:$AI,\"=No\"))),IF($A16=\"\",\"\",IF($A16=\"between\",SUMIFS('Track by Mode'!AC:AC,'Track by Mode'!$H:$H,\">=\"&$B16,'Track by Mode'!$H:$H,\"<\"&$D16),SUMIFS('Track by Mode'!AC:AC,'Track by Mode'!$H:$H,\">=\"&$B16)))),\"\")","v":""},{"$f":"IFERROR(IF($X$2,IF($A16=\"\",\"\",IF($A16=\"between\",SUMIFS('Track by Mode'!AE:AE,'Track by Mode'!$H:$H,\">=\"&$B16,'Track by Mode'!$H:$H,\"<\"&$D16,'Track by Mode'!$AI:$AI,\"=No\"),SUMIFS('Track by Mode'!AE:AE,'Track by Mode'!$H:$H,\">=\"&$B16,'Track by Mode'!$AI:$AI,\"=No\"))),IF($A16=\"\",\"\",IF($A16=\"between\",SUMIFS('Track by Mode'!AE:AE,'Track by Mode'!$H:$H,\">=\"&$B16,'Track by Mode'!$H:$H,\"<\"&$D16),SUMIFS('Track by Mode'!AE:AE,'Track by Mode'!$H:$H,\">=\"&$B16)))),\"\")","v":""},{"$f":"IFERROR(IF($X$2,IF($A16=\"\",\"\",IF($A16=\"between\",SUMIFS('Track by Mode'!AG:AG,'Track by Mode'!$H:$H,\">=\"&$B16,'Track by Mode'!$H:$H,\"<\"&$D16,'Track by Mode'!$AI:$AI,\"=No\"),SUMIFS('Track by Mode'!AG:AG,'Track by Mode'!$H:$H,\">=\"&$B16,'Track by Mode'!$AI:$AI,\"=No\"))),IF($A16=\"\",\"\",IF($A16=\"between\",SUMIFS('Track by Mode'!AG:AG,'Track by Mode'!$H:$H,\">=\"&$B16,'Track by Mode'!$H:$H,\"<\"&$D16),SUMIFS('Track by Mode'!AG:AG,'Track by Mode'!$H:$H,\">=\"&$B16)))),\"\")","v":""},{"$f":"IFERROR(IF($O$2,IF($A16=\"\",\"\",IF($A16=\"between\",SUMIFS('Roadway by Mode'!N:N,'Roadway by Mode'!$H:$H,\">=\"&$B16,'Roadway by Mode'!$H:$H,\"<\"&$D16,'Roadway by Mode'!$V:$V,\"=No\"),SUMIFS('Roadway by Mode'!N:N,'Roadway by Mode'!$H:$H,\">=\"&$B16,'Roadway by Mode'!$V:$V,\"=No\"))),IF($A16=\"\",\"\",IF($A16=\"between\",SUMIFS('Roadway by Mode'!N:N,'Roadway by Mode'!$H:$H,\">=\"&$B16,'Roadway by Mode'!$H:$H,\"<\"&$D16),SUMIFS('Roadway by Mode'!N:N,'Roadway by Mode'!$H:$H,\">=\"&$B16)))),\"\")","v":""},{"$f":"IFERROR(IF($O$2,IF($A16=\"\",\"\",IF($A16=\"between\",SUMIFS('Roadway by Mode'!P:P,'Roadway by Mode'!$H:$H,\">=\"&$B16,'Roadway by Mode'!$H:$H,\"<\"&$D16,'Roadway by Mode'!$V:$V,\"=No\"),SUMIFS('Roadway by Mode'!P:P,'Roadway by Mode'!$H:$H,\">=\"&$B16,'Roadway by Mode'!$V:$V,\"=No\"))),IF($A16=\"\",\"\",IF($A16=\"between\",SUMIFS('Roadway by Mode'!P:P,'Roadway by Mode'!$H:$H,\">=\"&$B16,'Roadway by Mode'!$H:$H,\"<\"&$D16),SUMIFS('Roadway by Mode'!P:P,'Roadway by Mode'!$H:$H,\">=\"&$B16)))),\"\")","v":""},{"$f":"IFERROR(IF($O$2,IF($A16=\"\",\"\",IF($A16=\"between\",SUMIFS('Roadway by Mode'!R:R,'Roadway by Mode'!$H:$H,\">=\"&$B16,'Roadway by Mode'!$H:$H,\"<\"&$D16,'Roadway by Mode'!$V:$V,\"=No\"),SUMIFS('Roadway by Mode'!R:R,'Roadway by Mode'!$H:$H,\">=\"&$B16,'Roadway by Mode'!$V:$V,\"=No\"))),IF($A16=\"\",\"\",IF($A16=\"between\",SUMIFS('Roadway by Mode'!R:R,'Roadway by Mode'!$H:$H,\">=\"&$B16,'Roadway by Mode'!$H:$H,\"<\"&$D16),SUMIFS('Roadway by Mode'!R:R,'Roadway by Mode'!$H:$H,\">=\"&$B16)))),\"\")","v":""},{"$f":"IFERROR(IF($O$2,IF($A16=\"\",\"\",IF($A16=\"between\",SUMIFS('Roadway by Mode'!T:T,'Roadway by Mode'!$H:$H,\">=\"&$B16,'Roadway by Mode'!$H:$H,\"<\"&$D16,'Roadway by Mode'!$V:$V,\"=No\"),SUMIFS('Roadway by Mode'!T:T,'Roadway by Mode'!$H:$H,\">=\"&$B16,'Roadway by Mode'!$V:$V,\"=No\"))),IF($A16=\"\",\"\",IF($A16=\"between\",SUMIFS('Roadway by Mode'!T:T,'Roadway by Mode'!$H:$H,\">=\"&$B16,'Roadway by Mode'!$H:$H,\"<\"&$D16),SUMIFS('Roadway by Mode'!T:T,'Roadway by Mode'!$H:$H,\">=\"&$B16)))),\"\")","v":""}]
["","","",null,"invalid bin",{"$f":"IFERROR(IF($X$2,IF($A17=\"\",\"\",IF($A17=\"between\",SUMIFS('Track by Mode'!L:L,'Track by Mode'!$H:$H,\">=\"&$B17,'Track by Mode'!$H:$H,\"<\"&$D17,'Track by Mode'!$AI:$AI,\"=No\"),SUMIFS('Track by Mode'!L:L,'Track by Mode'!$H:$H,\">=\"&$B17,'Track by Mode'!$AI:$AI,\"=No\"))),IF($A17=\"\",\"\",IF($A17=\"between\",SUMIFS('Track by Mode'!L:L,'Track by Mode'!$H:$H,\">=\"&$B17,'Track by Mode'!$H:$H,\"<\"&$D17),SUMIFS('Track by Mode'!L:L,'Track by Mode'!$H:$H,\">=\"&$B17))))+IF($X$2,IF($A17=\"\",\"\",IF($A17=\"between\",SUMIFS('Roadway by Mode'!L:L,'Roadway by Mode'!$H:$H,\">=\"&$B17,'Roadway by Mode'!$H:$H,\"<\"&$D17,'Roadway by Mode'!$V:$V,\"=No\"),SUMIFS('Roadway by Mode'!L:L,'Roadway by Mode'!$H:$H,\">=\"&$B17,'Roadway by Mode'!$V:$V,\"=No\"))),IF($A17=\"\",\"\",IF($A17=\"between\",SUMIFS('Roadway by Mode'!L:L,'Roadway by Mode'!$H:$H,\">=\"&$B17,'Roadway by Mode'!$H:$H,\"<\"&$D17),SUMIFS('Roadway by Mode'!L:L,'Roadway by Mode'!$H:$H,\">=\"&$B17)))),\"\")","v":""},{"$f":"IFERROR(IF($X$2,IF($A17=\"\",\"\",IF($A17=\"between\",SUMIFS('Track by Mode'!N:N,'Track by Mode'!$H:$H,\">=\"&$B17,'Track by Mode'!$H:$H,\"<\"&$D17,'Track by Mode'!$AI:$AI,\"=No\"),SUMIFS('Track by Mode'!N:N,'Track by Mode'!$H:$H,\">=\"&$B17,'Track by Mode'!$AI:$AI,\"=No\"))),IF($A17=\"\",\"\",IF($A17=\"between\",SUMIFS('Track by Mode'!N:N,'Track by Mode'!$H:$H,\">=\"&$B17,'Track by Mode'!$H:$H,\"<\"&$D17),SUMIFS('Track by Mode'!N:N,'Track by Mode'!$H:$H,\">=\"&$B17)))),\"\")","v":""},{"$f":"IFERROR(IF($X$2,IF($A17=\"\",\"\",IF($A17=\"between\",SUMIFS('Track by Mode'!P:P,'Track by Mode'!$H:$H,\">=\"&$B17,'Track by Mode'!$H:$H,\"<\"&$D17,'Track by Mode'!$AI:$AI,\"=No\"),SUMIFS('Track by Mode'!P:P,'Track by Mode'!$H:$H,\">=\"&$B17,'Track by Mode'!$AI:$AI,\"=No\"))),IF($A17=\"\",\"\",IF($A17=\"between\",SUMIFS('Track by Mode'!P:P,'Track by Mode'!$H:$H,\">=\"&$B17,'Track by Mode'!$H:$H,\"<\"&$D17),SUMIFS('Track by Mode'!P:P,'Track by Mode'!$H:$H,\">=\"&$B17)))),\"\")","v":""},{"$f":"IFERROR(IF($X$2,IF($A17=\"\",\"\",IF($A17=\"between\",SUMIFS('Track by Mode'!R:R,'Track by Mode'!$H:$H,\">=\"&$B17,'Track by Mode'!$H:$H,\"<\"&$D17,'Track by Mode'!$AI:$AI,\"=No\"),SUMIFS('Track by Mode'!R:R,'Track by Mode'!$H:$H,\">=\"&$B17,'Track by Mode'!$AI:$AI,\"=No\"))),IF($A17=\"\",\"\",IF($A17=\"between\",SUMIFS('Track by Mode'!R:R,'Track by Mode'!$H:$H,\">=\"&$B17,'Track by Mode'!$H:$H,\"<\"&$D17),SUMIFS('Track by Mode'!R:R,'Track by Mode'!$H:$H,\">=\"&$B17)))),\"\")","v":""},{"$f":"IFERROR(IF($X$2,IF($A17=\"\",\"\",IF($A17=\"between\",SUMIFS('Track by Mode'!T:T,'Track by Mode'!$H:$H,\">=\"&$B17,'Track by Mode'!$H:$H,\"<\"&$D17,'Track by Mode'!$AI:$AI,\"=No\"),SUMIFS('Track by Mode'!T:T,'Track by Mode'!$H:$H,\">=\"&$B17,'Track by Mode'!$AI:$AI,\"=No\"))),IF($A17=\"\",\"\",IF($A17=\"between\",SUMIFS('Track by Mode'!T:T,'Track by Mode'!$H:$H,\">=\"&$B17,'Track by Mode'!$H:$H,\"<\"&$D17),SUMIFS('Track by Mode'!T:T,'Track by Mode'!$H:$H,\">=\"&$B17)))),\"\")","v":""},{"$f":"IFERROR(IF($X$2,IF($A17=\"\",\"\",IF($A17=\"between\",SUMIFS('Track by Mode'!V:V,'Track by Mode'!$H:$H,\">=\"&$B17,'Track by Mode'!$H:$H,\"<\"&$D17,'Track by Mode'!$AI:$AI,\"=No\"),SUMIFS('Track by Mode'!V:V,'Track by Mode'!$H:$H,\">=\"&$B17,'Track by Mode'!$AI:$AI,\"=No\"))),IF($A17=\"\",\"\",IF($A17=\"between\",SUMIFS('Track by Mode'!V:V,'Track by Mode'!$H:$H,\">=\"&$B17,'Track by Mode'!$H:$H,\"<\"&$D17),SUMIFS('Track by Mode'!V:V,'Track by Mode'!$H:$H,\">=\"&$B17)))),\"\")","v":""},{"$f":"IFERROR(IF($X$2,IF($A17=\"\",\"\",IF($A17=\"between\",SUMIFS('Track by Mode'!X:X,'Track by Mode'!$H:$H,\">=\"&$B17,'Track by Mode'!$H:$H,\"<\"&$D17,'Track by Mode'!$AI:$AI,\"=No\"),SUMIFS('Track by Mode'!X:X,'Track by Mode'!$H:$H,\">=\"&$B17,'Track by Mode'!$AI:$AI,\"=No\"))),IF($A17=\"\",\"\",IF($A17=\"between\",SUMIFS('Track by Mode'!X:X,'Track by Mode'!$H:$H,\">=\"&$B17,'Track by Mode'!$H:$H,\"<\"&$D17),SUMIFS('Track by Mode'!X:X,'Track by Mode'!$H:$H,\">=\"&$B17)))),\"\")","v":""},{"$f":"IFERROR(IF($X$2,IF($A17=\"\",\"\",IF($A17=\"between\",SUMIFS('Track by Mode'!Z:Z,'Track by Mode'!$H:$H,\">=\"&$B17,'Track by Mode'!$H:$H,\"<\"&$D17,'Track by Mode'!$AI:$AI,\"=No\"),SUMIFS('Track by Mode'!Z:Z,'Track by Mode'!$H:$H,\">=\"&$B17,'Track by Mode'!$AI:$AI,\"=No\"))),IF($A17=\"\",\"\",IF($A17=\"between\",SUMIFS('Track by Mode'!Z:Z,'Track by Mode'!$H:$H,\">=\"&$B17,'Track by Mode'!$H:$H,\"<\"&$D17),SUMIFS('Track by Mode'!Z:Z,'Track by Mode'!$H:$H,\">=\"&$B17)))),\"\")","v":""},{"$f":"IFERROR(IF($X$2,IF($A17=\"\",\"\",IF($A17=\"between\",SUMIFS('Track by Mode'!AC:AC,'Track by Mode'!$H:$H,\">=\"&$B17,'Track by Mode'!$H:$H,\"<\"&$D17,'Track by Mode'!$AI:$AI,\"=No\"),SUMIFS('Track by Mode'!AC:AC,'Track by Mode'!$H:$H,\">=\"&$B17,'Track by Mode'!$AI:$AI,\"=No\"))),IF($A17=\"\",\"\",IF($A17=\"between\",SUMIFS('Track by Mode'!AC:AC,'Track by Mode'!$H:$H,\">=\"&$B17,'Track by Mode'!$H:$H,\"<\"&$D17),SUMIFS('Track by Mode'!AC:AC,'Track by Mode'!$H:$H,\">=\"&$B17)))),\"\")","v":""},{"$f":"IFERROR(IF($X$2,IF($A17=\"\",\"\",IF($A17=\"between\",SUMIFS('Track by Mode'!AE:AE,'Track by Mode'!$H:$H,\">=\"&$B17,'Track by Mode'!$H:$H,\"<\"&$D17,'Track by Mode'!$AI:$AI,\"=No\"),SUMIFS('Track by Mode'!AE:AE,'Track by Mode'!$H:$H,\">=\"&$B17,'Track by Mode'!$AI:$AI,\"=No\"))),IF($A17=\"\",\"\",IF($A17=\"between\",SUMIFS('Track by Mode'!AE:AE,'Track by Mode'!$H:$H,\">=\"&$B17,'Track by Mode'!$H:$H,\"<\"&$D17),SUMIFS('Track by Mode'!AE:AE,'Track by Mode'!$H:$H,\">=\"&$B17)))),\"\")","v":""},{"$f":"IFERROR(IF($X$2,IF($A17=\"\",\"\",IF($A17=\"between\",SUMIFS('Track by Mode'!AG:AG,'Track by Mode'!$H:$H,\">=\"&$B17,'Track by Mode'!$H:$H,\"<\"&$D17,'Track by Mode'!$AI:$AI,\"=No\"),SUMIFS('Track by Mode'!AG:AG,'Track by Mode'!$H:$H,\">=\"&$B17,'Track by Mode'!$AI:$AI,\"=No\"))),IF($A17=\"\",\"\",IF($A17=\"between\",SUMIFS('Track by Mode'!AG:AG,'Track by Mode'!$H:$H,\">=\"&$B17,'Track by Mode'!$H:$H,\"<\"&$D17),SUMIFS('Track by Mode'!AG:AG,'Track by Mode'!$H:$H,\">=\"&$B17)))),\"\")","v":""},{"$f":"IFERROR(IF($O$2,IF($A17=\"\",\"\",IF($A17=\"between\",SUMIFS('Roadway by Mode'!N:N,'Roadway by Mode'!$H:$H,\">=\"&$B17,'Roadway by Mode'!$H:$H,\"<\"&$D17,'Roadway by Mode'!$V:$V,\"=No\"),SUMIFS('Roadway by Mode'!N:N,'Roadway by Mode'!$H:$H,\">=\"&$B17,'Roadway by Mode'!$V:$V,\"=No\"))),IF($A17=\"\",\"\",IF($A17=\"between\",SUMIFS('Roadway by Mode'!N:N,'Roadway by Mode'!$H:$H,\">=\"&$B17,'Roadway by Mode'!$H:$H,\"<\"&$D17),SUMIFS('Roadway by Mode'!N:N,'Roadway by Mode'!$H:$H,\">=\"&$B17)))),\"\")","v":""},{"$f":"IFERROR(IF($O$2,IF($A17=\"\",\"\",IF($A17=\"between\",SUMIFS('Roadway by Mode'!P:P,'Roadway by Mode'!$H:$H,\">=\"&$B17,'Roadway by Mode'!$H:$H,\"<\"&$D17,'Roadway by Mode'!$V:$V,\"=No\"),SUMIFS('Roadway by Mode'!P:P,'Roadway by Mode'!$H:$H,\">=\"&$B17,'Roadway by Mode'!$V:$V,\"=No\"))),IF($A17=\"\",\"\",IF($A17=\"between\",SUMIFS('Roadway by Mode'!P:P,'Roadway by Mode'!$H:$H,\">=\"&$B17,'Roadway by Mode'!$H:$H,\"<\"&$D17),SUMIFS('Roadway by Mode'!P:P,'Roadway by Mode'!$H:$H,\">=\"&$B17)))),\"\")","v":""},{"$f":"IFERROR(IF($O$2,IF($A17=\"\",\"\",IF($A17=\"between\",SUMIFS('Roadway by Mode'!R:R,'Roadway by Mode'!$H:$H,\">=\"&$B17,'Roadway by Mode'!$H:$H,\"<\"&$D17,'Roadway by Mode'!$V:$V,\"=No\"),SUMIFS('Roadway by Mode'!R:R,'Roadway by Mode'!$H:$H,\">=\"&$B17,'Roadway by Mode'!$V:$V,\"=No\"))),IF($A17=\"\",\"\",IF($A17=\"between\",SUMIFS('Roadway by Mode'!R:R,'Roadway by Mode'!$H:$H,\">=\"&$B17,'Roadway by Mode'!$H:$H,\"<\"&$D17),SUMIFS('Roadway by Mode'!R:R,'Roadway by Mode'!$H:$H,\">=\"&$B17)))),\"\")","v":""},{"$f":"IFERROR(IF($O$2,IF($A17=\"\",\"\",IF($A17=\"between\",SUMIFS('Roadway by Mode'!T:T,'Roadway by Mode'!$H:$H,\">=\"&$B17,'Roadway by Mode'!$H:$H,\"<\"&$D17,'Roadway by Mode'!$V:$V,\"=No\"),SUMIFS('Roadway by Mode'!T:T,'Roadway by Mode'!$H:$H,\">=\"&$B17,'Roadway by Mode'!$V:$V,\"=No\"))),IF($A17=\"\",\"\",IF($A17=\"between\",SUMIFS('Roadway by Mode'!T:T,'Roadway by Mode'!$H:$H,\">=\"&$B17,'Roadway by Mode'!$H:$H,\"<\"&$D17),SUMIFS('Roadway by Mode'!T:T,'Roadway by Mode'!$H:$H,\">=\"&$B17)))),\"\")","v":""}]
[null,null,null,null,null,{"$f":"IFERROR(G20&\":\"&CHAR(10)&G18&CHAR(10)&H18&CHAR(10)&I18&CHAR(10)&J18&CHAR(10)&K18&CHAR(10)&L18,\"\")","v":"under 200,000 population:\nAt Grade: Restricted Right-of-Way: 57%\nStreet Running: 0%\nElevated on Structure: 43%\nElevated on Fill: 0%\nOpen Cut: 0%\nSubway: 0%"},{"$f":"G1&\": \"&ROUND(100*G19/$M$19,0)&\"%\"","v":"At Grade: Restricted Right-of-Way: 57%"},{"$f":"H1&\": \"&ROUND(100*H19/$M$19,0)&\"%\"","v":"Street Running: 0%"},"Elevated on Structure: 43%","Elevated on Fill: 0%","Open Cut: 0%","Subway: 0%"]
[null,null,null,null,null,null,{"$f":"INDIRECT(\"G\"&(8+$F$20))","v":6.3},{"$f":"INDIRECT(\"H\"&(8+$F$20))","v":0},{"$f":"INDIRECT(\"I\"&(8+$F$20))","v":4.7},{"$f":"INDIRECT(\"J\"&(8+$F$20))","v":0},{"$f":"INDIRECT(\"K\"&(8+$F$20))","v":0},{"$f":"INDIRECT(\"L\"&(8+$F$20))","v":0},{"$f":"INDIRECT(\"M\"&(8+$F$20))","v":11}]
[null,null,null,null,null,1,{"$f":"IF(INDIRECT(\"A\"&(8+F20))=\"\",\"Please select a valid bin to graph.\",IF(OR(INDIRECT(\"A\"&(8+F20))=\"under\",INDIRECT(\"A\"&(8+F20))=\"over\"),INDIRECT(\"A\"&(8+F20))&\" \"&FIXED(INDIRECT(\"B\"&(8+F20)),0,0)&\" population\",\"between \"&FIXED(INDIRECT(\"B\"&(8+F20)),0,0)&\" and \"&FIXED(INDIRECT(\"D\"&(8+F20)),0,0)&\" population\"))","v":"under 200,000 population"}]
[]
["By Mode/Type of Service"]
[null,null,null,null,null,null,"Miles of Track",null,null,null,null,null,null,"Number of Crossings",null,null,"Miles of Roadway"]
["Mode","Type","Description",null,null,"VOMS","At Grade: Restricted Right-of-Way\nTrack Miles","\n\nStreet Running\nTrack Miles","\n\nElevated on Structure\nTrack Miles","\n\nElevated on Fill\nTrack Miles","\n\n\nOpen Cut\nTrack Miles","\n\n\nSubway\nTrack Miles","Total Track Miles","At Grade: Restricted Right-of-Way\nCrossings","\n\nStreet Running\nCrossings","Total Crossings","\n\nPermanent Busway\nRoadway Miles","\n\nPermanent HOV\nRoadway Miles","\nPart-Time Busway or HOV\nRoadway Miles","Total Roadway Miles"]
["AR","DO","Alaska Railroad - Directly Operated",null,null,{"$f":"IF($X$2,SUMIFS('Track by Mode'!L:L,'Track by Mode'!$J:$J,\"=\"&$A25,'Track by Mode'!$K:$K,\"=\"&$B25,'Track by Mode'!$AI:$AI,\"=No\"),SUMIFS('Track by Mode'!L:L,'Track by Mode'!$J:$J,\"=\"&$A25,'Track by Mode'!$K:$K,\"=\"&$B25))","v":39},{"$f":"IF($X$2,SUMIFS('Track by Mode'!N:N,'Track by Mode'!$J:$J,\"=\"&$A25,'Track by Mode'!$K:$K,\"=\"&$B25,'Track by Mode'!$AI:$AI,\"=No\"),SUMIFS('Track by Mode'!N:N,'Track by Mode'!$J:$J,\"=\"&$A25,'Track by Mode'!$K:$K,\"=\"&$B25))","v":676.1},{"$f":"IF($X$2,SUMIFS('Track by Mode'!P:P,'Track by Mode'!$J:$J,\"=\"&$A25,'Track by Mode'!$K:$K,\"=\"&$B25,'Track by Mode'!$AI:$AI,\"=No\"),SUMIFS('Track by Mode'!P:P,'Track by Mode'!$J:$J,\"=\"&$A25,'Track by Mode'!$K:$K,\"=\"&$B25))","v":2.6},{"$f":"IF($X$2,SUMIFS('Track by Mode'!R:R,'Track by Mode'!$J:$J,\"=\"&$A25,'Track by Mode'!$K:$K,\"=\"&$B25,'Track by Mode'!$AI:$AI,\"=No\"),SUMIFS('Track by Mode'!R:R,'Track by Mode'!$J:$J,\"=\"&$A25,'Track by Mode'!$K:$K,\"=\"&$B25))","v":0},{"$f":"IF($X$2,SUMIFS('Track by Mode'!T:T,'Track by Mode'!$J:$J,\"=\"&$A25,'Track by Mode'!$K:$K,\"=\"&$B25,'Track by Mode'!$AI:$AI,\"=No\"),SUMIFS('Track by Mode'!T:T,'Track by Mode'!$J:$J,\"=\"&$A25,'Track by Mode'!$K:$K,\"=\"&$B25))","v":0},{"$f":"IF($X$2,SUMIFS('Track by Mode'!V:V,'Track by Mode'!$J:$J,\"=\"&$A25,'Track by Mode'!$K:$K,\"=\"&$B25,'Track by Mode'!$AI:$AI,\"=No\"),SUMIFS('Track by Mode'!V:V,'Track by Mode'!$J:$J,\"=\"&$A25,'Track by Mode'!$K:$K,\"=\"&$B25))","v":0},{"$f":"IF($X$2,SUMIFS('Track by Mode'!X:X,'Track by Mode'!$J:$J,\"=\"&$A25,'Track by Mode'!$K:$K,\"=\"&$B25,'Track by Mode'!$AI:$AI,\"=No\"),SUMIFS('Track by Mode'!X:X,'Track by Mode'!$J:$J,\"=\"&$A25,'Track by Mode'!$K:$K,\"=\"&$B25))","v":4.0999999999999996},{"$f":"IF($X$2,SUMIFS('Track by Mode'!Z:Z,'Track by Mode'!$J:$J,\"=\"&$A25,'Track by Mode'!$K:$K,\"=\"&$B25,'Track by Mode'!$AI:$AI,\"=No\"),SUMIFS('Track by Mode'!Z:Z,'Track by Mode'!$J:$J,\"=\"&$A25,'Track by Mode'!$K:$K,\"=\"&$B25))","v":682.80000000000007},{"$f":"IF($X$2,SUMIFS('Track by Mode'!AC:AC,'Track by Mode'!$J:$J,\"=\"&$A25,'Track by Mode'!$K:$K,\"=\"&$B25,'Track by Mode'!$AI:$AI,\"=No\"),SUMIFS('Track by Mode'!AC:AC,'Track by Mode'!$J:$J,\"=\"&$A25,'Track by Mode'!$K:$K,\"=\"&$B25))","v":132},{"$f":"IF($X$2,SUMIFS('Track by Mode'!AE:AE,'Track by Mode'!$J:$J,\"=\"&$A25,'Track by Mode'!$K:$K,\"=\"&$B25,'Track by Mode'!$AI:$AI,\"=No\"),SUMIFS('Track by Mode'!AE:AE,'Track by Mode'!$J:$J,\"=\"&$A25,'Track by Mode'!$K:$K,\"=\"&$B25))","v":1},{"$f":"IF($X$2,SUMIFS('Track by Mode'!AG:AG,'Track by Mode'!$J:$J,\"=\"&$A25,'Track by Mode'!$K:$K,\"=\"&$B25,'Track by Mode'!$AI:$AI,\"=No\"),SUMIFS('Track by Mode'!AG:AG,'Track by Mode'!$J:$J,\"=\"&$A25,'Track by Mode'!$K:$K,\"=\"&$B25))","v":133},"-","-","-","-"]
["CC","DO","Cable Car - Directly Operated",null,null,{"$f":"IF($X$2,SUMIFS('Track by Mode'!L:L,'Track by Mode'!$J:$J,\"=\"&$A26,'Track by Mode'!$K:$K,\"=\"&$B26,'Track by Mode'!$AI:$AI,\"=No\"),SUMIFS('Track by Mode'!L:L,'Track by Mode'!$J:$J,\"=\"&$A26,'Track by Mode'!$K:$K,\"=\"&$B26))","v":27},{"$f":"IF($X$2,SUMIFS('Track by Mode'!N:N,'Track by Mode'!$J:$J,\"=\"&$A26,'Track by Mode'!$K:$K,\"=\"&$B26,'Track by Mode'!$AI:$AI,\"=No\"),SUMIFS('Track by Mode'!N:N,'Track by Mode'!$J:$J,\"=\"&$A26,'Track by Mode'!$K:$K,\"=\"&$B26))","v":0},{"$f":"IF($X$2,SUMIFS('Track by Mode'!P:P,'Track by Mode'!$J:$J,\"=\"&$A26,'Track by Mode'!$K:$K,\"=\"&$B26,'Track by Mode'!$AI:$AI,\"=No\"),SUMIFS('Track by Mode'!P:P,'Track by Mode'!$J:$J,\"=\"&$A26,'Track by Mode'!$K:$K,\"=\"&$B26))","v":8.8000000000000007},{"$f":"IF($X$2,SUMIFS('Track by Mode'!R:R,'Track by Mode'!$J:$J,\"=\"&$A26,'Track by Mode'!$K:$K,\"=\"&$B26,'Track by Mode'!$AI:$AI,\"=No\"),SUMIFS('Track by Mode'!R:R,'Track by Mode'!$J:$J,\"=\"&$A26,'Track by Mode'!$K:$K,\"=\"&$B26))","v":0},{"$f":"IF($X$2,SUMIFS('Track by Mode'!T:T,'Track by Mode'!$J:$J,\"=\"&$A26,'Track by Mode'!$K:$K,\"=\"&$B26,'Track by Mode'!$AI:$AI,\"=No\"),SUMIFS('Track by Mode'!T:T,'Track by Mode'!$J:$J,\"=\"&$A26,'Track by Mode'!$K:$K,\"=\"&$B26))","v":0},{"$f":"IF($X$2,SUMIFS('Track by Mode'!V:V,'Track by Mode'!$J:$J,\"=\"&$A26,'Track by Mode'!$K:$K,\"=\"&$B26,'Track by Mode'!$AI:$AI,\"=No\"),SUMIFS('Track by Mode'!V:V,'Track by Mode'!$J:$J,\"=\"&$A26,'Track by Mode'!$K:$K,\"=\"&$B26))","v":0},{"$f":"IF($X$2,SUMIFS('Track by Mode'!X:X,'Track by Mode'!$J:$J,\"=\"&$A26,'Track by Mode'!$K:$K,\"=\"&$B26,'Track by Mode'!$AI:$AI,\"=No\"),SUMIFS('Track by Mode'!X:X,'Track by Mode'!$J:$J,\"=\"&$A26,'Track by Mode'!$K:$K,\"=\"&$B26))","v":0},{"$f":"IF($X$2,SUMIFS('Track by Mode'!Z:Z,'Track by Mode'!$J:$J,\"=\"&$A26,'Track by Mode'!$K:$K,\"=\"&$B26,'Track by Mode'!$AI:$AI,\"=No\"),SUMIFS('Track by Mode'!Z:Z,'Track by Mode'!$J:$J,\"=\"&$A26,'Track by Mode'!$K:$K,\"=\"&$B26))","v":8.8000000000000007},{"$f":"IF($X$2,SUMIFS('Track by Mode'!AC:AC,'Track by Mode'!$J:$J,\"=\"&$A26,'Track by Mode'!$K:$K,\"=\"&$B26,'Track by Mode'!$AI:$AI,\"=No\"),SUMIFS('Track by Mode'!AC:AC,'Track by Mode'!$J:$J,\"=\"&$A26,'Track by Mode'!$K:$K,\"=\"&$B26))","v":0},{"$f":"IF($X$2,SUMIFS('Track by Mode'!AE:AE,'Track by Mode'!$J:$J,\"=\"&$A26,'Track by Mode'!$K:$K,\"=\"&$B26,'Track by Mode'!$AI:$AI,\"=No\"),SUMIFS('Track by Mode'!AE:AE,'Track by Mode'!$J:$J,\"=\"&$A26,'Track by Mode'!$K:$K,\"=\"&$B26))","v":77},{"$f":"IF($X$2,SUMIFS('Track by Mode'!AG:AG,'Track by Mode'!$J:$J,\"=\"&$A26,'Track by Mode'!$K:$K,\"=\"&$B26,'Track by Mode'!$AI:$AI,\"=No\"),SUMIFS('Track by Mode'!AG:AG,'Track by Mode'!$J:$J,\"=\"&$A26,'Track by Mode'!$K:$K,\"=\"&$B26))","v":77},"-","-","-","-"]
["CR","DO","Commuter Rail - Directly Operated",null,null,{"$f":"IF($X$2,SUMIFS('Track by Mode'!L:L,'Track by Mode'!$J:$J,\"=\"&$A27,'Track by Mode'!$K:$K,\"=\"&$B27,'Track by Mode'!$AI:$AI,\"=No\"),SUMIFS('Track by Mode'!L:L,'Track by Mode'!$J:$J,\"=\"&$A27,'Track by Mode'!$K:$K,\"=\"&$B27))","v":4981},{"$f":"IF($X$2,SUMIFS('Track by Mode'!N:N,'Track by Mode'!$J:$J,\"=\"&$A27,'Track by Mode'!$K:$K,\"=\"&$B27,'Track by Mode'!$AI:$AI,\"=No\"),SUMIFS('Track by Mode'!N:N,'Track by Mode'!$J:$J,\"=\"&$A27,'Track by Mode'!$K:$K,\"=\"&$B27))","v":3868.1},{"$f":"IF($X$2,SUMIFS('Track by Mode'!P:P,'Track by Mode'!$J:$J,\"=\"&$A27,'Track by Mode'!$K:$K,\"=\"&$B27,'Track by Mode'!$AI:$AI,\"=No\"),SUMIFS('Track by Mode'!P:P,'Track by Mode'!$J:$J,\"=\"&$A27,'Track by Mode'!$K:$K,\"=\"&$B27))","v":2},{"$f":"IF($X$2,SUMIFS('Track by Mode'!R:R,'Track by Mode'!$J:$J,\"=\"&$A27,'Track by Mode'!$K:$K,\"=\"&$B27,'Track by Mode'!$AI:$AI,\"=No\"),SUMIFS('Track by Mode'!R:R,'Track by Mode'!$J:$J,\"=\"&$A27,'Track by Mode'!$K:$K,\"=\"&$B27))","v":54},{"$f":"IF($X$2,SUMIFS('Track by Mode'!T:T,'Track by Mode'!$J:$J,\"=\"&$A27,'Track by Mode'!$K:$K,\"=\"&$B27,'Track by Mode'!$AI:$AI,\"=No\"),SUMIFS('Track by Mode'!T:T,'Track by Mode'!$J:$J,\"=\"&$A27,'Track by Mode'!$K:$K,\"=\"&$B27))","v":402.90000000000003},{"$f":"IF($X$2,SUMIFS('Track by Mode'!V:V,'Track by Mode'!$J:$J,\"=\"&$A27,'Track by Mode'!$K:$K,\"=\"&$B27,'Track by Mode'!$AI:$AI,\"=No\"),SUMIFS('Track by Mode'!V:V,'Track by Mode'!$J:$J,\"=\"&$A27,'Track by Mode'!$K:$K,\"=\"&$B27))","v":59.4},{"$f":"IF($X$2,SUMIFS('Track by Mode'!X:X,'Track by Mode'!$J:$J,\"=\"&$A27,'Track by Mode'!$K:$K,\"=\"&$B27,'Track by Mode'!$AI:$AI,\"=No\"),SUMIFS('Track by Mode'!X:X,'Track by Mode'!$J:$J,\"=\"&$A27,'Track by Mode'!$K:$K,\"=\"&$B27))","v":31.5},{"$f":"IF($X$2,SUMIFS('Track by Mode'!Z:Z,'Track by Mode'!$J:$J,\"=\"&$A27,'Track by Mode'!$K:$K,\"=\"&$B27,'Track by Mode'!$AI:$AI,\"=No\"),SUMIFS('Track by Mode'!Z:Z,'Track by Mode'!$J:$J,\"=\"&$A27,'Track by Mode'!$K:$K,\"=\"&$B27))","v":4417.8999999999996},{"$f":"IF($X$2,SUMIFS('Track by Mode'!AC:AC,'Track by Mode'!$J:$J,\"=\"&$A27,'Track by Mode'!$K:$K,\"=\"&$B27,'Track by Mode'!$AI:$AI,\"=No\"),SUMIFS('Track by Mode'!AC:AC,'Track by Mode'!$J:$J,\"=\"&$A27,'Track by Mode'!$K:$K,\"=\"&$B27))","v":1824},{"$f":"IF($X$2,SUMIFS('Track by Mode'!AE:AE,'Track by Mode'!$J:$J,\"=\"&$A27,'Track by Mode'!$K:$K,\"=\"&$B27,'Track by Mode'!$AI:$AI,\"=No\"),SUMIFS('Track by Mode'!AE:AE,'Track by Mode'!$J:$J,\"=\"&$A27,'Track by Mode'!$K:$K,\"=\"&$B27))","v":32},{"$f":"IF($X$2,SUMIFS('Track by Mode'!AG:AG,'Track by Mode'!$J:$J,\"=\"&$A27,'Track by Mode'!$K:$K,\"=\"&$B27,'Track by Mode'!$AI:$AI,\"=No\"),SUMIFS('Track by Mode'!AG:AG,'Track by Mode'!$J:$J,\"=\"&$A27,'Track by Mode'!$K:$K,\"=\"&$B27))","v":1856},"-","-","-","-"]
["CR","PT","Commuter Rail - Purchased Transportation",null,null,{"$f":"IF($X$2,SUMIFS('Track by Mode'!L:L,'Track by Mode'!$J:$J,\"=\"&$A28,'Track by Mode'!$K:$K,\"=\"&$B28,'Track by Mode'!$AI:$AI,\"=No\"),SUMIFS('Track by Mode'!L:L,'Track by Mode'!$J:$J,\"=\"&$A28,'Track by Mode'!$K:$K,\"=\"&$B28))","v":1297},{"$f":"IF($X$2,SUMIFS('Track by Mode'!N:N,'Track by Mode'!$J:$J,\"=\"&$A28,'Track by Mode'!$K:$K,\"=\"&$B28,'Track by Mode'!$AI:$AI,\"=No\"),SUMIFS('Track by Mode'!N:N,'Track by Mode'!$J:$J,\"=\"&$A28,'Track by Mode'!$K:$K,\"=\"&$B28))","v":3233.4999999999995},{"$f":"IF($X$2,SUMIFS('Track by Mode'!P:P,'Track by Mode'!$J:$J,\"=\"&$A28,'Track by Mode'!$K:$K,\"=\"&$B28,'Track by Mode'!$AI:$AI,\"=No\"),SUMIFS('Track by Mode'!P:P,'Track by Mode'!$J:$J,\"=\"&$A28,'Track by Mode'!$K:$K,\"=\"&$B28))","v":0},{"$f":"IF($X$2,SUMIFS('Track by Mode'!R:R,'Track by Mode'!$J:$J,\"=\"&$A28,'Track by Mode'!$K:$K,\"=\"&$B28,'Track by Mode'!$AI:$AI,\"=No\"),SUMIFS('Track by Mode'!R:R,'Track by Mode'!$J:$J,\"=\"&$A28,'Track by Mode'!$K:$K,\"=\"&$B28))","v":28.599999999999998},{"$f":"IF($X$2,SUMIFS('Track by Mode'!T:T,'Track by Mode'!$J:$J,\"=\"&$A28,'Track by Mode'!$K:$K,\"=\"&$B28,'Track by Mode'!$AI:$AI,\"=No\"),SUMIFS('Track by Mode'!T:T,'Track by Mode'!$J:$J,\"=\"&$A28,'Track by Mode'!$K:$K,\"=\"&$B28))","v":64},{"$f":"IF($X$2,SUMIFS('Track by Mode'!V:V,'Track by Mode'!$J:$J,\"=\"&$A28,'Track by Mode'!$K:$K,\"=\"&$B28,'Track by Mode'!$AI:$AI,\"=No\"),SUMIFS('Track by Mode'!V:V,'Track by Mode'!$J:$J,\"=\"&$A28,'Track by Mode'!$K:$K,\"=\"&$B28))","v":16.5},{"$f":"IF($X$2,SUMIFS('Track by Mode'!X:X,'Track by Mode'!$J:$J,\"=\"&$A28,'Track by Mode'!$K:$K,\"=\"&$B28,'Track by Mode'!$AI:$AI,\"=No\"),SUMIFS('Track by Mode'!X:X,'Track by Mode'!$J:$J,\"=\"&$A28,'Track by Mode'!$K:$K,\"=\"&$B28))","v":7.3000000000000007},{"$f":"IF($X$2,SUMIFS('Track by Mode'!Z:Z,'Track by Mode'!$J:$J,\"=\"&$A28,'Track by Mode'!$K:$K,\"=\"&$B28,'Track by Mode'!$AI:$AI,\"=No\"),SUMIFS('Track by Mode'!Z:Z,'Track by Mode'!$J:$J,\"=\"&$A28,'Track by Mode'!$K:$K,\"=\"&$B28))","v":3349.8999999999992},{"$f":"IF($X$2,SUMIFS('Track by Mode'!AC:AC,'Track by Mode'!$J:$J,\"=\"&$A28,'Track by Mode'!$K:$K,\"=\"&$B28,'Track by Mode'!$AI:$AI,\"=No\"),SUMIFS('Track by Mode'!AC:AC,'Track by Mode'!$J:$J,\"=\"&$A28,'Track by Mode'!$K:$K,\"=\"&$B28))","v":1488},{"$f":"IF($X$2,SUMIFS('Track by Mode'!AE:AE,'Track by Mode'!$J:$J,\"=\"&$A28,'Track by Mode'!$K:$K,\"=\"&$B28,'Track by Mode'!$AI:$AI,\"=No\"),SUMIFS('Track by Mode'!AE:AE,'Track by Mode'!$J:$J,\"=\"&$A28,'Track by Mode'!$K:$K,\"=\"&$B28))","v":0},{"$f":"IF($X$2,SUMIFS('Track by Mode'!AG:AG,'Track by Mode'!$J:$J,\"=\"&$A28,'Track by Mode'!$K:$K,\"=\"&$B28,'Track by Mode'!$AI:$AI,\"=No\"),SUMIFS('Track by Mode'!AG:AG,'Track by Mode'!$J:$J,\"=\"&$A28,'Track by Mode'!$K:$K,\"=\"&$B28))","v":1488},"-","-","-","-"]
["HR","DO","Heavy Rail - Directly Operated",null,null,{"$f":"IF($X$2,SUMIFS('Track by Mode'!L:L,'Track by Mode'!$J:$J,\"=\"&$A29,'Track by Mode'!$K:$K,\"=\"&$B29,'Track by Mode'!$AI:$AI,\"=No\"),SUMIFS('Track by Mode'!L:L,'Track by Mode'!$J:$J,\"=\"&$A29,'Track by Mode'!$K:$K,\"=\"&$B29))","v":9396},{"$f":"IF($X$2,SUMIFS('Track by Mode'!N:N,'Track by Mode'!$J:$J,\"=\"&$A29,'Track by Mode'!$K:$K,\"=\"&$B29,'Track by Mode'!$AI:$AI,\"=No\"),SUMIFS('Track by Mode'!N:N,'Track by Mode'!$J:$J,\"=\"&$A29,'Track by Mode'!$K:$K,\"=\"&$B29))","v":787.40000000000009},{"$f":"IF($X$2,SUMIFS('Track by Mode'!P:P,'Track by Mode'!$J:$J,\"=\"&$A29,'Track by Mode'!$K:$K,\"=\"&$B29,'Track by Mode'!$AI:$AI,\"=No\"),SUMIFS('Track by Mode'!P:P,'Track by Mode'!$J:$J,\"=\"&$A29,'Track by Mode'!$K:$K,\"=\"&$B29))","v":0},{"$f":"IF($X$2,SUMIFS('Track by Mode'!R:R,'Track by Mode'!$J:$J,\"=\"&$A29,'Track by Mode'!$K:$K,\"=\"&$B29,'Track by Mode'!$AI:$AI,\"=No\"),SUMIFS('Track by Mode'!R:R,'Track by Mode'!$J:$J,\"=\"&$A29,'Track by Mode'!$K:$K,\"=\"&$B29))","v":502.6},{"$f":"IF($X$2,SUMIFS('Track by Mode'!T:T,'Track by Mode'!$J:$J,\"=\"&$A29,'Track by Mode'!$K:$K,\"=\"&$B29,'Track by Mode'!$AI:$AI,\"=No\"),SUMIFS('Track by Mode'!T:T,'Track by Mode'!$J:$J,\"=\"&$A29,'Track by Mode'!$K:$K,\"=\"&$B29))","v":113.39999999999999},{"$f":"IF($X$2,SUMIFS('Track by Mode'!V:V,'Track by Mode'!$J:$J,\"=\"&$A29,'Track by Mode'!$K:$K,\"=\"&$B29,'Track by Mode'!$AI:$AI,\"=No\"),SUMIFS('Track by Mode'!V:V,'Track by Mode'!$J:$J,\"=\"&$A29,'Track by Mode'!$K:$K,\"=\"&$B29))","v":67.5},{"$f":"IF($X$2,SUMIFS('Track by Mode'!X:X,'Track by Mode'!$J:$J,\"=\"&$A29,'Track by Mode'!$K:$K,\"=\"&$B29,'Track by Mode'!$AI:$AI,\"=No\"),SUMIFS('Track by Mode'!X:X,'Track by Mode'!$J:$J,\"=\"&$A29,'Track by Mode'!$K:$K,\"=\"&$B29))","v":802.3},{"$f":"IF($X$2,SUMIFS('Track by Mode'!Z:Z,'Track by Mode'!$J:$J,\"=\"&$A29,'Track by Mode'!$K:$K,\"=\"&$B29,'Track by Mode'!$AI:$AI,\"=No\"),SUMIFS('Track by Mode'!Z:Z,'Track by Mode'!$J:$J,\"=\"&$A29,'Track by Mode'!$K:$K,\"=\"&$B29))","v":2273.1999999999998},{"$f":"IF($X$2,SUMIFS('Track by Mode'!AC:AC,'Track by Mode'!$J:$J,\"=\"&$A29,'Track by Mode'!$K:$K,\"=\"&$B29,'Track by Mode'!$AI:$AI,\"=No\"),SUMIFS('Track by Mode'!AC:AC,'Track by Mode'!$J:$J,\"=\"&$A29,'Track by Mode'!$K:$K,\"=\"&$B29))","v":27},{"$f":"IF($X$2,SUMIFS('Track by Mode'!AE:AE,'Track by Mode'!$J:$J,\"=\"&$A29,'Track by Mode'!$K:$K,\"=\"&$B29,'Track by Mode'!$AI:$AI,\"=No\"),SUMIFS('Track by Mode'!AE:AE,'Track by Mode'!$J:$J,\"=\"&$A29,'Track by Mode'!$K:$K,\"=\"&$B29))","v":0},{"$f":"IF($X$2,SUMIFS('Track by Mode'!AG:AG,'Track by Mode'!$J:$J,\"=\"&$A29,'Track by Mode'!$K:$K,\"=\"&$B29,'Track by Mode'!$AI:$AI,\"=No\"),SUMIFS('Track by Mode'!AG:AG,'Track by Mode'!$J:$J,\"=\"&$A29,'Track by Mode'!$K:$K,\"=\"&$B29))","v":27},"-","-","-","-"]
["HR","PT","Heavy Rail - Purchased Transportation",null,null,{"$f":"IF($X$2,SUMIFS('Track by Mode'!L:L,'Track by Mode'!$J:$J,\"=\"&$A30,'Track by Mode'!$K:$K,\"=\"&$B30,'Track by Mode'!$AI:$AI,\"=No\"),SUMIFS('Track by Mode'!L:L,'Track by Mode'!$J:$J,\"=\"&$A30,'Track by Mode'!$K:$K,\"=\"&$B30))","v":32},{"$f":"IF($X$2,SUMIFS('Track by Mode'!N:N,'Track by Mode'!$J:$J,\"=\"&$A30,'Track by Mode'!$K:$K,\"=\"&$B30,'Track by Mode'!$AI:$AI,\"=No\"),SUMIFS('Track by Mode'!N:N,'Track by Mode'!$J:$J,\"=\"&$A30,'Track by Mode'!$K:$K,\"=\"&$B30))","v":10.199999999999999},{"$f":"IF($X$2,SUMIFS('Track by Mode'!P:P,'Track by Mode'!$J:$J,\"=\"&$A30,'Track by Mode'!$K:$K,\"=\"&$B30,'Track by Mode'!$AI:$AI,\"=No\"),SUMIFS('Track by Mode'!P:P,'Track by Mode'!$J:$J,\"=\"&$A30,'Track by Mode'!$K:$K,\"=\"&$B30))","v":0},{"$f":"IF($X$2,SUMIFS('Track by Mode'!R:R,'Track by Mode'!$J:$J,\"=\"&$A30,'Track by Mode'!$K:$K,\"=\"&$B30,'Track by Mode'!$AI:$AI,\"=No\"),SUMIFS('Track by Mode'!R:R,'Track by Mode'!$J:$J,\"=\"&$A30,'Track by Mode'!$K:$K,\"=\"&$B30))","v":12.2},{"$f":"IF($X$2,SUMIFS('Track by Mode'!T:T,'Track by Mode'!$J:$J,\"=\"&$A30,'Track by Mode'!$K:$K,\"=\"&$B30,'Track by Mode'!$AI:$AI,\"=No\"),SUMIFS('Track by Mode'!T:T,'Track by Mode'!$J:$J,\"=\"&$A30,'Track by Mode'!$K:$K,\"=\"&$B30))","v":0},{"$f":"IF($X$2,SUMIFS('Track by Mode'!V:V,'Track by Mode'!$J:$J,\"=\"&$A30,'Track by Mode'!$K:$K,\"=\"&$B30,'Track by Mode'!$AI:$AI,\"=No\"),SUMIFS('Track by Mode'!V:V,'Track by Mode'!$J:$J,\"=\"&$A30,'Track by Mode'!$K:$K,\"=\"&$B30))","v":1.4},{"$f":"IF($X$2,SUMIFS('Track by Mode'!X:X,'Track by Mode'!$J:$J,\"=\"&$A30,'Track by Mode'!$K:$K,\"=\"&$B30,'Track by Mode'!$AI:$AI,\"=No\"),SUMIFS('Track by Mode'!X:X,'Track by Mode'!$J:$J,\"=\"&$A30,'Track by Mode'!$K:$K,\"=\"&$B30))","v":1.7},{"$f":"IF($X$2,SUMIFS('Track by Mode'!Z:Z,'Track by Mode'!$J:$J,\"=\"&$A30,'Track by Mode'!$K:$K,\"=\"&$B30,'Track by Mode'!$AI:$AI,\"=No\"),SUMIFS('Track by Mode'!Z:Z,'Track by Mode'!$J:$J,\"=\"&$A30,'Track by Mode'!$K:$K,\"=\"&$B30))","v":25.5},{"$f":"IF($X$2,SUMIFS('Track by Mode'!AC:AC,'Track by Mode'!$J:$J,\"=\"&$A30,'Track by Mode'!$K:$K,\"=\"&$B30,'Track by Mode'!$AI:$AI,\"=No\"),SUMIFS('Track by Mode'!AC:AC,'Track by Mode'!$J:$J,\"=\"&$A30,'Track by Mode'!$K:$K,\"=\"&$B30))","v":0},{"$f":"IF($X$2,SUMIFS('Track by Mode'!AE:AE,'Track by Mode'!$J:$J,\"=\"&$A30,'Track by Mode'!$K:$K,\"=\"&$B30,'Track by Mode'!$AI:$AI,\"=No\"),SUMIFS('Track by Mode'!AE:AE,'Track by Mode'!$J:$J,\"=\"&$A30,'Track by Mode'!$K:$K,\"=\"&$B30))","v":0},{"$f":"IF($X$2,SUMIFS('Track by Mode'!AG:AG,'Track by Mode'!$J:$J,\"=\"&$A30,'Track by Mode'!$K:$K,\"=\"&$B30,'Track by Mode'!$AI:$AI,\"=No\"),SUMIFS('Track by Mode'!AG:AG,'Track by Mode'!$J:$J,\"=\"&$A30,'Track by Mode'!$K:$K,\"=\"&$B30))","v":0},"-","-","-","-"]
["YR","PT","Hybrid Rail - Purchased Transportation",null,null,{"$f":"IF($X$2,SUMIFS('Track by Mode'!L:L,'Track by Mode'!$J:$J,\"=\"&$A31,'Track by Mode'!$K:$K,\"=\"&$B31,'Track by Mode'!$AI:$AI,\"=No\"),SUMIFS('Track by Mode'!L:L,'Track by Mode'!$J:$J,\"=\"&$A31,'Track by Mode'!$K:$K,\"=\"&$B31))","v":40},{"$f":"IF($X$2,SUMIFS('Track by Mode'!N:N,'Track by Mode'!$J:$J,\"=\"&$A31,'Track by Mode'!$K:$K,\"=\"&$B31,'Track by Mode'!$AI:$AI,\"=No\"),SUMIFS('Track by Mode'!N:N,'Track by Mode'!$J:$J,\"=\"&$A31,'Track by Mode'!$K:$K,\"=\"&$B31))","v":194.79999999999998},{"$f":"IF($X$2,SUMIFS('Track by Mode'!P:P,'Track by Mode'!$J:$J,\"=\"&$A31,'Track by Mode'!$K:$K,\"=\"&$B31,'Track by Mode'!$AI:$AI,\"=No\"),SUMIFS('Track by Mode'!P:P,'Track by Mode'!$J:$J,\"=\"&$A31,'Track by Mode'!$K:$K,\"=\"&$B31))","v":3.8},{"$f":"IF($X$2,SUMIFS('Track by Mode'!R:R,'Track by Mode'!$J:$J,\"=\"&$A31,'Track by Mode'!$K:$K,\"=\"&$B31,'Track by Mode'!$AI:$AI,\"=No\"),SUMIFS('Track by Mode'!R:R,'Track by Mode'!$J:$J,\"=\"&$A31,'Track by Mode'!$K:$K,\"=\"&$B31))","v":3.0999999999999996},{"$f":"IF($X$2,SUMIFS('Track by Mode'!T:T,'Track by Mode'!$J:$J,\"=\"&$A31,'Track by Mode'!$K:$K,\"=\"&$B31,'Track by Mode'!$AI:$AI,\"=No\"),SUMIFS('Track by Mode'!T:T,'Track by Mode'!$J:$J,\"=\"&$A31,'Track by Mode'!$K:$K,\"=\"&$B31))","v":0},{"$f":"IF($X$2,SUMIFS('Track by Mode'!V:V,'Track by Mode'!$J:$J,\"=\"&$A31,'Track by Mode'!$K:$K,\"=\"&$B31,'Track by Mode'!$AI:$AI,\"=No\"),SUMIFS('Track by Mode'!V:V,'Track by Mode'!$J:$J,\"=\"&$A31,'Track by Mode'!$K:$K,\"=\"&$B31))","v":0},{"$f":"IF($X$2,SUMIFS('Track by Mode'!X:X,'Track by Mode'!$J:$J,\"=\"&$A31,'Track by Mode'!$K:$K,\"=\"&$B31,'Track by Mode'!$AI:$AI,\"=No\"),SUMIFS('Track by Mode'!X:X,'Track by Mode'!$J:$J,\"=\"&$A31,'Track by Mode'!$K:$K,\"=\"&$B31))","v":0},{"$f":"IF($X$2,SUMIFS('Track by Mode'!Z:Z,'Track by Mode'!$J:$J,\"=\"&$A31,'Track by Mode'!$K:$K,\"=\"&$B31,'Track by Mode'!$AI:$AI,\"=No\"),SUMIFS('Track by Mode'!Z:Z,'Track by Mode'!$J:$J,\"=\"&$A31,'Track by Mode'!$K:$K,\"=\"&$B31))","v":201.7},{"$f":"IF($X$2,SUMIFS('Track by Mode'!AC:AC,'Track by Mode'!$J:$J,\"=\"&$A31,'Track by Mode'!$K:$K,\"=\"&$B31,'Track by Mode'!$AI:$AI,\"=No\"),SUMIFS('Track by Mode'!AC:AC,'Track by Mode'!$J:$J,\"=\"&$A31,'Track by Mode'!$K:$K,\"=\"&$B31))","v":255},{"$f":"IF($X$2,SUMIFS('Track by Mode'!AE:AE,'Track by Mode'!$J:$J,\"=\"&$A31,'Track by Mode'!$K:$K,\"=\"&$B31,'Track by Mode'!$AI:$AI,\"=No\"),SUMIFS('Track by Mode'!AE:AE,'Track by Mode'!$J:$J,\"=\"&$A31,'Track by Mode'!$K:$K,\"=\"&$B31))","v":13},{"$f":"IF($X$2,SUMIFS('Track by Mode'!AG:AG,'Track by Mode'!$J:$J,\"=\"&$A31,'Track by Mode'!$K:$K,\"=\"&$B31,'Track by Mode'!$AI:$AI,\"=No\"),SUMIFS('Track by Mode'!AG:AG,'Track by Mode'!$J:$J,\"=\"&$A31,'Track by Mode'!$K:$K,\"=\"&$B31))","v":268},"-","-","-","-"]
["IP","DO","Inclined Plane - Directly Operated",null,null,{"$f":"IF($X$2,SUMIFS('Track by Mode'!L:L,'Track by Mode'!$J:$J,\"=\"&$A32,'Track by Mode'!$K:$K,\"=\"&$B32,'Track by Mode'!$AI:$AI,\"=No\"),SUMIFS('Track by Mode'!L:L,'Track by Mode'!$J:$J,\"=\"&$A32,'Track by Mode'!$K:$K,\"=\"&$B32))","v":6},{"$f":"IF($X$2,SUMIFS('Track by Mode'!N:N,'Track by Mode'!$J:$J,\"=\"&$A32,'Track by Mode'!$K:$K,\"=\"&$B32,'Track by Mode'!$AI:$AI,\"=No\"),SUMIFS('Track by Mode'!N:N,'Track by Mode'!$J:$J,\"=\"&$A32,'Track by Mode'!$K:$K,\"=\"&$B32))","v":1.5},{"$f":"IF($X$2,SUMIFS('Track by Mode'!P:P,'Track by Mode'!$J:$J,\"=\"&$A32,'Track by Mode'!$K:$K,\"=\"&$B32,'Track by Mode'!$AI:$AI,\"=No\"),SUMIFS('Track by Mode'!P:P,'Track by Mode'!$J:$J,\"=\"&$A32,'Track by Mode'!$K:$K,\"=\"&$B32))","v":0},{"$f":"IF($X$2,SUMIFS('Track by Mode'!R:R,'Track by Mode'!$J:$J,\"=\"&$A32,'Track by Mode'!$K:$K,\"=\"&$B32,'Track by Mode'!$AI:$AI,\"=No\"),SUMIFS('Track by Mode'!R:R,'Track by Mode'!$J:$J,\"=\"&$A32,'Track by Mode'!$K:$K,\"=\"&$B32))","v":0},{"$f":"IF($X$2,SUMIFS('Track by Mode'!T:T,'Track by Mode'!$J:$J,\"=\"&$A32,'Track by Mode'!$K:$K,\"=\"&$B32,'Track by Mode'!$AI:$AI,\"=No\"),SUMIFS('Track by Mode'!T:T,'Track by Mode'!$J:$J,\"=\"&$A32,'Track by Mode'!$K:$K,\"=\"&$B32))","v":0},{"$f":"IF($X$2,SUMIFS('Track by Mode'!V:V,'Track by Mode'!$J:$J,\"=\"&$A32,'Track by Mode'!$K:$K,\"=\"&$B32,'Track by Mode'!$AI:$AI,\"=No\"),SUMIFS('Track by Mode'!V:V,'Track by Mode'!$J:$J,\"=\"&$A32,'Track by Mode'!$K:$K,\"=\"&$B32))","v":0},{"$f":"IF($X$2,SUMIFS('Track by Mode'!X:X,'Track by Mode'!$J:$J,\"=\"&$A32,'Track by Mode'!$K:$K,\"=\"&$B32,'Track by Mode'!$AI:$AI,\"=No\"),SUMIFS('Track by Mode'!X:X,'Track by Mode'!$J:$J,\"=\"&$A32,'Track by Mode'!$K:$K,\"=\"&$B32))","v":0},{"$f":"IF($X$2,SUMIFS('Track by Mode'!Z:Z,'Track by Mode'!$J:$J,\"=\"&$A32,'Track by Mode'!$K:$K,\"=\"&$B32,'Track by Mode'!$AI:$AI,\"=No\"),SUMIFS('Track by Mode'!Z:Z,'Track by Mode'!$J:$J,\"=\"&$A32,'Track by Mode'!$K:$K,\"=\"&$B32))","v":1.5},{"$f":"IF($X$2,SUMIFS('Track by Mode'!AC:AC,'Track by Mode'!$J:$J,\"=\"&$A32,'Track by Mode'!$K:$K,\"=\"&$B32,'Track by Mode'!$AI:$AI,\"=No\"),SUMIFS('Track by Mode'!AC:AC,'Track by Mode'!$J:$J,\"=\"&$A32,'Track by Mode'!$K:$K,\"=\"&$B32))","v":0},{"$f":"IF($X$2,SUMIFS('Track by Mode'!AE:AE,'Track by Mode'!$J:$J,\"=\"&$A32,'Track by Mode'!$K:$K,\"=\"&$B32,'Track by Mode'!$AI:$AI,\"=No\"),SUMIFS('Track by Mode'!AE:AE,'Track by Mode'!$J:$J,\"=\"&$A32,'Track by Mode'!$K:$K,\"=\"&$B32))","v":0},{"$f":"IF($X$2,SUMIFS('Track by Mode'!AG:AG,'Track by Mode'!$J:$J,\"=\"&$A32,'Track by Mode'!$K:$K,\"=\"&$B32,'Track by Mode'!$AI:$AI,\"=No\"),SUMIFS('Track by Mode'!AG:AG,'Track by Mode'!$J:$J,\"=\"&$A32,'Track by Mode'!$K:$K,\"=\"&$B32))","v":0},"-","-","-","-"]
["LR","DO","Light Rail - Directly Operated",null,null,{"$f":"IF($X$2,SUMIFS('Track by Mode'!L:L,'Track by Mode'!$J:$J,\"=\"&$A33,'Track by Mode'!$K:$K,\"=\"&$B33,'Track by Mode'!$AI:$AI,\"=No\"),SUMIFS('Track by Mode'!L:L,'Track by Mode'!$J:$J,\"=\"&$A33,'Track by Mode'!$K:$K,\"=\"&$B33))","v":1460},{"$f":"IF($X$2,SUMIFS('Track by Mode'!N:N,'Track by Mode'!$J:$J,\"=\"&$A33,'Track by Mode'!$K:$K,\"=\"&$B33,'Track by Mode'!$AI:$AI,\"=No\"),SUMIFS('Track by Mode'!N:N,'Track by Mode'!$J:$J,\"=\"&$A33,'Track by Mode'!$K:$K,\"=\"&$B33))","v":1043.9000000000001},{"$f":"IF($X$2,SUMIFS('Track by Mode'!P:P,'Track by Mode'!$J:$J,\"=\"&$A33,'Track by Mode'!$K:$K,\"=\"&$B33,'Track by Mode'!$AI:$AI,\"=No\"),SUMIFS('Track by Mode'!P:P,'Track by Mode'!$J:$J,\"=\"&$A33,'Track by Mode'!$K:$K,\"=\"&$B33))","v":62.7},{"$f":"IF($X$2,SUMIFS('Track by Mode'!R:R,'Track by Mode'!$J:$J,\"=\"&$A33,'Track by Mode'!$K:$K,\"=\"&$B33,'Track by Mode'!$AI:$AI,\"=No\"),SUMIFS('Track by Mode'!R:R,'Track by Mode'!$J:$J,\"=\"&$A33,'Track by Mode'!$K:$K,\"=\"&$B33))","v":154.00000000000003},{"$f":"IF($X$2,SUMIFS('Track by Mode'!T:T,'Track by Mode'!$J:$J,\"=\"&$A33,'Track by Mode'!$K:$K,\"=\"&$B33,'Track by Mode'!$AI:$AI,\"=No\"),SUMIFS('Track by Mode'!T:T,'Track by Mode'!$J:$J,\"=\"&$A33,'Track by Mode'!$K:$K,\"=\"&$B33))","v":81.100000000000009},{"$f":"IF($X$2,SUMIFS('Track by Mode'!V:V,'Track by Mode'!$J:$J,\"=\"&$A33,'Track by Mode'!$K:$K,\"=\"&$B33,'Track by Mode'!$AI:$AI,\"=No\"),SUMIFS('Track by Mode'!V:V,'Track by Mode'!$J:$J,\"=\"&$A33,'Track by Mode'!$K:$K,\"=\"&$B33))","v":53.8},{"$f":"IF($X$2,SUMIFS('Track by Mode'!X:X,'Track by Mode'!$J:$J,\"=\"&$A33,'Track by Mode'!$K:$K,\"=\"&$B33,'Track by Mode'!$AI:$AI,\"=No\"),SUMIFS('Track by Mode'!X:X,'Track by Mode'!$J:$J,\"=\"&$A33,'Track by Mode'!$K:$K,\"=\"&$B33))","v":84},{"$f":"IF($X$2,SUMIFS('Track by Mode'!Z:Z,'Track by Mode'!$J:$J,\"=\"&$A33,'Track by Mode'!$K:$K,\"=\"&$B33,'Track by Mode'!$AI:$AI,\"=No\"),SUMIFS('Track by Mode'!Z:Z,'Track by Mode'!$J:$J,\"=\"&$A33,'Track by Mode'!$K:$K,\"=\"&$B33))","v":1479.4999999999998},{"$f":"IF($X$2,SUMIFS('Track by Mode'!AC:AC,'Track by Mode'!$J:$J,\"=\"&$A33,'Track by Mode'!$K:$K,\"=\"&$B33,'Track by Mode'!$AI:$AI,\"=No\"),SUMIFS('Track by Mode'!AC:AC,'Track by Mode'!$J:$J,\"=\"&$A33,'Track by Mode'!$K:$K,\"=\"&$B33))","v":1462},{"$f":"IF($X$2,SUMIFS('Track by Mode'!AE:AE,'Track by Mode'!$J:$J,\"=\"&$A33,'Track by Mode'!$K:$K,\"=\"&$B33,'Track by Mode'!$AI:$AI,\"=No\"),SUMIFS('Track by Mode'!AE:AE,'Track by Mode'!$J:$J,\"=\"&$A33,'Track by Mode'!$K:$K,\"=\"&$B33))","v":554},{"$f":"IF($X$2,SUMIFS('Track by Mode'!AG:AG,'Track by Mode'!$J:$J,\"=\"&$A33,'Track by Mode'!$K:$K,\"=\"&$B33,'Track by Mode'!$AI:$AI,\"=No\"),SUMIFS('Track by Mode'!AG:AG,'Track by Mode'!$J:$J,\"=\"&$A33,'Track by Mode'!$K:$K,\"=\"&$B33))","v":2016},"-","-","-","-"]
["LR","PT","Light Rail - Purchased Transportation",null,null,{"$f":"IF($X$2,SUMIFS('Track by Mode'!L:L,'Track by Mode'!$J:$J,\"=\"&$A34,'Track by Mode'!$K:$K,\"=\"&$B34,'Track by Mode'!$AI:$AI,\"=No\"),SUMIFS('Track by Mode'!L:L,'Track by Mode'!$J:$J,\"=\"&$A34,'Track by Mode'!$K:$K,\"=\"&$B34))","v":70},{"$f":"IF($X$2,SUMIFS('Track by Mode'!N:N,'Track by Mode'!$J:$J,\"=\"&$A34,'Track by Mode'!$K:$K,\"=\"&$B34,'Track by Mode'!$AI:$AI,\"=No\"),SUMIFS('Track by Mode'!N:N,'Track by Mode'!$J:$J,\"=\"&$A34,'Track by Mode'!$K:$K,\"=\"&$B34))","v":73.5},{"$f":"IF($X$2,SUMIFS('Track by Mode'!P:P,'Track by Mode'!$J:$J,\"=\"&$A34,'Track by Mode'!$K:$K,\"=\"&$B34,'Track by Mode'!$AI:$AI,\"=No\"),SUMIFS('Track by Mode'!P:P,'Track by Mode'!$J:$J,\"=\"&$A34,'Track by Mode'!$K:$K,\"=\"&$B34))","v":1.7000000000000002},{"$f":"IF($X$2,SUMIFS('Track by Mode'!R:R,'Track by Mode'!$J:$J,\"=\"&$A34,'Track by Mode'!$K:$K,\"=\"&$B34,'Track by Mode'!$AI:$AI,\"=No\"),SUMIFS('Track by Mode'!R:R,'Track by Mode'!$J:$J,\"=\"&$A34,'Track by Mode'!$K:$K,\"=\"&$B34))","v":3.4000000000000004},{"$f":"IF($X$2,SUMIFS('Track by Mode'!T:T,'Track by Mode'!$J:$J,\"=\"&$A34,'Track by Mode'!$K:$K,\"=\"&$B34,'Track by Mode'!$AI:$AI,\"=No\"),SUMIFS('Track by Mode'!T:T,'Track by Mode'!$J:$J,\"=\"&$A34,'Track by Mode'!$K:$K,\"=\"&$B34))","v":0.9},{"$f":"IF($X$2,SUMIFS('Track by Mode'!V:V,'Track by Mode'!$J:$J,\"=\"&$A34,'Track by Mode'!$K:$K,\"=\"&$B34,'Track by Mode'!$AI:$AI,\"=No\"),SUMIFS('Track by Mode'!V:V,'Track by Mode'!$J:$J,\"=\"&$A34,'Track by Mode'!$K:$K,\"=\"&$B34))","v":0},{"$f":"IF($X$2,SUMIFS('Track by Mode'!X:X,'Track by Mode'!$J:$J,\"=\"&$A34,'Track by Mode'!$K:$K,\"=\"&$B34,'Track by Mode'!$AI:$AI,\"=No\"),SUMIFS('Track by Mode'!X:X,'Track by Mode'!$J:$J,\"=\"&$A34,'Track by Mode'!$K:$K,\"=\"&$B34))","v":0},{"$f":"IF($X$2,SUMIFS('Track by Mode'!Z:Z,'Track by Mode'!$J:$J,\"=\"&$A34,'Track by Mode'!$K:$K,\"=\"&$B34,'Track by Mode'!$AI:$AI,\"=No\"),SUMIFS('Track by Mode'!Z:Z,'Track by Mode'!$J:$J,\"=\"&$A34,'Track by Mode'!$K:$K,\"=\"&$B34))","v":79.5},{"$f":"IF($X$2,SUMIFS('Track by Mode'!AC:AC,'Track by Mode'!$J:$J,\"=\"&$A34,'Track by Mode'!$K:$K,\"=\"&$B34,'Track by Mode'!$AI:$AI,\"=No\"),SUMIFS('Track by Mode'!AC:AC,'Track by Mode'!$J:$J,\"=\"&$A34,'Track by Mode'!$K:$K,\"=\"&$B34))","v":163},{"$f":"IF($X$2,SUMIFS('Track by Mode'!AE:AE,'Track by Mode'!$J:$J,\"=\"&$A34,'Track by Mode'!$K:$K,\"=\"&$B34,'Track by Mode'!$AI:$AI,\"=No\"),SUMIFS('Track by Mode'!AE:AE,'Track by Mode'!$J:$J,\"=\"&$A34,'Track by Mode'!$K:$K,\"=\"&$B34))","v":10},{"$f":"IF($X$2,SUMIFS('Track by Mode'!AG:AG,'Track by Mode'!$J:$J,\"=\"&$A34,'Track by Mode'!$K:$K,\"=\"&$B34,'Track by Mode'!$AI:$AI,\"=No\"),SUMIFS('Track by Mode'!AG:AG,'Track by Mode'!$J:$J,\"=\"&$A34,'Track by Mode'!$K:$K,\"=\"&$B34))","v":173},"-","-","-","-"]
["MG","DO","Monorail/Automated Guideway - Directly Operated",null,null,{"$f":"IF($X$2,SUMIFS('Track by Mode'!L:L,'Track by Mode'!$J:$J,\"=\"&$A35,'Track by Mode'!$K:$K,\"=\"&$B35,'Track by Mode'!$AI:$AI,\"=No\"),SUMIFS('Track by Mode'!L:L,'Track by Mode'!$J:$J,\"=\"&$A35,'Track by Mode'!$K:$K,\"=\"&$B35))","v":126},{"$f":"IF($X$2,SUMIFS('Track by Mode'!N:N,'Track by Mode'!$J:$J,\"=\"&$A35,'Track by Mode'!$K:$K,\"=\"&$B35,'Track by Mode'!$AI:$AI,\"=No\"),SUMIFS('Track by Mode'!N:N,'Track by Mode'!$J:$J,\"=\"&$A35,'Track by Mode'!$K:$K,\"=\"&$B35))","v":4},{"$f":"IF($X$2,SUMIFS('Track by Mode'!P:P,'Track by Mode'!$J:$J,\"=\"&$A35,'Track by Mode'!$K:$K,\"=\"&$B35,'Track by Mode'!$AI:$AI,\"=No\"),SUMIFS('Track by Mode'!P:P,'Track by Mode'!$J:$J,\"=\"&$A35,'Track by Mode'!$K:$K,\"=\"&$B35))","v":0},{"$f":"IF($X$2,SUMIFS('Track by Mode'!R:R,'Track by Mode'!$J:$J,\"=\"&$A35,'Track by Mode'!$K:$K,\"=\"&$B35,'Track by Mode'!$AI:$AI,\"=No\"),SUMIFS('Track by Mode'!R:R,'Track by Mode'!$J:$J,\"=\"&$A35,'Track by Mode'!$K:$K,\"=\"&$B35))","v":30.099999999999998},{"$f":"IF($X$2,SUMIFS('Track by Mode'!T:T,'Track by Mode'!$J:$J,\"=\"&$A35,'Track by Mode'!$K:$K,\"=\"&$B35,'Track by Mode'!$AI:$AI,\"=No\"),SUMIFS('Track by Mode'!T:T,'Track by Mode'!$J:$J,\"=\"&$A35,'Track by Mode'!$K:$K,\"=\"&$B35))","v":0},{"$f":"IF($X$2,SUMIFS('Track by Mode'!V:V,'Track by Mode'!$J:$J,\"=\"&$A35,'Track by Mode'!$K:$K,\"=\"&$B35,'Track by Mode'!$AI:$AI,\"=No\"),SUMIFS('Track by Mode'!V:V,'Track by Mode'!$J:$J,\"=\"&$A35,'Track by Mode'!$K:$K,\"=\"&$B35))","v":0},{"$f":"IF($X$2,SUMIFS('Track by Mode'!X:X,'Track by Mode'!$J:$J,\"=\"&$A35,'Track by Mode'!$K:$K,\"=\"&$B35,'Track by Mode'!$AI:$AI,\"=No\"),SUMIFS('Track by Mode'!X:X,'Track by Mode'!$J:$J,\"=\"&$A35,'Track by Mode'!$K:$K,\"=\"&$B35))","v":0},{"$f":"IF($X$2,SUMIFS('Track by Mode'!Z:Z,'Track by Mode'!$J:$J,\"=\"&$A35,'Track by Mode'!$K:$K,\"=\"&$B35,'Track by Mode'!$AI:$AI,\"=No\"),SUMIFS('Track by Mode'!Z:Z,'Track by Mode'!$J:$J,\"=\"&$A35,'Track by Mode'!$K:$K,\"=\"&$B35))","v":34.1},{"$f":"IF($X$2,SUMIFS('Track by Mode'!AC:AC,'Track by Mode'!$J:$J,\"=\"&$A35,'Track by Mode'!$K:$K,\"=\"&$B35,'Track by Mode'!$AI:$AI,\"=No\"),SUMIFS('Track by Mode'!AC:AC,'Track by Mode'!$J:$J,\"=\"&$A35,'Track by Mode'!$K:$K,\"=\"&$B35))","v":0},{"$f":"IF($X$2,SUMIFS('Track by Mode'!AE:AE,'Track by Mode'!$J:$J,\"=\"&$A35,'Track by Mode'!$K:$K,\"=\"&$B35,'Track by Mode'!$AI:$AI,\"=No\"),SUMIFS('Track by Mode'!AE:AE,'Track by Mode'!$J:$J,\"=\"&$A35,'Track by Mode'!$K:$K,\"=\"&$B35))","v":0},{"$f":"IF($X$2,SUMIFS('Track by Mode'!AG:AG,'Track by Mode'!$J:$J,\"=\"&$A35,'Track by Mode'!$K:$K,\"=\"&$B35,'Track by Mode'!$AI:$AI,\"=No\"),SUMIFS('Track by Mode'!AG:AG,'Track by Mode'!$J:$J,\"=\"&$A35,'Track by Mode'!$K:$K,\"=\"&$B35))","v":0},"-","-","-","-"]
["MG","PT","Monorail/Automated Guideway - Purchased Transportation",null,null,{"$f":"IF($X$2,SUMIFS('Track by Mode'!L:L,'Track by Mode'!$J:$J,\"=\"&$A36,'Track by Mode'!$K:$K,\"=\"&$B36,'Track by Mode'!$AI:$AI,\"=No\"),SUMIFS('Track by Mode'!L:L,'Track by Mode'!$J:$J,\"=\"&$A36,'Track by Mode'!$K:$K,\"=\"&$B36))","v":36},{"$f":"IF($X$2,SUMIFS('Track by Mode'!N:N,'Track by Mode'!$J:$J,\"=\"&$A36,'Track by Mode'!$K:$K,\"=\"&$B36,'Track by Mode'!$AI:$AI,\"=No\"),SUMIFS('Track by Mode'!N:N,'Track by Mode'!$J:$J,\"=\"&$A36,'Track by Mode'!$K:$K,\"=\"&$B36))","v":0.3},{"$f":"IF($X$2,SUMIFS('Track by Mode'!P:P,'Track by Mode'!$J:$J,\"=\"&$A36,'Track by Mode'!$K:$K,\"=\"&$B36,'Track by Mode'!$AI:$AI,\"=No\"),SUMIFS('Track by Mode'!P:P,'Track by Mode'!$J:$J,\"=\"&$A36,'Track by Mode'!$K:$K,\"=\"&$B36))","v":0},{"$f":"IF($X$2,SUMIFS('Track by Mode'!R:R,'Track by Mode'!$J:$J,\"=\"&$A36,'Track by Mode'!$K:$K,\"=\"&$B36,'Track by Mode'!$AI:$AI,\"=No\"),SUMIFS('Track by Mode'!R:R,'Track by Mode'!$J:$J,\"=\"&$A36,'Track by Mode'!$K:$K,\"=\"&$B36))","v":12},{"$f":"IF($X$2,SUMIFS('Track by Mode'!T:T,'Track by Mode'!$J:$J,\"=\"&$A36,'Track by Mode'!$K:$K,\"=\"&$B36,'Track by Mode'!$AI:$AI,\"=No\"),SUMIFS('Track by Mode'!T:T,'Track by Mode'!$J:$J,\"=\"&$A36,'Track by Mode'!$K:$K,\"=\"&$B36))","v":0},{"$f":"IF($X$2,SUMIFS('Track by Mode'!V:V,'Track by Mode'!$J:$J,\"=\"&$A36,'Track by Mode'!$K:$K,\"=\"&$B36,'Track by Mode'!$AI:$AI,\"=No\"),SUMIFS('Track by Mode'!V:V,'Track by Mode'!$J:$J,\"=\"&$A36,'Track by Mode'!$K:$K,\"=\"&$B36))","v":0.3},{"$f":"IF($X$2,SUMIFS('Track by Mode'!X:X,'Track by Mode'!$J:$J,\"=\"&$A36,'Track by Mode'!$K:$K,\"=\"&$B36,'Track by Mode'!$AI:$AI,\"=No\"),SUMIFS('Track by Mode'!X:X,'Track by Mode'!$J:$J,\"=\"&$A36,'Track by Mode'!$K:$K,\"=\"&$B36))","v":0},{"$f":"IF($X$2,SUMIFS('Track by Mode'!Z:Z,'Track by Mode'!$J:$J,\"=\"&$A36,'Track by Mode'!$K:$K,\"=\"&$B36,'Track by Mode'!$AI:$AI,\"=No\"),SUMIFS('Track by Mode'!Z:Z,'Track by Mode'!$J:$J,\"=\"&$A36,'Track by Mode'!$K:$K,\"=\"&$B36))","v":12.600000000000001},{"$f":"IF($X$2,SUMIFS('Track by Mode'!AC:AC,'Track by Mode'!$J:$J,\"=\"&$A36,'Track by Mode'!$K:$K,\"=\"&$B36,'Track by Mode'!$AI:$AI,\"=No\"),SUMIFS('Track by Mode'!AC:AC,'Track by Mode'!$J:$J,\"=\"&$A36,'Track by Mode'!$K:$K,\"=\"&$B36))","v":0},{"$f":"IF($X$2,SUMIFS('Track by Mode'!AE:AE,'Track by Mode'!$J:$J,\"=\"&$A36,'Track by Mode'!$K:$K,\"=\"&$B36,'Track by Mode'!$AI:$AI,\"=No\"),SUMIFS('Track by Mode'!AE:AE,'Track by Mode'!$J:$J,\"=\"&$A36,'Track by Mode'!$K:$K,\"=\"&$B36))","v":0},{"$f":"IF($X$2,SUMIFS('Track by Mode'!AG:AG,'Track by Mode'!$J:$J,\"=\"&$A36,'Track by Mode'!$K:$K,\"=\"&$B36,'Track by Mode'!$AI:$AI,\"=No\"),SUMIFS('Track by Mode'!AG:AG,'Track by Mode'!$J:$J,\"=\"&$A36,'Track by Mode'!$K:$K,\"=\"&$B36))","v":0},"-","-","-","-"]
["SR","DO","Street Car Rail - Directly Operated",null,null,{"$f":"IF($X$2,SUMIFS('Track by Mode'!L:L,'Track by Mode'!$J:$J,\"=\"&$A37,'Track by Mode'!$K:$K,\"=\"&$B37,'Track by Mode'!$AI:$AI,\"=No\"),SUMIFS('Track by Mode'!L:L,'Track by Mode'!$J:$J,\"=\"&$A37,'Track by Mode'!$K:$K,\"=\"&$B37))","v":173},{"$f":"IF($X$2,SUMIFS('Track by Mode'!N:N,'Track by Mode'!$J:$J,\"=\"&$A37,'Track by Mode'!$K:$K,\"=\"&$B37,'Track by Mode'!$AI:$AI,\"=No\"),SUMIFS('Track by Mode'!N:N,'Track by Mode'!$J:$J,\"=\"&$A37,'Track by Mode'!$K:$K,\"=\"&$B37))","v":36.300000000000004},{"$f":"IF($X$2,SUMIFS('Track by Mode'!P:P,'Track by Mode'!$J:$J,\"=\"&$A37,'Track by Mode'!$K:$K,\"=\"&$B37,'Track by Mode'!$AI:$AI,\"=No\"),SUMIFS('Track by Mode'!P:P,'Track by Mode'!$J:$J,\"=\"&$A37,'Track by Mode'!$K:$K,\"=\"&$B37))","v":235.19999999999996},{"$f":"IF($X$2,SUMIFS('Track by Mode'!R:R,'Track by Mode'!$J:$J,\"=\"&$A37,'Track by Mode'!$K:$K,\"=\"&$B37,'Track by Mode'!$AI:$AI,\"=No\"),SUMIFS('Track by Mode'!R:R,'Track by Mode'!$J:$J,\"=\"&$A37,'Track by Mode'!$K:$K,\"=\"&$B37))","v":0.6},{"$f":"IF($X$2,SUMIFS('Track by Mode'!T:T,'Track by Mode'!$J:$J,\"=\"&$A37,'Track by Mode'!$K:$K,\"=\"&$B37,'Track by Mode'!$AI:$AI,\"=No\"),SUMIFS('Track by Mode'!T:T,'Track by Mode'!$J:$J,\"=\"&$A37,'Track by Mode'!$K:$K,\"=\"&$B37))","v":0.2},{"$f":"IF($X$2,SUMIFS('Track by Mode'!V:V,'Track by Mode'!$J:$J,\"=\"&$A37,'Track by Mode'!$K:$K,\"=\"&$B37,'Track by Mode'!$AI:$AI,\"=No\"),SUMIFS('Track by Mode'!V:V,'Track by Mode'!$J:$J,\"=\"&$A37,'Track by Mode'!$K:$K,\"=\"&$B37))","v":0},{"$f":"IF($X$2,SUMIFS('Track by Mode'!X:X,'Track by Mode'!$J:$J,\"=\"&$A37,'Track by Mode'!$K:$K,\"=\"&$B37,'Track by Mode'!$AI:$AI,\"=No\"),SUMIFS('Track by Mode'!X:X,'Track by Mode'!$J:$J,\"=\"&$A37,'Track by Mode'!$K:$K,\"=\"&$B37))","v":5},{"$f":"IF($X$2,SUMIFS('Track by Mode'!Z:Z,'Track by Mode'!$J:$J,\"=\"&$A37,'Track by Mode'!$K:$K,\"=\"&$B37,'Track by Mode'!$AI:$AI,\"=No\"),SUMIFS('Track by Mode'!Z:Z,'Track by Mode'!$J:$J,\"=\"&$A37,'Track by Mode'!$K:$K,\"=\"&$B37))","v":277.29999999999995},{"$f":"IF($X$2,SUMIFS('Track by Mode'!AC:AC,'Track by Mode'!$J:$J,\"=\"&$A37,'Track by Mode'!$K:$K,\"=\"&$B37,'Track by Mode'!$AI:$AI,\"=No\"),SUMIFS('Track by Mode'!AC:AC,'Track by Mode'!$J:$J,\"=\"&$A37,'Track by Mode'!$K:$K,\"=\"&$B37))","v":98},{"$f":"IF($X$2,SUMIFS('Track by Mode'!AE:AE,'Track by Mode'!$J:$J,\"=\"&$A37,'Track by Mode'!$K:$K,\"=\"&$B37,'Track by Mode'!$AI:$AI,\"=No\"),SUMIFS('Track by Mode'!AE:AE,'Track by Mode'!$J:$J,\"=\"&$A37,'Track by Mode'!$K:$K,\"=\"&$B37))","v":902},{"$f":"IF($X$2,SUMIFS('Track by Mode'!AG:AG,'Track by Mode'!$J:$J,\"=\"&$A37,'Track by Mode'!$K:$K,\"=\"&$B37,'Track by Mode'!$AI:$AI,\"=No\"),SUMIFS('Track by Mode'!AG:AG,'Track by Mode'!$J:$J,\"=\"&$A37,'Track by Mode'!$K:$K,\"=\"&$B37))","v":1000},"-","-","-","-"]
["SR","PT","Street Car Rail - Purchased Transportation",null,null,{"$f":"IF($X$2,SUMIFS('Track by Mode'!L:L,'Track by Mode'!$J:$J,\"=\"&$A38,'Track by Mode'!$K:$K,\"=\"&$B38,'Track by Mode'!$AI:$AI,\"=No\"),SUMIFS('Track by Mode'!L:L,'Track by Mode'!$J:$J,\"=\"&$A38,'Track by Mode'!$K:$K,\"=\"&$B38))","v":39},{"$f":"IF($X$2,SUMIFS('Track by Mode'!N:N,'Track by Mode'!$J:$J,\"=\"&$A38,'Track by Mode'!$K:$K,\"=\"&$B38,'Track by Mode'!$AI:$AI,\"=No\"),SUMIFS('Track by Mode'!N:N,'Track by Mode'!$J:$J,\"=\"&$A38,'Track by Mode'!$K:$K,\"=\"&$B38))","v":18.600000000000001},{"$f":"IF($X$2,SUMIFS('Track by Mode'!P:P,'Track by Mode'!$J:$J,\"=\"&$A38,'Track by Mode'!$K:$K,\"=\"&$B38,'Track by Mode'!$AI:$AI,\"=No\"),SUMIFS('Track by Mode'!P:P,'Track by Mode'!$J:$J,\"=\"&$A38,'Track by Mode'!$K:$K,\"=\"&$B38))","v":14.8},{"$f":"IF($X$2,SUMIFS('Track by Mode'!R:R,'Track by Mode'!$J:$J,\"=\"&$A38,'Track by Mode'!$K:$K,\"=\"&$B38,'Track by Mode'!$AI:$AI,\"=No\"),SUMIFS('Track by Mode'!R:R,'Track by Mode'!$J:$J,\"=\"&$A38,'Track by Mode'!$K:$K,\"=\"&$B38))","v":0},{"$f":"IF($X$2,SUMIFS('Track by Mode'!T:T,'Track by Mode'!$J:$J,\"=\"&$A38,'Track by Mode'!$K:$K,\"=\"&$B38,'Track by Mode'!$AI:$AI,\"=No\"),SUMIFS('Track by Mode'!T:T,'Track by Mode'!$J:$J,\"=\"&$A38,'Track by Mode'!$K:$K,\"=\"&$B38))","v":0},{"$f":"IF($X$2,SUMIFS('Track by Mode'!V:V,'Track by Mode'!$J:$J,\"=\"&$A38,'Track by Mode'!$K:$K,\"=\"&$B38,'Track by Mode'!$AI:$AI,\"=No\"),SUMIFS('Track by Mode'!V:V,'Track by Mode'!$J:$J,\"=\"&$A38,'Track by Mode'!$K:$K,\"=\"&$B38))","v":0},{"$f":"IF($X$2,SUMIFS('Track by Mode'!X:X,'Track by Mode'!$J:$J,\"=\"&$A38,'Track by Mode'!$K:$K,\"=\"&$B38,'Track by Mode'!$AI:$AI,\"=No\"),SUMIFS('Track by Mode'!X:X,'Track by Mode'!$J:$J,\"=\"&$A38,'Track by Mode'!$K:$K,\"=\"&$B38))","v":0},{"$f":"IF($X$2,SUMIFS('Track by Mode'!Z:Z,'Track by Mode'!$J:$J,\"=\"&$A38,'Track by Mode'!$K:$K,\"=\"&$B38,'Track by Mode'!$AI:$AI,\"=No\"),SUMIFS('Track by Mode'!Z:Z,'Track by Mode'!$J:$J,\"=\"&$A38,'Track by Mode'!$K:$K,\"=\"&$B38))","v":33.400000000000006},{"$f":"IF($X$2,SUMIFS('Track by Mode'!AC:AC,'Track by Mode'!$J:$J,\"=\"&$A38,'Track by Mode'!$K:$K,\"=\"&$B38,'Track by Mode'!$AI:$AI,\"=No\"),SUMIFS('Track by Mode'!AC:AC,'Track by Mode'!$J:$J,\"=\"&$A38,'Track by Mode'!$K:$K,\"=\"&$B38))","v":247},{"$f":"IF($X$2,SUMIFS('Track by Mode'!AE:AE,'Track by Mode'!$J:$J,\"=\"&$A38,'Track by Mode'!$K:$K,\"=\"&$B38,'Track by Mode'!$AI:$AI,\"=No\"),SUMIFS('Track by Mode'!AE:AE,'Track by Mode'!$J:$J,\"=\"&$A38,'Track by Mode'!$K:$K,\"=\"&$B38))","v":191},{"$f":"IF($X$2,SUMIFS('Track by Mode'!AG:AG,'Track by Mode'!$J:$J,\"=\"&$A38,'Track by Mode'!$K:$K,\"=\"&$B38,'Track by Mode'!$AI:$AI,\"=No\"),SUMIFS('Track by Mode'!AG:AG,'Track by Mode'!$J:$J,\"=\"&$A38,'Track by Mode'!$K:$K,\"=\"&$B38))","v":438},"-","-","-","-"]
["CB","DO","Commuter Bus - Directly Operated",null,null,{"$f":"IF($X$2,SUMIFS('Roadway by Mode'!L:L,'Roadway by Mode'!$J:$J,\"=\"&$A39,'Roadway by Mode'!$K:$K,\"=\"&$B39,'Roadway by Mode'!$V:$V,\"=No\"),SUMIFS('Roadway by Mode'!L:L,'Roadway by Mode'!$J:$J,\"=\"&$A39,'Roadway by Mode'!$K:$K,\"=\"&$B39))","v":2286},"-","-","-","-","-","-","-","-","-","-",{"$f":"IF($X$2,SUMIFS('Roadway by Mode'!N:N,'Roadway by Mode'!$J:$J,\"=\"&$A39,'Roadway by Mode'!$K:$K,\"=\"&$B39,'Roadway by Mode'!$V:$V,\"=No\"),SUMIFS('Roadway by Mode'!N:N,'Roadway by Mode'!$J:$J,\"=\"&$A39,'Roadway by Mode'!$K:$K,\"=\"&$B39))","v":20.200000000000003},{"$f":"IF($X$2,SUMIFS('Roadway by Mode'!P:P,'Roadway by Mode'!$J:$J,\"=\"&$A39,'Roadway by Mode'!$K:$K,\"=\"&$B39,'Roadway by Mode'!$V:$V,\"=No\"),SUMIFS('Roadway by Mode'!P:P,'Roadway by Mode'!$J:$J,\"=\"&$A39,'Roadway by Mode'!$K:$K,\"=\"&$B39))","v":313.39999999999998},{"$f":"IF($X$2,SUMIFS('Roadway by Mode'!R:R,'Roadway by Mode'!$J:$J,\"=\"&$A39,'Roadway by Mode'!$K:$K,\"=\"&$B39,'Roadway by Mode'!$V:$V,\"=No\"),SUMIFS('Roadway by Mode'!R:R,'Roadway by Mode'!$J:$J,\"=\"&$A39,'Roadway by Mode'!$K:$K,\"=\"&$B39))","v":209.20000000000007},{"$f":"IF($X$2,SUMIFS('Roadway by Mode'!T:T,'Roadway by Mode'!$J:$J,\"=\"&$A39,'Roadway by Mode'!$K:$K,\"=\"&$B39,'Roadway by Mode'!$V:$V,\"=No\"),SUMIFS('Roadway by Mode'!T:T,'Roadway by Mode'!$J:$J,\"=\"&$A39,'Roadway by Mode'!$K:$K,\"=\"&$B39))","v":542.79999999999984}]
["CB","PT","Commuter Bus - Purchased Transportation",null,null,{"$f":"IF($X$2,SUMIFS('Roadway by Mode'!L:L,'Roadway by Mode'!$J:$J,\"=\"&$A40,'Roadway by Mode'!$K:$K,\"=\"&$B40,'Roadway by Mode'!$V:$V,\"=No\"),SUMIFS('Roadway by Mode'!L:L,'Roadway by Mode'!$J:$J,\"=\"&$A40,'Roadway by Mode'!$K:$K,\"=\"&$B40))","v":1305},"-","-","-","-","-","-","-","-","-","-",{"$f":"IF($X$2,SUMIFS('Roadway by Mode'!N:N,'Roadway by Mode'!$J:$J,\"=\"&$A40,'Roadway by Mode'!$K:$K,\"=\"&$B40,'Roadway by Mode'!$V:$V,\"=No\"),SUMIFS('Roadway by Mode'!N:N,'Roadway by Mode'!$J:$J,\"=\"&$A40,'Roadway by Mode'!$K:$K,\"=\"&$B40))","v":35.5},{"$f":"IF($X$2,SUMIFS('Roadway by Mode'!P:P,'Roadway by Mode'!$J:$J,\"=\"&$A40,'Roadway by Mode'!$K:$K,\"=\"&$B40,'Roadway by Mode'!$V:$V,\"=No\"),SUMIFS('Roadway by Mode'!P:P,'Roadway by Mode'!$J:$J,\"=\"&$A40,'Roadway by Mode'!$K:$K,\"=\"&$B40))","v":350.8},{"$f":"IF($X$2,SUMIFS('Roadway by Mode'!R:R,'Roadway by Mode'!$J:$J,\"=\"&$A40,'Roadway by Mode'!$K:$K,\"=\"&$B40,'Roadway by Mode'!$V:$V,\"=No\"),SUMIFS('Roadway by Mode'!R:R,'Roadway by Mode'!$J:$J,\"=\"&$A40,'Roadway by Mode'!$K:$K,\"=\"&$B40))","v":377.09999999999997},{"$f":"IF($X$2,SUMIFS('Roadway by Mode'!T:T,'Roadway by Mode'!$J:$J,\"=\"&$A40,'Roadway by Mode'!$K:$K,\"=\"&$B40,'Roadway by Mode'!$V:$V,\"=No\"),SUMIFS('Roadway by Mode'!T:T,'Roadway by Mode'!$J:$J,\"=\"&$A40,'Roadway by Mode'!$K:$K,\"=\"&$B40))","v":763.4000000000002}]
["MB","DO","Bus - Directly Operated",null,null,{"$f":"IF($X$2,SUMIFS('Roadway by Mode'!L:L,'Roadway by Mode'!$J:$J,\"=\"&$A41,'Roadway by Mode'!$K:$K,\"=\"&$B41,'Roadway by Mode'!$V:$V,\"=No\"),SUMIFS('Roadway by Mode'!L:L,'Roadway by Mode'!$J:$J,\"=\"&$A41,'Roadway by Mode'!$K:$K,\"=\"&$B41))","v":38052},"-","-","-","-","-","-","-","-","-","-",{"$f":"IF($X$2,SUMIFS('Roadway by Mode'!N:N,'Roadway by Mode'!$J:$J,\"=\"&$A41,'Roadway by Mode'!$K:$K,\"=\"&$B41,'Roadway by Mode'!$V:$V,\"=No\"),SUMIFS('Roadway by Mode'!N:N,'Roadway by Mode'!$J:$J,\"=\"&$A41,'Roadway by Mode'!$K:$K,\"=\"&$B41))","v":248.79999999999987},{"$f":"IF($X$2,SUMIFS('Roadway by Mode'!P:P,'Roadway by Mode'!$J:$J,\"=\"&$A41,'Roadway by Mode'!$K:$K,\"=\"&$B41,'Roadway by Mode'!$V:$V,\"=No\"),SUMIFS('Roadway by Mode'!P:P,'Roadway by Mode'!$J:$J,\"=\"&$A41,'Roadway by Mode'!$K:$K,\"=\"&$B41))","v":629.59999999999968},{"$f":"IF($X$2,SUMIFS('Roadway by Mode'!R:R,'Roadway by Mode'!$J:$J,\"=\"&$A41,'Roadway by Mode'!$K:$K,\"=\"&$B41,'Roadway by Mode'!$V:$V,\"=No\"),SUMIFS('Roadway by Mode'!R:R,'Roadway by Mode'!$J:$J,\"=\"&$A41,'Roadway by Mode'!$K:$K,\"=\"&$B41))","v":629.00000000000011},{"$f":"IF($X$2,SUMIFS('Roadway by Mode'!T:T,'Roadway by Mode'!$J:$J,\"=\"&$A41,'Roadway by Mode'!$K:$K,\"=\"&$B41,'Roadway by Mode'!$V:$V,\"=No\"),SUMIFS('Roadway by Mode'!T:T,'Roadway by Mode'!$J:$J,\"=\"&$A41,'Roadway by Mode'!$K:$K,\"=\"&$B41))","v":1507.3999999999994}]
["MB","PT","Bus - Purchased Transportation",null,null,{"$f":"IF($X$2,SUMIFS('Roadway by Mode'!L:L,'Roadway by Mode'!$J:$J,\"=\"&$A42,'Roadway by Mode'!$K:$K,\"=\"&$B42,'Roadway by Mode'!$V:$V,\"=No\"),SUMIFS('Roadway by Mode'!L:L,'Roadway by Mode'!$J:$J,\"=\"&$A42,'Roadway by Mode'!$K:$K,\"=\"&$B42))","v":8502},"-","-","-","-","-","-","-","-","-","-",{"$f":"IF($X$2,SUMIFS('Roadway by Mode'!N:N,'Roadway by Mode'!$J:$J,\"=\"&$A42,'Roadway by Mode'!$K:$K,\"=\"&$B42,'Roadway by Mode'!$V:$V,\"=No\"),SUMIFS('Roadway by Mode'!N:N,'Roadway by Mode'!$J:$J,\"=\"&$A42,'Roadway by Mode'!$K:$K,\"=\"&$B42))","v":72.5},{"$f":"IF($X$2,SUMIFS('Roadway by Mode'!P:P,'Roadway by Mode'!$J:$J,\"=\"&$A42,'Roadway by Mode'!$K:$K,\"=\"&$B42,'Roadway by Mode'!$V:$V,\"=No\"),SUMIFS('Roadway by Mode'!P:P,'Roadway by Mode'!$J:$J,\"=\"&$A42,'Roadway by Mode'!$K:$K,\"=\"&$B42))","v":152.6},{"$f":"IF($X$2,SUMIFS('Roadway by Mode'!R:R,'Roadway by Mode'!$J:$J,\"=\"&$A42,'Roadway by Mode'!$K:$K,\"=\"&$B42,'Roadway by Mode'!$V:$V,\"=No\"),SUMIFS('Roadway by Mode'!R:R,'Roadway by Mode'!$J:$J,\"=\"&$A42,'Roadway by Mode'!$K:$K,\"=\"&$B42))","v":825.99999999999989},{"$f":"IF($X$2,SUMIFS('Roadway by Mode'!T:T,'Roadway by Mode'!$J:$J,\"=\"&$A42,'Roadway by Mode'!$K:$K,\"=\"&$B42,'Roadway by Mode'!$V:$V,\"=No\"),SUMIFS('Roadway by Mode'!T:T,'Roadway by Mode'!$J:$J,\"=\"&$A42,'Roadway by Mode'!$K:$K,\"=\"&$B42))","v":1051.0999999999999}]
["RB","DO","Bus Rapid Transit - Directly Operated",null,null,{"$f":"IF($X$2,SUMIFS('Roadway by Mode'!L:L,'Roadway by Mode'!$J:$J,\"=\"&$A43,'Roadway by Mode'!$K:$K,\"=\"&$B43,'Roadway by Mode'!$V:$V,\"=No\"),SUMIFS('Roadway by Mode'!L:L,'Roadway by Mode'!$J:$J,\"=\"&$A43,'Roadway by Mode'!$K:$K,\"=\"&$B43))","v":241},"-","-","-","-","-","-","-","-","-","-",{"$f":"IF($X$2,SUMIFS('Roadway by Mode'!N:N,'Roadway by Mode'!$J:$J,\"=\"&$A43,'Roadway by Mode'!$K:$K,\"=\"&$B43,'Roadway by Mode'!$V:$V,\"=No\"),SUMIFS('Roadway by Mode'!N:N,'Roadway by Mode'!$J:$J,\"=\"&$A43,'Roadway by Mode'!$K:$K,\"=\"&$B43))","v":154.20000000000002},{"$f":"IF($X$2,SUMIFS('Roadway by Mode'!P:P,'Roadway by Mode'!$J:$J,\"=\"&$A43,'Roadway by Mode'!$K:$K,\"=\"&$B43,'Roadway by Mode'!$V:$V,\"=No\"),SUMIFS('Roadway by Mode'!P:P,'Roadway by Mode'!$J:$J,\"=\"&$A43,'Roadway by Mode'!$K:$K,\"=\"&$B43))","v":0},{"$f":"IF($X$2,SUMIFS('Roadway by Mode'!R:R,'Roadway by Mode'!$J:$J,\"=\"&$A43,'Roadway by Mode'!$K:$K,\"=\"&$B43,'Roadway by Mode'!$V:$V,\"=No\"),SUMIFS('Roadway by Mode'!R:R,'Roadway by Mode'!$J:$J,\"=\"&$A43,'Roadway by Mode'!$K:$K,\"=\"&$B43))","v":16.5},{"$f":"IF($X$2,SUMIFS('Roadway by Mode'!T:T,'Roadway by Mode'!$J:$J,\"=\"&$A43,'Roadway by Mode'!$K:$K,\"=\"&$B43,'Roadway by Mode'!$V:$V,\"=No\"),SUMIFS('Roadway by Mode'!T:T,'Roadway by Mode'!$J:$J,\"=\"&$A43,'Roadway by Mode'!$K:$K,\"=\"&$B43))","v":170.7}]
["RB","PT","Bus Rapid Transit - Purchased Transportation",null,null,{"$f":"IF($X$2,SUMIFS('Roadway by Mode'!L:L,'Roadway by Mode'!$J:$J,\"=\"&$A44,'Roadway by Mode'!$K:$K,\"=\"&$B44,'Roadway by Mode'!$V:$V,\"=No\"),SUMIFS('Roadway by Mode'!L:L,'Roadway by Mode'!$J:$J,\"=\"&$A44,'Roadway by Mode'!$K:$K,\"=\"&$B44))","v":33},"-","-","-","-","-","-","-","-","-","-",{"$f":"IF($X$2,SUMIFS('Roadway by Mode'!N:N,'Roadway by Mode'!$J:$J,\"=\"&$A44,'Roadway by Mode'!$K:$K,\"=\"&$B44,'Roadway by Mode'!$V:$V,\"=No\"),SUMIFS('Roadway by Mode'!N:N,'Roadway by Mode'!$J:$J,\"=\"&$A44,'Roadway by Mode'!$K:$K,\"=\"&$B44))","v":41.6},{"$f":"IF($X$2,SUMIFS('Roadway by Mode'!P:P,'Roadway by Mode'!$J:$J,\"=\"&$A44,'Roadway by Mode'!$K:$K,\"=\"&$B44,'Roadway by Mode'!$V:$V,\"=No\"),SUMIFS('Roadway by Mode'!P:P,'Roadway by Mode'!$J:$J,\"=\"&$A44,'Roadway by Mode'!$K:$K,\"=\"&$B44))","v":0},{"$f":"IF($X$2,SUMIFS('Roadway by Mode'!R:R,'Roadway by Mode'!$J:$J,\"=\"&$A44,'Roadway by Mode'!$K:$K,\"=\"&$B44,'Roadway by Mode'!$V:$V,\"=No\"),SUMIFS('Roadway by Mode'!R:R,'Roadway by Mode'!$J:$J,\"=\"&$A44,'Roadway by Mode'!$K:$K,\"=\"&$B44))","v":0},{"$f":"IF($X$2,SUMIFS('Roadway by Mode'!T:T,'Roadway by Mode'!$J:$J,\"=\"&$A44,'Roadway by Mode'!$K:$K,\"=\"&$B44,'Roadway by Mode'!$V:$V,\"=No\"),SUMIFS('Roadway by Mode'!T:T,'Roadway by Mode'!$J:$J,\"=\"&$A44,'Roadway by Mode'!$K:$K,\"=\"&$B44))","v":41.6}]
["TB","DO","Trolleybus - Directly Operated",null,null,{"$f":"IF($X$2,SUMIFS('Roadway by Mode'!L:L,'Roadway by Mode'!$J:$J,\"=\"&$A45,'Roadway by Mode'!$K:$K,\"=\"&$B45,'Roadway by Mode'!$V:$V,\"=No\"),SUMIFS('Roadway by Mode'!L:L,'Roadway by Mode'!$J:$J,\"=\"&$A45,'Roadway by Mode'!$K:$K,\"=\"&$B45))","v":391},"-","-","-","-","-","-","-","-","-","-",{"$f":"IF($X$2,SUMIFS('Roadway by Mode'!N:N,'Roadway by Mode'!$J:$J,\"=\"&$A45,'Roadway by Mode'!$K:$K,\"=\"&$B45,'Roadway by Mode'!$V:$V,\"=No\"),SUMIFS('Roadway by Mode'!N:N,'Roadway by Mode'!$J:$J,\"=\"&$A45,'Roadway by Mode'!$K:$K,\"=\"&$B45))","v":437.09999999999997},{"$f":"IF($X$2,SUMIFS('Roadway by Mode'!P:P,'Roadway by Mode'!$J:$J,\"=\"&$A45,'Roadway by Mode'!$K:$K,\"=\"&$B45,'Roadway by Mode'!$V:$V,\"=No\"),SUMIFS('Roadway by Mode'!P:P,'Roadway by Mode'!$J:$J,\"=\"&$A45,'Roadway by Mode'!$K:$K,\"=\"&$B45))","v":0},{"$f":"IF($X$2,SUMIFS('Roadway by Mode'!R:R,'Roadway by Mode'!$J:$J,\"=\"&$A45,'Roadway by Mode'!$K:$K,\"=\"&$B45,'Roadway by Mode'!$V:$V,\"=No\"),SUMIFS('Roadway by Mode'!R:R,'Roadway by Mode'!$J:$J,\"=\"&$A45,'Roadway by Mode'!$K:$K,\"=\"&$B45))","v":0},{"$f":"IF($X$2,SUMIFS('Roadway by Mode'!T:T,'Roadway by Mode'!$J:$J,\"=\"&$A45,'Roadway by Mode'!$K:$K,\"=\"&$B45,'Roadway by Mode'!$V:$V,\"=No\"),SUMIFS('Roadway by Mode'!T:T,'Roadway by Mode'!$J:$J,\"=\"&$A45,'Roadway by Mode'!$K:$K,\"=\"&$B45))","v":437.09999999999997}]
[]
["By Agency Size (Vehicles)"]
[null,null,null,null,null,null,"Miles of Track",null,null,null,null,null,null,"Number of Crossings",null,null,"Miles of Roadway"]
[null,null,null,"enter bins below","click to graph","VOMS","At Grade: Restricted Right-of-Way\nTrack Miles","\n\nStreet Running\nTrack Miles","\n\nElevated on Structure\nTrack Miles","\n\nElevated on Fill\nTrack Miles","\n\n\nOpen Cut\nTrack Miles","\n\n\nSubway\nTrack Miles","Total Track Miles","At Grade: Restricted Right-of-Way\nCrossings","\n\nStreet Running\nCrossings","Total Crossings","\n\nPermanent Busway\nRoadway Miles","\n\nPermanent HOV\nRoadway Miles","\nPart-Time Busway or HOV\nRoadway Miles","Total Roadway Miles"]
["under",{"$f":"D50","v":10},null,10,{"$f":"IFERROR(IF(A50=\"between\",A50&\" \"&FIXED(B50,0,0)&\" \"&C50&\" \"&FIXED(D50,0,0),A50&\" \"&FIXED(B50,0,0)),\"invalid bin\")","v":"under 10"},{"$f":"IF($X$2,SUMIFS('Track by Mode'!L:L,'Track by Mode'!$I:$I,\"<\"&$D50,'Track by Mode'!$AI:$AI,\"=No\"),SUMIFS('Track by Mode'!L:L,'Track by Mode'!$I:$I,\"<\"&$D50))+IF($X$2,SUMIFS('Roadway by Mode'!L:L,'Roadway by Mode'!$I:$I,\"<\"&$D50,'Roadway by Mode'!$V:$V,\"=No\"),SUMIFS('Roadway by Mode'!L:L,'Roadway by Mode'!$I:$I,\"<\"&$D50))","v":95},{"$f":"IF($X$2,SUMIFS('Track by Mode'!N:N,'Track by Mode'!$I:$I,\"<\"&$D50,'Track by Mode'!$AI:$AI,\"=No\"),SUMIFS('Track by Mode'!N:N,'Track by Mode'!$I:$I,\"<\"&$D50))","v":0.1},{"$f":"IF($X$2,SUMIFS('Track by Mode'!P:P,'Track by Mode'!$I:$I,\"<\"&$D50,'Track by Mode'!$AI:$AI,\"=No\"),SUMIFS('Track by Mode'!P:P,'Track by Mode'!$I:$I,\"<\"&$D50))","v":7.1},{"$f":"IF($X$2,SUMIFS('Track by Mode'!R:R,'Track by Mode'!$I:$I,\"<\"&$D50,'Track by Mode'!$AI:$AI,\"=No\"),SUMIFS('Track by Mode'!R:R,'Track by Mode'!$I:$I,\"<\"&$D50))","v":1.8},{"$f":"IF($X$2,SUMIFS('Track by Mode'!T:T,'Track by Mode'!$I:$I,\"<\"&$D50,'Track by Mode'!$AI:$AI,\"=No\"),SUMIFS('Track by Mode'!T:T,'Track by Mode'!$I:$I,\"<\"&$D50))","v":0},{"$f":"IF($X$2,SUMIFS('Track by Mode'!V:V,'Track by Mode'!$I:$I,\"<\"&$D50,'Track by Mode'!$AI:$AI,\"=No\"),SUMIFS('Track by Mode'!V:V,'Track by Mode'!$I:$I,\"<\"&$D50))","v":0},{"$f":"IF($X$2,SUMIFS('Track by Mode'!X:X,'Track by Mode'!$I:$I,\"<\"&$D50,'Track by Mode'!$AI:$AI,\"=No\"),SUMIFS('Track by Mode'!X:X,'Track by Mode'!$I:$I,\"<\"&$D50))","v":0},{"$f":"IF($X$2,SUMIFS('Track by Mode'!Z:Z,'Track by Mode'!$I:$I,\"<\"&$D50,'Track by Mode'!$AI:$AI,\"=No\"),SUMIFS('Track by Mode'!Z:Z,'Track by Mode'!$I:$I,\"<\"&$D50))","v":9},{"$f":"IF($X$2,SUMIFS('Track by Mode'!AC:AC,'Track by Mode'!$I:$I,\"<\"&$D50,'Track by Mode'!$AI:$AI,\"=No\"),SUMIFS('Track by Mode'!AC:AC,'Track by Mode'!$I:$I,\"<\"&$D50))","v":0},{"$f":"IF($X$2,SUMIFS('Track by Mode'!AE:AE,'Track by Mode'!$I:$I,\"<\"&$D50,'Track by Mode'!$AI:$AI,\"=No\"),SUMIFS('Track by Mode'!AE:AE,'Track by Mode'!$I:$I,\"<\"&$D50))","v":88},{"$f":"IF($X$2,SUMIFS('Track by Mode'!AG:AG,'Track by Mode'!$I:$I,\"<\"&$D50,'Track by Mode'!$AI:$AI,\"=No\"),SUMIFS('Track by Mode'!AG:AG,'Track by Mode'!$I:$I,\"<\"&$D50))","v":88},{"$f":"IF($X$2,SUMIFS('Roadway by Mode'!N:N,'Roadway by Mode'!$I:$I,\"<\"&$D50,'Roadway by Mode'!$V:$V,\"=No\"),SUMIFS('Roadway by Mode'!N:N,'Roadway by Mode'!$I:$I,\"<\"&$D50))","v":0},{"$f":"IF($X$2,SUMIFS('Roadway by Mode'!P:P,'Roadway by Mode'!$I:$I,\"<\"&$D50,'Roadway by Mode'!$V:$V,\"=No\"),SUMIFS('Roadway by Mode'!P:P,'Roadway by Mode'!$I:$I,\"<\"&$D50))","v":0},{"$f":"IF($X$2,SUMIFS('Roadway by Mode'!R:R,'Roadway by Mode'!$I:$I,\"<\"&$D50,'Roadway by Mode'!$V:$V,\"=No\"),SUMIFS('Roadway by Mode'!R:R,'Roadway by Mode'!$I:$I,\"<\"&$D50))","v":0},{"$f":"IF($X$2,SUMIFS('Roadway by Mode'!T:T,'Roadway by Mode'!$I:$I,\"<\"&$D50,'Roadway by Mode'!$V:$V,\"=No\"),SUMIFS('Roadway by Mode'!T:T,'Roadway by Mode'!$I:$I,\"<\"&$D50))","v":0}]
[{"$f":"IF(D51<>\"\",\"between\",\"over\")","v":"between"},{"$f":"D50","v":10},{"$f":"IF(D51<>\"\",\"and\",\"\")","v":"and"},25,{"$f":"IFERROR(IF(A51=\"between\",A51&\" \"&FIXED(B51,0,0)&\" \"&C51&\" \"&FIXED(D51,0,0),A51&\" \"&FIXED(B51,0,0)),\"invalid bin\")","v":"between 10 and 25"},{"$f":"IF($X$2,IF($A51=\"between\",SUMIFS('Track by Mode'!L:L,'Track by Mode'!$I:$I,\">=\"&$B51,'Track by Mode'!$I:$I,\"<\"&$D51,'Track by Mode'!$AI:$AI,\"=No\"),SUMIFS('Track by Mode'!L:L,'Track by Mode'!$I:$I,\">=\"&$B51,'Track by Mode'!$AI:$AI,\"=No\")),IF($A51=\"between\",SUMIFS('Track by Mode'!L:L,'Track by Mode'!$I:$I,\">=\"&$B51,'Track by Mode'!$I:$I,\"<\"&$D51),SUMIFS('Track by Mode'!L:L,'Track by Mode'!$I:$I,\">=\"&$B51)))+IF($X$2,IF($A51=\"between\",SUMIFS('Roadway by Mode'!L:L,'Roadway by Mode'!$I:$I,\">=\"&$B51,'Roadway by Mode'!$I:$I,\"<\"&$D51,'Roadway by Mode'!$V:$V,\"=No\"),SUMIFS('Roadway by Mode'!L:L,'Roadway by Mode'!$I:$I,\">=\"&$B51,'Roadway by Mode'!$V:$V,\"=No\")),IF($A51=\"between\",SUMIFS('Roadway by Mode'!L:L,'Roadway by Mode'!$I:$I,\">=\"&$B51,'Roadway by Mode'!$I:$I,\"<\"&$D51),SUMIFS('Roadway by Mode'!L:L,'Roadway by Mode'!$I:$I,\">=\"&$B51)))","v":747},{"$f":"IF($X$2,IF($A51=\"between\",SUMIFS('Track by Mode'!N:N,'Track by Mode'!$I:$I,\">=\"&$B51,'Track by Mode'!$I:$I,\"<\"&$D51,'Track by Mode'!$AI:$AI,\"=No\"),SUMIFS('Track by Mode'!N:N,'Track by Mode'!$I:$I,\">=\"&$B51,'Track by Mode'!$AI:$AI,\"=No\")),IF($A51=\"between\",SUMIFS('Track by Mode'!N:N,'Track by Mode'!$I:$I,\">=\"&$B51,'Track by Mode'!$I:$I,\"<\"&$D51),SUMIFS('Track by Mode'!N:N,'Track by Mode'!$I:$I,\">=\"&$B51)))","v":142.6},{"$f":"IF($X$2,IF($A51=\"between\",SUMIFS('Track by Mode'!P:P,'Track by Mode'!$I:$I,\">=\"&$B51,'Track by Mode'!$I:$I,\"<\"&$D51,'Track by Mode'!$AI:$AI,\"=No\"),SUMIFS('Track by Mode'!P:P,'Track by Mode'!$I:$I,\">=\"&$B51,'Track by Mode'!$AI:$AI,\"=No\")),IF($A51=\"between\",SUMIFS('Track by Mode'!P:P,'Track by Mode'!$I:$I,\">=\"&$B51,'Track by Mode'!$I:$I,\"<\"&$D51),SUMIFS('Track by Mode'!P:P,'Track by Mode'!$I:$I,\">=\"&$B51)))","v":14.8},{"$f":"IF($X$2,IF($A51=\"between\",SUMIFS('Track by Mode'!R:R,'Track by Mode'!$I:$I,\">=\"&$B51,'Track by Mode'!$I:$I,\"<\"&$D51,'Track by Mode'!$AI:$AI,\"=No\"),SUMIFS('Track by Mode'!R:R,'Track by Mode'!$I:$I,\">=\"&$B51,'Track by Mode'!$AI:$AI,\"=No\")),IF($A51=\"between\",SUMIFS('Track by Mode'!R:R,'Track by Mode'!$I:$I,\">=\"&$B51,'Track by Mode'!$I:$I,\"<\"&$D51),SUMIFS('Track by Mode'!R:R,'Track by Mode'!$I:$I,\">=\"&$B51)))","v":2.9},{"$f":"IF($X$2,IF($A51=\"between\",SUMIFS('Track by Mode'!T:T,'Track by Mode'!$I:$I,\">=\"&$B51,'Track by Mode'!$I:$I,\"<\"&$D51,'Track by Mode'!$AI:$AI,\"=No\"),SUMIFS('Track by Mode'!T:T,'Track by Mode'!$I:$I,\">=\"&$B51,'Track by Mode'!$AI:$AI,\"=No\")),IF($A51=\"between\",SUMIFS('Track by Mode'!T:T,'Track by Mode'!$I:$I,\">=\"&$B51,'Track by Mode'!$I:$I,\"<\"&$D51),SUMIFS('Track by Mode'!T:T,'Track by Mode'!$I:$I,\">=\"&$B51)))","v":0},{"$f":"IF($X$2,IF($A51=\"between\",SUMIFS('Track by Mode'!V:V,'Track by Mode'!$I:$I,\">=\"&$B51,'Track by Mode'!$I:$I,\"<\"&$D51,'Track by Mode'!$AI:$AI,\"=No\"),SUMIFS('Track by Mode'!V:V,'Track by Mode'!$I:$I,\">=\"&$B51,'Track by Mode'!$AI:$AI,\"=No\")),IF($A51=\"between\",SUMIFS('Track by Mode'!V:V,'Track by Mode'!$I:$I,\">=\"&$B51,'Track by Mode'!$I:$I,\"<\"&$D51),SUMIFS('Track by Mode'!V:V,'Track by Mode'!$I:$I,\">=\"&$B51)))","v":0},{"$f":"IF($X$2,IF($A51=\"between\",SUMIFS('Track by Mode'!X:X,'Track by Mode'!$I:$I,\">=\"&$B51,'Track by Mode'!$I:$I,\"<\"&$D51,'Track by Mode'!$AI:$AI,\"=No\"),SUMIFS('Track by Mode'!X:X,'Track by Mode'!$I:$I,\">=\"&$B51,'Track by Mode'!$AI:$AI,\"=No\")),IF($A51=\"between\",SUMIFS('Track by Mode'!X:X,'Track by Mode'!$I:$I,\">=\"&$B51,'Track by Mode'!$I:$I,\"<\"&$D51),SUMIFS('Track by Mode'!X:X,'Track by Mode'!$I:$I,\">=\"&$B51)))","v":0},{"$f":"IF($X$2,IF($A51=\"between\",SUMIFS('Track by Mode'!Z:Z,'Track by Mode'!$I:$I,\">=\"&$B51,'Track by Mode'!$I:$I,\"<\"&$D51,'Track by Mode'!$AI:$AI,\"=No\"),SUMIFS('Track by Mode'!Z:Z,'Track by Mode'!$I:$I,\">=\"&$B51,'Track by Mode'!$AI:$AI,\"=No\")),IF($A51=\"between\",SUMIFS('Track by Mode'!Z:Z,'Track by Mode'!$I:$I,\">=\"&$B51,'Track by Mode'!$I:$I,\"<\"&$D51),SUMIFS('Track by Mode'!Z:Z,'Track by Mode'!$I:$I,\">=\"&$B51)))","v":160.30000000000001},{"$f":"IF($X$2,IF($A51=\"between\",SUMIFS('Track by Mode'!AC:AC,'Track by Mode'!$I:$I,\">=\"&$B51,'Track by Mode'!$I:$I,\"<\"&$D51,'Track by Mode'!$AI:$AI,\"=No\"),SUMIFS('Track by Mode'!AC:AC,'Track by Mode'!$I:$I,\">=\"&$B51,'Track by Mode'!$AI:$AI,\"=No\")),IF($A51=\"between\",SUMIFS('Track by Mode'!AC:AC,'Track by Mode'!$I:$I,\">=\"&$B51,'Track by Mode'!$I:$I,\"<\"&$D51),SUMIFS('Track by Mode'!AC:AC,'Track by Mode'!$I:$I,\">=\"&$B51)))","v":103},{"$f":"IF($X$2,IF($A51=\"between\",SUMIFS('Track by Mode'!AE:AE,'Track by Mode'!$I:$I,\">=\"&$B51,'Track by Mode'!$I:$I,\"<\"&$D51,'Track by Mode'!$AI:$AI,\"=No\"),SUMIFS('Track by Mode'!AE:AE,'Track by Mode'!$I:$I,\">=\"&$B51,'Track by Mode'!$AI:$AI,\"=No\")),IF($A51=\"between\",SUMIFS('Track by Mode'!AE:AE,'Track by Mode'!$I:$I,\">=\"&$B51,'Track by Mode'!$I:$I,\"<\"&$D51),SUMIFS('Track by Mode'!AE:AE,'Track by Mode'!$I:$I,\">=\"&$B51)))","v":191},{"$f":"IF($X$2,IF($A51=\"between\",SUMIFS('Track by Mode'!AG:AG,'Track by Mode'!$I:$I,\">=\"&$B51,'Track by Mode'!$I:$I,\"<\"&$D51,'Track by Mode'!$AI:$AI,\"=No\"),SUMIFS('Track by Mode'!AG:AG,'Track by Mode'!$I:$I,\">=\"&$B51,'Track by Mode'!$AI:$AI,\"=No\")),IF($A51=\"between\",SUMIFS('Track by Mode'!AG:AG,'Track by Mode'!$I:$I,\">=\"&$B51,'Track by Mode'!$I:$I,\"<\"&$D51),SUMIFS('Track by Mode'!AG:AG,'Track by Mode'!$I:$I,\">=\"&$B51)))","v":294},{"$f":"IF($O$2,IF($A51=\"between\",SUMIFS('Roadway by Mode'!N:N,'Roadway by Mode'!$I:$I,\">=\"&$B51,'Roadway by Mode'!$I:$I,\"<\"&$D51,'Roadway by Mode'!$V:$V,\"=No\"),SUMIFS('Roadway by Mode'!N:N,'Roadway by Mode'!$I:$I,\">=\"&$B51,'Roadway by Mode'!$V:$V,\"=No\")),IF($A51=\"between\",SUMIFS('Roadway by Mode'!N:N,'Roadway by Mode'!$I:$I,\">=\"&$B51,'Roadway by Mode'!$I:$I,\"<\"&$D51),SUMIFS('Roadway by Mode'!N:N,'Roadway by Mode'!$I:$I,\">=\"&$B51)))","v":32.4},{"$f":"IF($O$2,IF($A51=\"between\",SUMIFS('Roadway by Mode'!P:P,'Roadway by Mode'!$I:$I,\">=\"&$B51,'Roadway by Mode'!$I:$I,\"<\"&$D51,'Roadway by Mode'!$V:$V,\"=No\"),SUMIFS('Roadway by Mode'!P:P,'Roadway by Mode'!$I:$I,\">=\"&$B51,'Roadway by Mode'!$V:$V,\"=No\")),IF($A51=\"between\",SUMIFS('Roadway by Mode'!P:P,'Roadway by Mode'!$I:$I,\">=\"&$B51,'Roadway by Mode'!$I:$I,\"<\"&$D51),SUMIFS('Roadway by Mode'!P:P,'Roadway by Mode'!$I:$I,\">=\"&$B51)))","v":0},{"$f":"IF($O$2,IF($A51=\"between\",SUMIFS('Roadway by Mode'!R:R,'Roadway by Mode'!$I:$I,\">=\"&$B51,'Roadway by Mode'!$I:$I,\"<\"&$D51,'Roadway by Mode'!$V:$V,\"=No\"),SUMIFS('Roadway by Mode'!R:R,'Roadway by Mode'!$I:$I,\">=\"&$B51,'Roadway by Mode'!$V:$V,\"=No\")),IF($A51=\"between\",SUMIFS('Roadway by Mode'!R:R,'Roadway by Mode'!$I:$I,\">=\"&$B51,'Roadway by Mode'!$I:$I,\"<\"&$D51),SUMIFS('Roadway by Mode'!R:R,'Roadway by Mode'!$I:$I,\">=\"&$B51)))","v":0},{"$f":"IF($O$2,IF($A51=\"between\",SUMIFS('Roadway by Mode'!T:T,'Roadway by Mode'!$I:$I,\">=\"&$B51,'Roadway by Mode'!$I:$I,\"<\"&$D51,'Roadway by Mode'!$V:$V,\"=No\"),SUMIFS('Roadway by Mode'!T:T,'Roadway by Mode'!$I:$I,\">=\"&$B51,'Roadway by Mode'!$V:$V,\"=No\")),IF($A51=\"between\",SUMIFS('Roadway by Mode'!T:T,'Roadway by Mode'!$I:$I,\">=\"&$B51,'Roadway by Mode'!$I:$I,\"<\"&$D51),SUMIFS('Roadway by Mode'!T:T,'Roadway by Mode'!$I:$I,\">=\"&$B51)))","v":32.4}]
[{"$f":"IF(OR(A51=\"over\",A51=\"\"),\"\",IF(D52=\"\",\"over\",\"between\"))","v":"between"},{"$f":"IF(D51=\"\",\"\",D51)","v":25},{"$f":"IF(D52<>\"\",\"and\",\"\")","v":"and"},50,"between 25 and 50",{"$f":"IFERROR(IF($X$2,IF($A52=\"\",\"\",IF($A52=\"between\",SUMIFS('Track by Mode'!L:L,'Track by Mode'!$I:$I,\">=\"&$B52,'Track by Mode'!$I:$I,\"<\"&$D52,'Track by Mode'!$AI:$AI,\"=No\"),SUMIFS('Track by Mode'!L:L,'Track by Mode'!$I:$I,\">=\"&$B52,'Track by Mode'!$AI:$AI,\"=No\"))),IF($A52=\"\",\"\",IF($A52=\"between\",SUMIFS('Track by Mode'!L:L,'Track by Mode'!$I:$I,\">=\"&$B52,'Track by Mode'!$I:$I,\"<\"&$D52),SUMIFS('Track by Mode'!L:L,'Track by Mode'!$I:$I,\">=\"&$B52))))+IF($X$2,IF($A52=\"\",\"\",IF($A52=\"between\",SUMIFS('Roadway by Mode'!L:L,'Roadway by Mode'!$I:$I,\">=\"&$B52,'Roadway by Mode'!$I:$I,\"<\"&$D52,'Roadway by Mode'!$V:$V,\"=No\"),SUMIFS('Roadway by Mode'!L:L,'Roadway by Mode'!$I:$I,\">=\"&$B52,'Roadway by Mode'!$V:$V,\"=No\"))),IF($A52=\"\",\"\",IF($A52=\"between\",SUMIFS('Roadway by Mode'!L:L,'Roadway by Mode'!$I:$I,\">=\"&$B52,'Roadway by Mode'!$I:$I,\"<\"&$D52),SUMIFS('Roadway by Mode'!L:L,'Roadway by Mode'!$I:$I,\">=\"&$B52)))),\"\")","v":2930},{"$f":"IFERROR(IF($X$2,IF($A52=\"\",\"\",IF($A52=\"between\",SUMIFS('Track by Mode'!N:N,'Track by Mode'!$I:$I,\">=\"&$B52,'Track by Mode'!$I:$I,\"<\"&$D52,'Track by Mode'!$AI:$AI,\"=No\"),SUMIFS('Track by Mode'!N:N,'Track by Mode'!$I:$I,\">=\"&$B52,'Track by Mode'!$AI:$AI,\"=No\"))),IF($A52=\"\",\"\",IF($A52=\"between\",SUMIFS('Track by Mode'!N:N,'Track by Mode'!$I:$I,\">=\"&$B52,'Track by Mode'!$I:$I,\"<\"&$D52),SUMIFS('Track by Mode'!N:N,'Track by Mode'!$I:$I,\">=\"&$B52)))),\"\")","v":1022.8000000000001},{"$f":"IFERROR(IF($X$2,IF($A52=\"\",\"\",IF($A52=\"between\",SUMIFS('Track by Mode'!P:P,'Track by Mode'!$I:$I,\">=\"&$B52,'Track by Mode'!$I:$I,\"<\"&$D52,'Track by Mode'!$AI:$AI,\"=No\"),SUMIFS('Track by Mode'!P:P,'Track by Mode'!$I:$I,\">=\"&$B52,'Track by Mode'!$AI:$AI,\"=No\"))),IF($A52=\"\",\"\",IF($A52=\"between\",SUMIFS('Track by Mode'!P:P,'Track by Mode'!$I:$I,\">=\"&$B52,'Track by Mode'!$I:$I,\"<\"&$D52),SUMIFS('Track by Mode'!P:P,'Track by Mode'!$I:$I,\">=\"&$B52)))),\"\")","v":2.7},{"$f":"IFERROR(IF($X$2,IF($A52=\"\",\"\",IF($A52=\"between\",SUMIFS('Track by Mode'!R:R,'Track by Mode'!$I:$I,\">=\"&$B52,'Track by Mode'!$I:$I,\"<\"&$D52,'Track by Mode'!$AI:$AI,\"=No\"),SUMIFS('Track by Mode'!R:R,'Track by Mode'!$I:$I,\">=\"&$B52,'Track by Mode'!$AI:$AI,\"=No\"))),IF($A52=\"\",\"\",IF($A52=\"between\",SUMIFS('Track by Mode'!R:R,'Track by Mode'!$I:$I,\">=\"&$B52,'Track by Mode'!$I:$I,\"<\"&$D52),SUMIFS('Track by Mode'!R:R,'Track by Mode'!$I:$I,\">=\"&$B52)))),\"\")","v":28.599999999999994},{"$f":"IFERROR(IF($X$2,IF($A52=\"\",\"\",IF($A52=\"between\",SUMIFS('Track by Mode'!T:T,'Track by Mode'!$I:$I,\">=\"&$B52,'Track by Mode'!$I:$I,\"<\"&$D52,'Track by Mode'!$AI:$AI,\"=No\"),SUMIFS('Track by Mode'!T:T,'Track by Mode'!$I:$I,\">=\"&$B52,'Track by Mode'!$AI:$AI,\"=No\"))),IF($A52=\"\",\"\",IF($A52=\"between\",SUMIFS('Track by Mode'!T:T,'Track by Mode'!$I:$I,\">=\"&$B52,'Track by Mode'!$I:$I,\"<\"&$D52),SUMIFS('Track by Mode'!T:T,'Track by Mode'!$I:$I,\">=\"&$B52)))),\"\")","v":64.599999999999994},{"$f":"IFERROR(IF($X$2,IF($A52=\"\",\"\",IF($A52=\"between\",SUMIFS('Track by Mode'!V:V,'Track by Mode'!$I:$I,\">=\"&$B52,'Track by Mode'!$I:$I,\"<\"&$D52,'Track by Mode'!$AI:$AI,\"=No\"),SUMIFS('Track by Mode'!V:V,'Track by Mode'!$I:$I,\">=\"&$B52,'Track by Mode'!$AI:$AI,\"=No\"))),IF($A52=\"\",\"\",IF($A52=\"between\",SUMIFS('Track by Mode'!V:V,'Track by Mode'!$I:$I,\">=\"&$B52,'Track by Mode'!$I:$I,\"<\"&$D52),SUMIFS('Track by Mode'!V:V,'Track by Mode'!$I:$I,\">=\"&$B52)))),\"\")","v":27.6},{"$f":"IFERROR(IF($X$2,IF($A52=\"\",\"\",IF($A52=\"between\",SUMIFS('Track by Mode'!X:X,'Track by Mode'!$I:$I,\">=\"&$B52,'Track by Mode'!$I:$I,\"<\"&$D52,'Track by Mode'!$AI:$AI,\"=No\"),SUMIFS('Track by Mode'!X:X,'Track by Mode'!$I:$I,\">=\"&$B52,'Track by Mode'!$AI:$AI,\"=No\"))),IF($A52=\"\",\"\",IF($A52=\"between\",SUMIFS('Track by Mode'!X:X,'Track by Mode'!$I:$I,\">=\"&$B52,'Track by Mode'!$I:$I,\"<\"&$D52),SUMIFS('Track by Mode'!X:X,'Track by Mode'!$I:$I,\">=\"&$B52)))),\"\")","v":5.8},{"$f":"IFERROR(IF($X$2,IF($A52=\"\",\"\",IF($A52=\"between\",SUMIFS('Track by Mode'!Z:Z,'Track by Mode'!$I:$I,\">=\"&$B52,'Track by Mode'!$I:$I,\"<\"&$D52,'Track by Mode'!$AI:$AI,\"=No\"),SUMIFS('Track by Mode'!Z:Z,'Track by Mode'!$I:$I,\">=\"&$B52,'Track by Mode'!$AI:$AI,\"=No\"))),IF($A52=\"\",\"\",IF($A52=\"between\",SUMIFS('Track by Mode'!Z:Z,'Track by Mode'!$I:$I,\">=\"&$B52,'Track by Mode'!$I:$I,\"<\"&$D52),SUMIFS('Track by Mode'!Z:Z,'Track by Mode'!$I:$I,\">=\"&$B52)))),\"\")","v":1152.1000000000001},{"$f":"IFERROR(IF($X$2,IF($A52=\"\",\"\",IF($A52=\"between\",SUMIFS('Track by Mode'!AC:AC,'Track by Mode'!$I:$I,\">=\"&$B52,'Track by Mode'!$I:$I,\"<\"&$D52,'Track by Mode'!$AI:$AI,\"=No\"),SUMIFS('Track by Mode'!AC:AC,'Track by Mode'!$I:$I,\">=\"&$B52,'Track by Mode'!$AI:$AI,\"=No\"))),IF($A52=\"\",\"\",IF($A52=\"between\",SUMIFS('Track by Mode'!AC:AC,'Track by Mode'!$I:$I,\">=\"&$B52,'Track by Mode'!$I:$I,\"<\"&$D52),SUMIFS('Track by Mode'!AC:AC,'Track by Mode'!$I:$I,\">=\"&$B52)))),\"\")","v":504},{"$f":"IFERROR(IF($X$2,IF($A52=\"\",\"\",IF($A52=\"between\",SUMIFS('Track by Mode'!AE:AE,'Track by Mode'!$I:$I,\">=\"&$B52,'Track by Mode'!$I:$I,\"<\"&$D52,'Track by Mode'!$AI:$AI,\"=No\"),SUMIFS('Track by Mode'!AE:AE,'Track by Mode'!$I:$I,\">=\"&$B52,'Track by Mode'!$AI:$AI,\"=No\"))),IF($A52=\"\",\"\",IF($A52=\"between\",SUMIFS('Track by Mode'!AE:AE,'Track by Mode'!$I:$I,\">=\"&$B52,'Track by Mode'!$I:$I,\"<\"&$D52),SUMIFS('Track by Mode'!AE:AE,'Track by Mode'!$I:$I,\">=\"&$B52)))),\"\")","v":2},{"$f":"IFERROR(IF($X$2,IF($A52=\"\",\"\",IF($A52=\"between\",SUMIFS('Track by Mode'!AG:AG,'Track by Mode'!$I:$I,\">=\"&$B52,'Track by Mode'!$I:$I,\"<\"&$D52,'Track by Mode'!$AI:$AI,\"=No\"),SUMIFS('Track by Mode'!AG:AG,'Track by Mode'!$I:$I,\">=\"&$B52,'Track by Mode'!$AI:$AI,\"=No\"))),IF($A52=\"\",\"\",IF($A52=\"between\",SUMIFS('Track by Mode'!AG:AG,'Track by Mode'!$I:$I,\">=\"&$B52,'Track by Mode'!$I:$I,\"<\"&$D52),SUMIFS('Track by Mode'!AG:AG,'Track by Mode'!$I:$I,\">=\"&$B52)))),\"\")","v":506},{"$f":"IFERROR(IF($O$2,IF($A52=\"\",\"\",IF($A52=\"between\",SUMIFS('Roadway by Mode'!N:N,'Roadway by Mode'!$I:$I,\">=\"&$B52,'Roadway by Mode'!$I:$I,\"<\"&$D52,'Roadway by Mode'!$V:$V,\"=No\"),SUMIFS('Roadway by Mode'!N:N,'Roadway by Mode'!$I:$I,\">=\"&$B52,'Roadway by Mode'!$V:$V,\"=No\"))),IF($A52=\"\",\"\",IF($A52=\"between\",SUMIFS('Roadway by Mode'!N:N,'Roadway by Mode'!$I:$I,\">=\"&$B52,'Roadway by Mode'!$I:$I,\"<\"&$D52),SUMIFS('Roadway by Mode'!N:N,'Roadway by Mode'!$I:$I,\">=\"&$B52)))),\"\")","v":26.700000000000003},{"$f":"IFERROR(IF($O$2,IF($A52=\"\",\"\",IF($A52=\"between\",SUMIFS('Roadway by Mode'!P:P,'Roadway by Mode'!$I:$I,\">=\"&$B52,'Roadway by Mode'!$I:$I,\"<\"&$D52,'Roadway by Mode'!$V:$V,\"=No\"),SUMIFS('Roadway by Mode'!P:P,'Roadway by Mode'!$I:$I,\">=\"&$B52,'Roadway by Mode'!$V:$V,\"=No\"))),IF($A52=\"\",\"\",IF($A52=\"between\",SUMIFS('Roadway by Mode'!P:P,'Roadway by Mode'!$I:$I,\">=\"&$B52,'Roadway by Mode'!$I:$I,\"<\"&$D52),SUMIFS('Roadway by Mode'!P:P,'Roadway by Mode'!$I:$I,\">=\"&$B52)))),\"\")","v":28.5},{"$f":"IFERROR(IF($O$2,IF($A52=\"\",\"\",IF($A52=\"between\",SUMIFS('Roadway by Mode'!R:R,'Roadway by Mode'!$I:$I,\">=\"&$B52,'Roadway by Mode'!$I:$I,\"<\"&$D52,'Roadway by Mode'!$V:$V,\"=No\"),SUMIFS('Roadway by Mode'!R:R,'Roadway by Mode'!$I:$I,\">=\"&$B52,'Roadway by Mode'!$V:$V,\"=No\"))),IF($A52=\"\",\"\",IF($A52=\"between\",SUMIFS('Roadway by Mode'!R:R,'Roadway by Mode'!$I:$I,\">=\"&$B52,'Roadway by Mode'!$I:$I,\"<\"&$D52),SUMIFS('Roadway by Mode'!R:R,'Roadway by Mode'!$I:$I,\">=\"&$B52)))),\"\")","v":58.699999999999996},{"$f":"IFERROR(IF($O$2,IF($A52=\"\",\"\",IF($A52=\"between\",SUMIFS('Roadway by Mode'!T:T,'Roadway by Mode'!$I:$I,\">=\"&$B52,'Roadway by Mode'!$I:$I,\"<\"&$D52,'Roadway by Mode'!$V:$V,\"=No\"),SUMIFS('Roadway by Mode'!T:T,'Roadway by Mode'!$I:$I,\">=\"&$B52,'Roadway by Mode'!$V:$V,\"=No\"))),IF($A52=\"\",\"\",IF($A52=\"between\",SUMIFS('Roadway by Mode'!T:T,'Roadway by Mode'!$I:$I,\">=\"&$B52,'Roadway by Mode'!$I:$I,\"<\"&$D52),SUMIFS('Roadway by Mode'!T:T,'Roadway by Mode'!$I:$I,\">=\"&$B52)))),\"\")","v":113.9}]
["between",50,{"$f":"IF(D53<>\"\",\"and\",\"\")","v":"and"},100,"between 50 and 100",{"$f":"IFERROR(IF($X$2,IF($A53=\"\",\"\",IF($A53=\"between\",SUMIFS('Track by Mode'!L:L,'Track by Mode'!$I:$I,\">=\"&$B53,'Track by Mode'!$I:$I,\"<\"&$D53,'Track by Mode'!$AI:$AI,\"=No\"),SUMIFS('Track by Mode'!L:L,'Track by Mode'!$I:$I,\">=\"&$B53,'Track by Mode'!$AI:$AI,\"=No\"))),IF($A53=\"\",\"\",IF($A53=\"between\",SUMIFS('Track by Mode'!L:L,'Track by Mode'!$I:$I,\">=\"&$B53,'Track by Mode'!$I:$I,\"<\"&$D53),SUMIFS('Track by Mode'!L:L,'Track by Mode'!$I:$I,\">=\"&$B53))))+IF($X$2,IF($A53=\"\",\"\",IF($A53=\"between\",SUMIFS('Roadway by Mode'!L:L,'Roadway by Mode'!$I:$I,\">=\"&$B53,'Roadway by Mode'!$I:$I,\"<\"&$D53,'Roadway by Mode'!$V:$V,\"=No\"),SUMIFS('Roadway by Mode'!L:L,'Roadway by Mode'!$I:$I,\">=\"&$B53,'Roadway by Mode'!$V:$V,\"=No\"))),IF($A53=\"\",\"\",IF($A53=\"between\",SUMIFS('Roadway by Mode'!L:L,'Roadway by Mode'!$I:$I,\">=\"&$B53,'Roadway by Mode'!$I:$I,\"<\"&$D53),SUMIFS('Roadway by Mode'!L:L,'Roadway by Mode'!$I:$I,\">=\"&$B53)))),\"\")","v":5133},{"$f":"IFERROR(IF($X$2,IF($A53=\"\",\"\",IF($A53=\"between\",SUMIFS('Track by Mode'!N:N,'Track by Mode'!$I:$I,\">=\"&$B53,'Track by Mode'!$I:$I,\"<\"&$D53,'Track by Mode'!$AI:$AI,\"=No\"),SUMIFS('Track by Mode'!N:N,'Track by Mode'!$I:$I,\">=\"&$B53,'Track by Mode'!$AI:$AI,\"=No\"))),IF($A53=\"\",\"\",IF($A53=\"between\",SUMIFS('Track by Mode'!N:N,'Track by Mode'!$I:$I,\">=\"&$B53,'Track by Mode'!$I:$I,\"<\"&$D53),SUMIFS('Track by Mode'!N:N,'Track by Mode'!$I:$I,\">=\"&$B53)))),\"\")","v":611.20000000000005},{"$f":"IFERROR(IF($X$2,IF($A53=\"\",\"\",IF($A53=\"between\",SUMIFS('Track by Mode'!P:P,'Track by Mode'!$I:$I,\">=\"&$B53,'Track by Mode'!$I:$I,\"<\"&$D53,'Track by Mode'!$AI:$AI,\"=No\"),SUMIFS('Track by Mode'!P:P,'Track by Mode'!$I:$I,\">=\"&$B53,'Track by Mode'!$AI:$AI,\"=No\"))),IF($A53=\"\",\"\",IF($A53=\"between\",SUMIFS('Track by Mode'!P:P,'Track by Mode'!$I:$I,\">=\"&$B53,'Track by Mode'!$I:$I,\"<\"&$D53),SUMIFS('Track by Mode'!P:P,'Track by Mode'!$I:$I,\">=\"&$B53)))),\"\")","v":5},{"$f":"IFERROR(IF($X$2,IF($A53=\"\",\"\",IF($A53=\"between\",SUMIFS('Track by Mode'!R:R,'Track by Mode'!$I:$I,\">=\"&$B53,'Track by Mode'!$I:$I,\"<\"&$D53,'Track by Mode'!$AI:$AI,\"=No\"),SUMIFS('Track by Mode'!R:R,'Track by Mode'!$I:$I,\">=\"&$B53,'Track by Mode'!$AI:$AI,\"=No\"))),IF($A53=\"\",\"\",IF($A53=\"between\",SUMIFS('Track by Mode'!R:R,'Track by Mode'!$I:$I,\">=\"&$B53,'Track by Mode'!$I:$I,\"<\"&$D53),SUMIFS('Track by Mode'!R:R,'Track by Mode'!$I:$I,\">=\"&$B53)))),\"\")","v":25.299999999999997},{"$f":"IFERROR(IF($X$2,IF($A53=\"\",\"\",IF($A53=\"between\",SUMIFS('Track by Mode'!T:T,'Track by Mode'!$I:$I,\">=\"&$B53,'Track by Mode'!$I:$I,\"<\"&$D53,'Track by Mode'!$AI:$AI,\"=No\"),SUMIFS('Track by Mode'!T:T,'Track by Mode'!$I:$I,\">=\"&$B53,'Track by Mode'!$AI:$AI,\"=No\"))),IF($A53=\"\",\"\",IF($A53=\"between\",SUMIFS('Track by Mode'!T:T,'Track by Mode'!$I:$I,\">=\"&$B53,'Track by Mode'!$I:$I,\"<\"&$D53),SUMIFS('Track by Mode'!T:T,'Track by Mode'!$I:$I,\">=\"&$B53)))),\"\")","v":53.5},{"$f":"IFERROR(IF($X$2,IF($A53=\"\",\"\",IF($A53=\"between\",SUMIFS('Track by Mode'!V:V,'Track by Mode'!$I:$I,\">=\"&$B53,'Track by Mode'!$I:$I,\"<\"&$D53,'Track by Mode'!$AI:$AI,\"=No\"),SUMIFS('Track by Mode'!V:V,'Track by Mode'!$I:$I,\">=\"&$B53,'Track by Mode'!$AI:$AI,\"=No\"))),IF($A53=\"\",\"\",IF($A53=\"between\",SUMIFS('Track by Mode'!V:V,'Track by Mode'!$I:$I,\">=\"&$B53,'Track by Mode'!$I:$I,\"<\"&$D53),SUMIFS('Track by Mode'!V:V,'Track by Mode'!$I:$I,\">=\"&$B53)))),\"\")","v":3.9},{"$f":"IFERROR(IF($X$2,IF($A53=\"\",\"\",IF($A53=\"between\",SUMIFS('Track by Mode'!X:X,'Track by Mode'!$I:$I,\">=\"&$B53,'Track by Mode'!$I:$I,\"<\"&$D53,'Track by Mode'!$AI:$AI,\"=No\"),SUMIFS('Track by Mode'!X:X,'Track by Mode'!$I:$I,\">=\"&$B53,'Track by Mode'!$AI:$AI,\"=No\"))),IF($A53=\"\",\"\",IF($A53=\"between\",SUMIFS('Track by Mode'!X:X,'Track by Mode'!$I:$I,\">=\"&$B53,'Track by Mode'!$I:$I,\"<\"&$D53),SUMIFS('Track by Mode'!X:X,'Track by Mode'!$I:$I,\">=\"&$B53)))),\"\")","v":8.4},{"$f":"IFERROR(IF($X$2,IF($A53=\"\",\"\",IF($A53=\"between\",SUMIFS('Track by Mode'!Z:Z,'Track by Mode'!$I:$I,\">=\"&$B53,'Track by Mode'!$I:$I,\"<\"&$D53,'Track by Mode'!$AI:$AI,\"=No\"),SUMIFS('Track by Mode'!Z:Z,'Track by Mode'!$I:$I,\">=\"&$B53,'Track by Mode'!$AI:$AI,\"=No\"))),IF($A53=\"\",\"\",IF($A53=\"between\",SUMIFS('Track by Mode'!Z:Z,'Track by Mode'!$I:$I,\">=\"&$B53,'Track by Mode'!$I:$I,\"<\"&$D53),SUMIFS('Track by Mode'!Z:Z,'Track by Mode'!$I:$I,\">=\"&$B53)))),\"\")","v":707.3},{"$f":"IFERROR(IF($X$2,IF($A53=\"\",\"\",IF($A53=\"between\",SUMIFS('Track by Mode'!AC:AC,'Track by Mode'!$I:$I,\">=\"&$B53,'Track by Mode'!$I:$I,\"<\"&$D53,'Track by Mode'!$AI:$AI,\"=No\"),SUMIFS('Track by Mode'!AC:AC,'Track by Mode'!$I:$I,\">=\"&$B53,'Track by Mode'!$AI:$AI,\"=No\"))),IF($A53=\"\",\"\",IF($A53=\"between\",SUMIFS('Track by Mode'!AC:AC,'Track by Mode'!$I:$I,\">=\"&$B53,'Track by Mode'!$I:$I,\"<\"&$D53),SUMIFS('Track by Mode'!AC:AC,'Track by Mode'!$I:$I,\">=\"&$B53)))),\"\")","v":342},{"$f":"IFERROR(IF($X$2,IF($A53=\"\",\"\",IF($A53=\"between\",SUMIFS('Track by Mode'!AE:AE,'Track by Mode'!$I:$I,\">=\"&$B53,'Track by Mode'!$I:$I,\"<\"&$D53,'Track by Mode'!$AI:$AI,\"=No\"),SUMIFS('Track by Mode'!AE:AE,'Track by Mode'!$I:$I,\">=\"&$B53,'Track by Mode'!$AI:$AI,\"=No\"))),IF($A53=\"\",\"\",IF($A53=\"between\",SUMIFS('Track by Mode'!AE:AE,'Track by Mode'!$I:$I,\">=\"&$B53,'Track by Mode'!$I:$I,\"<\"&$D53),SUMIFS('Track by Mode'!AE:AE,'Track by Mode'!$I:$I,\">=\"&$B53)))),\"\")","v":56},{"$f":"IFERROR(IF($X$2,IF($A53=\"\",\"\",IF($A53=\"between\",SUMIFS('Track by Mode'!AG:AG,'Track by Mode'!$I:$I,\">=\"&$B53,'Track by Mode'!$I:$I,\"<\"&$D53,'Track by Mode'!$AI:$AI,\"=No\"),SUMIFS('Track by Mode'!AG:AG,'Track by Mode'!$I:$I,\">=\"&$B53,'Track by Mode'!$AI:$AI,\"=No\"))),IF($A53=\"\",\"\",IF($A53=\"between\",SUMIFS('Track by Mode'!AG:AG,'Track by Mode'!$I:$I,\">=\"&$B53,'Track by Mode'!$I:$I,\"<\"&$D53),SUMIFS('Track by Mode'!AG:AG,'Track by Mode'!$I:$I,\">=\"&$B53)))),\"\")","v":398},{"$f":"IFERROR(IF($O$2,IF($A53=\"\",\"\",IF($A53=\"between\",SUMIFS('Roadway by Mode'!N:N,'Roadway by Mode'!$I:$I,\">=\"&$B53,'Roadway by Mode'!$I:$I,\"<\"&$D53,'Roadway by Mode'!$V:$V,\"=No\"),SUMIFS('Roadway by Mode'!N:N,'Roadway by Mode'!$I:$I,\">=\"&$B53,'Roadway by Mode'!$V:$V,\"=No\"))),IF($A53=\"\",\"\",IF($A53=\"between\",SUMIFS('Roadway by Mode'!N:N,'Roadway by Mode'!$I:$I,\">=\"&$B53,'Roadway by Mode'!$I:$I,\"<\"&$D53),SUMIFS('Roadway by Mode'!N:N,'Roadway by Mode'!$I:$I,\">=\"&$B53)))),\"\")","v":23.299999999999997},{"$f":"IFERROR(IF($O$2,IF($A53=\"\",\"\",IF($A53=\"between\",SUMIFS('Roadway by Mode'!P:P,'Roadway by Mode'!$I:$I,\">=\"&$B53,'Roadway by Mode'!$I:$I,\"<\"&$D53,'Roadway by Mode'!$V:$V,\"=No\"),SUMIFS('Roadway by Mode'!P:P,'Roadway by Mode'!$I:$I,\">=\"&$B53,'Roadway by Mode'!$V:$V,\"=No\"))),IF($A53=\"\",\"\",IF($A53=\"between\",SUMIFS('Roadway by Mode'!P:P,'Roadway by Mode'!$I:$I,\">=\"&$B53,'Roadway by Mode'!$I:$I,\"<\"&$D53),SUMIFS('Roadway by Mode'!P:P,'Roadway by Mode'!$I:$I,\">=\"&$B53)))),\"\")","v":66.900000000000006},{"$f":"IFERROR(IF($O$2,IF($A53=\"\",\"\",IF($A53=\"between\",SUMIFS('Roadway by Mode'!R:R,'Roadway by Mode'!$I:$I,\">=\"&$B53,'Roadway by Mode'!$I:$I,\"<\"&$D53,'Roadway by Mode'!$V:$V,\"=No\"),SUMIFS('Roadway by Mode'!R:R,'Roadway by Mode'!$I:$I,\">=\"&$B53,'Roadway by Mode'!$V:$V,\"=No\"))),IF($A53=\"\",\"\",IF($A53=\"between\",SUMIFS('Roadway by Mode'!R:R,'Roadway by Mode'!$I:$I,\">=\"&$B53,'Roadway by Mode'!$I:$I,\"<\"&$D53),SUMIFS('Roadway by Mode'!R:R,'Roadway by Mode'!$I:$I,\">=\"&$B53)))),\"\")","v":165.50000000000003},{"$f":"IFERROR(IF($O$2,IF($A53=\"\",\"\",IF($A53=\"between\",SUMIFS('Roadway by Mode'!T:T,'Roadway by Mode'!$I:$I,\">=\"&$B53,'Roadway by Mode'!$I:$I,\"<\"&$D53,'Roadway by Mode'!$V:$V,\"=No\"),SUMIFS('Roadway by Mode'!T:T,'Roadway by Mode'!$I:$I,\">=\"&$B53,'Roadway by Mode'!$V:$V,\"=No\"))),IF($A53=\"\",\"\",IF($A53=\"between\",SUMIFS('Roadway by Mode'!T:T,'Roadway by Mode'!$I:$I,\">=\"&$B53,'Roadway by Mode'!$I:$I,\"<\"&$D53),SUMIFS('Roadway by Mode'!T:T,'Roadway by Mode'!$I:$I,\">=\"&$B53)))),\"\")","v":255.7}]
["between",100,"and",250,"between 100 and 250",{"$f":"IFERROR(IF($X$2,IF($A54=\"\",\"\",IF($A54=\"between\",SUMIFS('Track by Mode'!L:L,'Track by Mode'!$I:$I,\">=\"&$B54,'Track by Mode'!$I:$I,\"<\"&$D54,'Track by Mode'!$AI:$AI,\"=No\"),SUMIFS('Track by Mode'!L:L,'Track by Mode'!$I:$I,\">=\"&$B54,'Track by Mode'!$AI:$AI,\"=No\"))),IF($A54=\"\",\"\",IF($A54=\"between\",SUMIFS('Track by Mode'!L:L,'Track by Mode'!$I:$I,\">=\"&$B54,'Track by Mode'!$I:$I,\"<\"&$D54),SUMIFS('Track by Mode'!L:L,'Track by Mode'!$I:$I,\">=\"&$B54))))+IF($X$2,IF($A54=\"\",\"\",IF($A54=\"between\",SUMIFS('Roadway by Mode'!L:L,'Roadway by Mode'!$I:$I,\">=\"&$B54,'Roadway by Mode'!$I:$I,\"<\"&$D54,'Roadway by Mode'!$V:$V,\"=No\"),SUMIFS('Roadway by Mode'!L:L,'Roadway by Mode'!$I:$I,\">=\"&$B54,'Roadway by Mode'!$V:$V,\"=No\"))),IF($A54=\"\",\"\",IF($A54=\"between\",SUMIFS('Roadway by Mode'!L:L,'Roadway by Mode'!$I:$I,\">=\"&$B54,'Roadway by Mode'!$I:$I,\"<\"&$D54),SUMIFS('Roadway by Mode'!L:L,'Roadway by Mode'!$I:$I,\">=\"&$B54)))),\"\")","v":7341},{"$f":"IFERROR(IF($X$2,IF($A54=\"\",\"\",IF($A54=\"between\",SUMIFS('Track by Mode'!N:N,'Track by Mode'!$I:$I,\">=\"&$B54,'Track by Mode'!$I:$I,\"<\"&$D54,'Track by Mode'!$AI:$AI,\"=No\"),SUMIFS('Track by Mode'!N:N,'Track by Mode'!$I:$I,\">=\"&$B54,'Track by Mode'!$AI:$AI,\"=No\"))),IF($A54=\"\",\"\",IF($A54=\"between\",SUMIFS('Track by Mode'!N:N,'Track by Mode'!$I:$I,\">=\"&$B54,'Track by Mode'!$I:$I,\"<\"&$D54),SUMIFS('Track by Mode'!N:N,'Track by Mode'!$I:$I,\">=\"&$B54)))),\"\")","v":998.00000000000011},{"$f":"IFERROR(IF($X$2,IF($A54=\"\",\"\",IF($A54=\"between\",SUMIFS('Track by Mode'!P:P,'Track by Mode'!$I:$I,\">=\"&$B54,'Track by Mode'!$I:$I,\"<\"&$D54,'Track by Mode'!$AI:$AI,\"=No\"),SUMIFS('Track by Mode'!P:P,'Track by Mode'!$I:$I,\">=\"&$B54,'Track by Mode'!$AI:$AI,\"=No\"))),IF($A54=\"\",\"\",IF($A54=\"between\",SUMIFS('Track by Mode'!P:P,'Track by Mode'!$I:$I,\">=\"&$B54,'Track by Mode'!$I:$I,\"<\"&$D54),SUMIFS('Track by Mode'!P:P,'Track by Mode'!$I:$I,\">=\"&$B54)))),\"\")","v":14.9},{"$f":"IFERROR(IF($X$2,IF($A54=\"\",\"\",IF($A54=\"between\",SUMIFS('Track by Mode'!R:R,'Track by Mode'!$I:$I,\">=\"&$B54,'Track by Mode'!$I:$I,\"<\"&$D54,'Track by Mode'!$AI:$AI,\"=No\"),SUMIFS('Track by Mode'!R:R,'Track by Mode'!$I:$I,\">=\"&$B54,'Track by Mode'!$AI:$AI,\"=No\"))),IF($A54=\"\",\"\",IF($A54=\"between\",SUMIFS('Track by Mode'!R:R,'Track by Mode'!$I:$I,\">=\"&$B54,'Track by Mode'!$I:$I,\"<\"&$D54),SUMIFS('Track by Mode'!R:R,'Track by Mode'!$I:$I,\">=\"&$B54)))),\"\")","v":17.100000000000001},{"$f":"IFERROR(IF($X$2,IF($A54=\"\",\"\",IF($A54=\"between\",SUMIFS('Track by Mode'!T:T,'Track by Mode'!$I:$I,\">=\"&$B54,'Track by Mode'!$I:$I,\"<\"&$D54,'Track by Mode'!$AI:$AI,\"=No\"),SUMIFS('Track by Mode'!T:T,'Track by Mode'!$I:$I,\">=\"&$B54,'Track by Mode'!$AI:$AI,\"=No\"))),IF($A54=\"\",\"\",IF($A54=\"between\",SUMIFS('Track by Mode'!T:T,'Track by Mode'!$I:$I,\">=\"&$B54,'Track by Mode'!$I:$I,\"<\"&$D54),SUMIFS('Track by Mode'!T:T,'Track by Mode'!$I:$I,\">=\"&$B54)))),\"\")","v":6.5},{"$f":"IFERROR(IF($X$2,IF($A54=\"\",\"\",IF($A54=\"between\",SUMIFS('Track by Mode'!V:V,'Track by Mode'!$I:$I,\">=\"&$B54,'Track by Mode'!$I:$I,\"<\"&$D54,'Track by Mode'!$AI:$AI,\"=No\"),SUMIFS('Track by Mode'!V:V,'Track by Mode'!$I:$I,\">=\"&$B54,'Track by Mode'!$AI:$AI,\"=No\"))),IF($A54=\"\",\"\",IF($A54=\"between\",SUMIFS('Track by Mode'!V:V,'Track by Mode'!$I:$I,\">=\"&$B54,'Track by Mode'!$I:$I,\"<\"&$D54),SUMIFS('Track by Mode'!V:V,'Track by Mode'!$I:$I,\">=\"&$B54)))),\"\")","v":2.6},{"$f":"IFERROR(IF($X$2,IF($A54=\"\",\"\",IF($A54=\"between\",SUMIFS('Track by Mode'!X:X,'Track by Mode'!$I:$I,\">=\"&$B54,'Track by Mode'!$I:$I,\"<\"&$D54,'Track by Mode'!$AI:$AI,\"=No\"),SUMIFS('Track by Mode'!X:X,'Track by Mode'!$I:$I,\">=\"&$B54,'Track by Mode'!$AI:$AI,\"=No\"))),IF($A54=\"\",\"\",IF($A54=\"between\",SUMIFS('Track by Mode'!X:X,'Track by Mode'!$I:$I,\">=\"&$B54,'Track by Mode'!$I:$I,\"<\"&$D54),SUMIFS('Track by Mode'!X:X,'Track by Mode'!$I:$I,\">=\"&$B54)))),\"\")","v":0},{"$f":"IFERROR(IF($X$2,IF($A54=\"\",\"\",IF($A54=\"between\",SUMIFS('Track by Mode'!Z:Z,'Track by Mode'!$I:$I,\">=\"&$B54,'Track by Mode'!$I:$I,\"<\"&$D54,'Track by Mode'!$AI:$AI,\"=No\"),SUMIFS('Track by Mode'!Z:Z,'Track by Mode'!$I:$I,\">=\"&$B54,'Track by Mode'!$AI:$AI,\"=No\"))),IF($A54=\"\",\"\",IF($A54=\"between\",SUMIFS('Track by Mode'!Z:Z,'Track by Mode'!$I:$I,\">=\"&$B54,'Track by Mode'!$I:$I,\"<\"&$D54),SUMIFS('Track by Mode'!Z:Z,'Track by Mode'!$I:$I,\">=\"&$B54)))),\"\")","v":1039.1000000000001},{"$f":"IFERROR(IF($X$2,IF($A54=\"\",\"\",IF($A54=\"between\",SUMIFS('Track by Mode'!AC:AC,'Track by Mode'!$I:$I,\">=\"&$B54,'Track by Mode'!$I:$I,\"<\"&$D54,'Track by Mode'!$AI:$AI,\"=No\"),SUMIFS('Track by Mode'!AC:AC,'Track by Mode'!$I:$I,\">=\"&$B54,'Track by Mode'!$AI:$AI,\"=No\"))),IF($A54=\"\",\"\",IF($A54=\"between\",SUMIFS('Track by Mode'!AC:AC,'Track by Mode'!$I:$I,\">=\"&$B54,'Track by Mode'!$I:$I,\"<\"&$D54),SUMIFS('Track by Mode'!AC:AC,'Track by Mode'!$I:$I,\">=\"&$B54)))),\"\")","v":884},{"$f":"IFERROR(IF($X$2,IF($A54=\"\",\"\",IF($A54=\"between\",SUMIFS('Track by Mode'!AE:AE,'Track by Mode'!$I:$I,\">=\"&$B54,'Track by Mode'!$I:$I,\"<\"&$D54,'Track by Mode'!$AI:$AI,\"=No\"),SUMIFS('Track by Mode'!AE:AE,'Track by Mode'!$I:$I,\">=\"&$B54,'Track by Mode'!$AI:$AI,\"=No\"))),IF($A54=\"\",\"\",IF($A54=\"between\",SUMIFS('Track by Mode'!AE:AE,'Track by Mode'!$I:$I,\">=\"&$B54,'Track by Mode'!$I:$I,\"<\"&$D54),SUMIFS('Track by Mode'!AE:AE,'Track by Mode'!$I:$I,\">=\"&$B54)))),\"\")","v":74},{"$f":"IFERROR(IF($X$2,IF($A54=\"\",\"\",IF($A54=\"between\",SUMIFS('Track by Mode'!AG:AG,'Track by Mode'!$I:$I,\">=\"&$B54,'Track by Mode'!$I:$I,\"<\"&$D54,'Track by Mode'!$AI:$AI,\"=No\"),SUMIFS('Track by Mode'!AG:AG,'Track by Mode'!$I:$I,\">=\"&$B54,'Track by Mode'!$AI:$AI,\"=No\"))),IF($A54=\"\",\"\",IF($A54=\"between\",SUMIFS('Track by Mode'!AG:AG,'Track by Mode'!$I:$I,\">=\"&$B54,'Track by Mode'!$I:$I,\"<\"&$D54),SUMIFS('Track by Mode'!AG:AG,'Track by Mode'!$I:$I,\">=\"&$B54)))),\"\")","v":958},{"$f":"IFERROR(IF($O$2,IF($A54=\"\",\"\",IF($A54=\"between\",SUMIFS('Roadway by Mode'!N:N,'Roadway by Mode'!$I:$I,\">=\"&$B54,'Roadway by Mode'!$I:$I,\"<\"&$D54,'Roadway by Mode'!$V:$V,\"=No\"),SUMIFS('Roadway by Mode'!N:N,'Roadway by Mode'!$I:$I,\">=\"&$B54,'Roadway by Mode'!$V:$V,\"=No\"))),IF($A54=\"\",\"\",IF($A54=\"between\",SUMIFS('Roadway by Mode'!N:N,'Roadway by Mode'!$I:$I,\">=\"&$B54,'Roadway by Mode'!$I:$I,\"<\"&$D54),SUMIFS('Roadway by Mode'!N:N,'Roadway by Mode'!$I:$I,\">=\"&$B54)))),\"\")","v":213.2},{"$f":"IFERROR(IF($O$2,IF($A54=\"\",\"\",IF($A54=\"between\",SUMIFS('Roadway by Mode'!P:P,'Roadway by Mode'!$I:$I,\">=\"&$B54,'Roadway by Mode'!$I:$I,\"<\"&$D54,'Roadway by Mode'!$V:$V,\"=No\"),SUMIFS('Roadway by Mode'!P:P,'Roadway by Mode'!$I:$I,\">=\"&$B54,'Roadway by Mode'!$V:$V,\"=No\"))),IF($A54=\"\",\"\",IF($A54=\"between\",SUMIFS('Roadway by Mode'!P:P,'Roadway by Mode'!$I:$I,\">=\"&$B54,'Roadway by Mode'!$I:$I,\"<\"&$D54),SUMIFS('Roadway by Mode'!P:P,'Roadway by Mode'!$I:$I,\">=\"&$B54)))),\"\")","v":196.5},{"$f":"IFERROR(IF($O$2,IF($A54=\"\",\"\",IF($A54=\"between\",SUMIFS('Roadway by Mode'!R:R,'Roadway by Mode'!$I:$I,\">=\"&$B54,'Roadway by Mode'!$I:$I,\"<\"&$D54,'Roadway by Mode'!$V:$V,\"=No\"),SUMIFS('Roadway by Mode'!R:R,'Roadway by Mode'!$I:$I,\">=\"&$B54,'Roadway by Mode'!$V:$V,\"=No\"))),IF($A54=\"\",\"\",IF($A54=\"between\",SUMIFS('Roadway by Mode'!R:R,'Roadway by Mode'!$I:$I,\">=\"&$B54,'Roadway by Mode'!$I:$I,\"<\"&$D54),SUMIFS('Roadway by Mode'!R:R,'Roadway by Mode'!$I:$I,\">=\"&$B54)))),\"\")","v":221},{"$f":"IFERROR(IF($O$2,IF($A54=\"\",\"\",IF($A54=\"between\",SUMIFS('Roadway by Mode'!T:T,'Roadway by Mode'!$I:$I,\">=\"&$B54,'Roadway by Mode'!$I:$I,\"<\"&$D54,'Roadway by Mode'!$V:$V,\"=No\"),SUMIFS('Roadway by Mode'!T:T,'Roadway by Mode'!$I:$I,\">=\"&$B54,'Roadway by Mode'!$V:$V,\"=No\"))),IF($A54=\"\",\"\",IF($A54=\"between\",SUMIFS('Roadway by Mode'!T:T,'Roadway by Mode'!$I:$I,\">=\"&$B54,'Roadway by Mode'!$I:$I,\"<\"&$D54),SUMIFS('Roadway by Mode'!T:T,'Roadway by Mode'!$I:$I,\">=\"&$B54)))),\"\")","v":630.70000000000016}]
["between",250,"and",500,"between 250 and 500",{"$f":"IFERROR(IF($X$2,IF($A55=\"\",\"\",IF($A55=\"between\",SUMIFS('Track by Mode'!L:L,'Track by Mode'!$I:$I,\">=\"&$B55,'Track by Mode'!$I:$I,\"<\"&$D55,'Track by Mode'!$AI:$AI,\"=No\"),SUMIFS('Track by Mode'!L:L,'Track by Mode'!$I:$I,\">=\"&$B55,'Track by Mode'!$AI:$AI,\"=No\"))),IF($A55=\"\",\"\",IF($A55=\"between\",SUMIFS('Track by Mode'!L:L,'Track by Mode'!$I:$I,\">=\"&$B55,'Track by Mode'!$I:$I,\"<\"&$D55),SUMIFS('Track by Mode'!L:L,'Track by Mode'!$I:$I,\">=\"&$B55))))+IF($X$2,IF($A55=\"\",\"\",IF($A55=\"between\",SUMIFS('Roadway by Mode'!L:L,'Roadway by Mode'!$I:$I,\">=\"&$B55,'Roadway by Mode'!$I:$I,\"<\"&$D55,'Roadway by Mode'!$V:$V,\"=No\"),SUMIFS('Roadway by Mode'!L:L,'Roadway by Mode'!$I:$I,\">=\"&$B55,'Roadway by Mode'!$V:$V,\"=No\"))),IF($A55=\"\",\"\",IF($A55=\"between\",SUMIFS('Roadway by Mode'!L:L,'Roadway by Mode'!$I:$I,\">=\"&$B55,'Roadway by Mode'!$I:$I,\"<\"&$D55),SUMIFS('Roadway by Mode'!L:L,'Roadway by Mode'!$I:$I,\">=\"&$B55)))),\"\")","v":8613},{"$f":"IFERROR(IF($X$2,IF($A55=\"\",\"\",IF($A55=\"between\",SUMIFS('Track by Mode'!N:N,'Track by Mode'!$I:$I,\">=\"&$B55,'Track by Mode'!$I:$I,\"<\"&$D55,'Track by Mode'!$AI:$AI,\"=No\"),SUMIFS('Track by Mode'!N:N,'Track by Mode'!$I:$I,\">=\"&$B55,'Track by Mode'!$AI:$AI,\"=No\"))),IF($A55=\"\",\"\",IF($A55=\"between\",SUMIFS('Track by Mode'!N:N,'Track by Mode'!$I:$I,\">=\"&$B55,'Track by Mode'!$I:$I,\"<\"&$D55),SUMIFS('Track by Mode'!N:N,'Track by Mode'!$I:$I,\">=\"&$B55)))),\"\")","v":259.5},{"$f":"IFERROR(IF($X$2,IF($A55=\"\",\"\",IF($A55=\"between\",SUMIFS('Track by Mode'!P:P,'Track by Mode'!$I:$I,\">=\"&$B55,'Track by Mode'!$I:$I,\"<\"&$D55,'Track by Mode'!$AI:$AI,\"=No\"),SUMIFS('Track by Mode'!P:P,'Track by Mode'!$I:$I,\">=\"&$B55,'Track by Mode'!$AI:$AI,\"=No\"))),IF($A55=\"\",\"\",IF($A55=\"between\",SUMIFS('Track by Mode'!P:P,'Track by Mode'!$I:$I,\">=\"&$B55,'Track by Mode'!$I:$I,\"<\"&$D55),SUMIFS('Track by Mode'!P:P,'Track by Mode'!$I:$I,\">=\"&$B55)))),\"\")","v":7},{"$f":"IFERROR(IF($X$2,IF($A55=\"\",\"\",IF($A55=\"between\",SUMIFS('Track by Mode'!R:R,'Track by Mode'!$I:$I,\">=\"&$B55,'Track by Mode'!$I:$I,\"<\"&$D55,'Track by Mode'!$AI:$AI,\"=No\"),SUMIFS('Track by Mode'!R:R,'Track by Mode'!$I:$I,\">=\"&$B55,'Track by Mode'!$AI:$AI,\"=No\"))),IF($A55=\"\",\"\",IF($A55=\"between\",SUMIFS('Track by Mode'!R:R,'Track by Mode'!$I:$I,\">=\"&$B55,'Track by Mode'!$I:$I,\"<\"&$D55),SUMIFS('Track by Mode'!R:R,'Track by Mode'!$I:$I,\">=\"&$B55)))),\"\")","v":27.5},{"$f":"IFERROR(IF($X$2,IF($A55=\"\",\"\",IF($A55=\"between\",SUMIFS('Track by Mode'!T:T,'Track by Mode'!$I:$I,\">=\"&$B55,'Track by Mode'!$I:$I,\"<\"&$D55,'Track by Mode'!$AI:$AI,\"=No\"),SUMIFS('Track by Mode'!T:T,'Track by Mode'!$I:$I,\">=\"&$B55,'Track by Mode'!$AI:$AI,\"=No\"))),IF($A55=\"\",\"\",IF($A55=\"between\",SUMIFS('Track by Mode'!T:T,'Track by Mode'!$I:$I,\">=\"&$B55,'Track by Mode'!$I:$I,\"<\"&$D55),SUMIFS('Track by Mode'!T:T,'Track by Mode'!$I:$I,\">=\"&$B55)))),\"\")","v":19.200000000000003},{"$f":"IFERROR(IF($X$2,IF($A55=\"\",\"\",IF($A55=\"between\",SUMIFS('Track by Mode'!V:V,'Track by Mode'!$I:$I,\">=\"&$B55,'Track by Mode'!$I:$I,\"<\"&$D55,'Track by Mode'!$AI:$AI,\"=No\"),SUMIFS('Track by Mode'!V:V,'Track by Mode'!$I:$I,\">=\"&$B55,'Track by Mode'!$AI:$AI,\"=No\"))),IF($A55=\"\",\"\",IF($A55=\"between\",SUMIFS('Track by Mode'!V:V,'Track by Mode'!$I:$I,\">=\"&$B55,'Track by Mode'!$I:$I,\"<\"&$D55),SUMIFS('Track by Mode'!V:V,'Track by Mode'!$I:$I,\">=\"&$B55)))),\"\")","v":20.3},{"$f":"IFERROR(IF($X$2,IF($A55=\"\",\"\",IF($A55=\"between\",SUMIFS('Track by Mode'!X:X,'Track by Mode'!$I:$I,\">=\"&$B55,'Track by Mode'!$I:$I,\"<\"&$D55,'Track by Mode'!$AI:$AI,\"=No\"),SUMIFS('Track by Mode'!X:X,'Track by Mode'!$I:$I,\">=\"&$B55,'Track by Mode'!$AI:$AI,\"=No\"))),IF($A55=\"\",\"\",IF($A55=\"between\",SUMIFS('Track by Mode'!X:X,'Track by Mode'!$I:$I,\">=\"&$B55,'Track by Mode'!$I:$I,\"<\"&$D55),SUMIFS('Track by Mode'!X:X,'Track by Mode'!$I:$I,\">=\"&$B55)))),\"\")","v":40.699999999999996},{"$f":"IFERROR(IF($X$2,IF($A55=\"\",\"\",IF($A55=\"between\",SUMIFS('Track by Mode'!Z:Z,'Track by Mode'!$I:$I,\">=\"&$B55,'Track by Mode'!$I:$I,\"<\"&$D55,'Track by Mode'!$AI:$AI,\"=No\"),SUMIFS('Track by Mode'!Z:Z,'Track by Mode'!$I:$I,\">=\"&$B55,'Track by Mode'!$AI:$AI,\"=No\"))),IF($A55=\"\",\"\",IF($A55=\"between\",SUMIFS('Track by Mode'!Z:Z,'Track by Mode'!$I:$I,\">=\"&$B55,'Track by Mode'!$I:$I,\"<\"&$D55),SUMIFS('Track by Mode'!Z:Z,'Track by Mode'!$I:$I,\">=\"&$B55)))),\"\")","v":374.19999999999993},{"$f":"IFERROR(IF($X$2,IF($A55=\"\",\"\",IF($A55=\"between\",SUMIFS('Track by Mode'!AC:AC,'Track by Mode'!$I:$I,\">=\"&$B55,'Track by Mode'!$I:$I,\"<\"&$D55,'Track by Mode'!$AI:$AI,\"=No\"),SUMIFS('Track by Mode'!AC:AC,'Track by Mode'!$I:$I,\">=\"&$B55,'Track by Mode'!$AI:$AI,\"=No\"))),IF($A55=\"\",\"\",IF($A55=\"between\",SUMIFS('Track by Mode'!AC:AC,'Track by Mode'!$I:$I,\">=\"&$B55,'Track by Mode'!$I:$I,\"<\"&$D55),SUMIFS('Track by Mode'!AC:AC,'Track by Mode'!$I:$I,\">=\"&$B55)))),\"\")","v":176},{"$f":"IFERROR(IF($X$2,IF($A55=\"\",\"\",IF($A55=\"between\",SUMIFS('Track by Mode'!AE:AE,'Track by Mode'!$I:$I,\">=\"&$B55,'Track by Mode'!$I:$I,\"<\"&$D55,'Track by Mode'!$AI:$AI,\"=No\"),SUMIFS('Track by Mode'!AE:AE,'Track by Mode'!$I:$I,\">=\"&$B55,'Track by Mode'!$AI:$AI,\"=No\"))),IF($A55=\"\",\"\",IF($A55=\"between\",SUMIFS('Track by Mode'!AE:AE,'Track by Mode'!$I:$I,\">=\"&$B55,'Track by Mode'!$I:$I,\"<\"&$D55),SUMIFS('Track by Mode'!AE:AE,'Track by Mode'!$I:$I,\">=\"&$B55)))),\"\")","v":60},{"$f":"IFERROR(IF($X$2,IF($A55=\"\",\"\",IF($A55=\"between\",SUMIFS('Track by Mode'!AG:AG,'Track by Mode'!$I:$I,\">=\"&$B55,'Track by Mode'!$I:$I,\"<\"&$D55,'Track by Mode'!$AI:$AI,\"=No\"),SUMIFS('Track by Mode'!AG:AG,'Track by Mode'!$I:$I,\">=\"&$B55,'Track by Mode'!$AI:$AI,\"=No\"))),IF($A55=\"\",\"\",IF($A55=\"between\",SUMIFS('Track by Mode'!AG:AG,'Track by Mode'!$I:$I,\">=\"&$B55,'Track by Mode'!$I:$I,\"<\"&$D55),SUMIFS('Track by Mode'!AG:AG,'Track by Mode'!$I:$I,\">=\"&$B55)))),\"\")","v":236},{"$f":"IFERROR(IF($O$2,IF($A55=\"\",\"\",IF($A55=\"between\",SUMIFS('Roadway by Mode'!N:N,'Roadway by Mode'!$I:$I,\">=\"&$B55,'Roadway by Mode'!$I:$I,\"<\"&$D55,'Roadway by Mode'!$V:$V,\"=No\"),SUMIFS('Roadway by Mode'!N:N,'Roadway by Mode'!$I:$I,\">=\"&$B55,'Roadway by Mode'!$V:$V,\"=No\"))),IF($A55=\"\",\"\",IF($A55=\"between\",SUMIFS('Roadway by Mode'!N:N,'Roadway by Mode'!$I:$I,\">=\"&$B55,'Roadway by Mode'!$I:$I,\"<\"&$D55),SUMIFS('Roadway by Mode'!N:N,'Roadway by Mode'!$I:$I,\">=\"&$B55)))),\"\")","v":46.300000000000004},{"$f":"IFERROR(IF($O$2,IF($A55=\"\",\"\",IF($A55=\"between\",SUMIFS('Roadway by Mode'!P:P,'Roadway by Mode'!$I:$I,\">=\"&$B55,'Roadway by Mode'!$I:$I,\"<\"&$D55,'Roadway by Mode'!$V:$V,\"=No\"),SUMIFS('Roadway by Mode'!P:P,'Roadway by Mode'!$I:$I,\">=\"&$B55,'Roadway by Mode'!$V:$V,\"=No\"))),IF($A55=\"\",\"\",IF($A55=\"between\",SUMIFS('Roadway by Mode'!P:P,'Roadway by Mode'!$I:$I,\">=\"&$B55,'Roadway by Mode'!$I:$I,\"<\"&$D55),SUMIFS('Roadway by Mode'!P:P,'Roadway by Mode'!$I:$I,\">=\"&$B55)))),\"\")","v":245.5},{"$f":"IFERROR(IF($O$2,IF($A55=\"\",\"\",IF($A55=\"between\",SUMIFS('Roadway by Mode'!R:R,'Roadway by Mode'!$I:$I,\">=\"&$B55,'Roadway by Mode'!$I:$I,\"<\"&$D55,'Roadway by Mode'!$V:$V,\"=No\"),SUMIFS('Roadway by Mode'!R:R,'Roadway by Mode'!$I:$I,\">=\"&$B55,'Roadway by Mode'!$V:$V,\"=No\"))),IF($A55=\"\",\"\",IF($A55=\"between\",SUMIFS('Roadway by Mode'!R:R,'Roadway by Mode'!$I:$I,\">=\"&$B55,'Roadway by Mode'!$I:$I,\"<\"&$D55),SUMIFS('Roadway by Mode'!R:R,'Roadway by Mode'!$I:$I,\">=\"&$B55)))),\"\")","v":662.9},{"$f":"IFERROR(IF($O$2,IF($A55=\"\",\"\",IF($A55=\"between\",SUMIFS('Roadway by Mode'!T:T,'Roadway by Mode'!$I:$I,\">=\"&$B55,'Roadway by Mode'!$I:$I,\"<\"&$D55,'Roadway by Mode'!$V:$V,\"=No\"),SUMIFS('Roadway by Mode'!T:T,'Roadway by Mode'!$I:$I,\">=\"&$B55,'Roadway by Mode'!$V:$V,\"=No\"))),IF($A55=\"\",\"\",IF($A55=\"between\",SUMIFS('Roadway by Mode'!T:T,'Roadway by Mode'!$I:$I,\">=\"&$B55,'Roadway by Mode'!$I:$I,\"<\"&$D55),SUMIFS('Roadway by Mode'!T:T,'Roadway by Mode'!$I:$I,\">=\"&$B55)))),\"\")","v":954.7}]
["between",500,"and",1000,"between 500 and 1,000",{"$f":"IFERROR(IF($X$2,IF($A56=\"\",\"\",IF($A56=\"between\",SUMIFS('Track by Mode'!L:L,'Track by Mode'!$I:$I,\">=\"&$B56,'Track by Mode'!$I:$I,\"<\"&$D56,'Track by Mode'!$AI:$AI,\"=No\"),SUMIFS('Track by Mode'!L:L,'Track by Mode'!$I:$I,\">=\"&$B56,'Track by Mode'!$AI:$AI,\"=No\"))),IF($A56=\"\",\"\",IF($A56=\"between\",SUMIFS('Track by Mode'!L:L,'Track by Mode'!$I:$I,\">=\"&$B56,'Track by Mode'!$I:$I,\"<\"&$D56),SUMIFS('Track by Mode'!L:L,'Track by Mode'!$I:$I,\">=\"&$B56))))+IF($X$2,IF($A56=\"\",\"\",IF($A56=\"between\",SUMIFS('Roadway by Mode'!L:L,'Roadway by Mode'!$I:$I,\">=\"&$B56,'Roadway by Mode'!$I:$I,\"<\"&$D56,'Roadway by Mode'!$V:$V,\"=No\"),SUMIFS('Roadway by Mode'!L:L,'Roadway by Mode'!$I:$I,\">=\"&$B56,'Roadway by Mode'!$V:$V,\"=No\"))),IF($A56=\"\",\"\",IF($A56=\"between\",SUMIFS('Roadway by Mode'!L:L,'Roadway by Mode'!$I:$I,\">=\"&$B56,'Roadway by Mode'!$I:$I,\"<\"&$D56),SUMIFS('Roadway by Mode'!L:L,'Roadway by Mode'!$I:$I,\">=\"&$B56)))),\"\")","v":7804},{"$f":"IFERROR(IF($X$2,IF($A56=\"\",\"\",IF($A56=\"between\",SUMIFS('Track by Mode'!N:N,'Track by Mode'!$I:$I,\">=\"&$B56,'Track by Mode'!$I:$I,\"<\"&$D56,'Track by Mode'!$AI:$AI,\"=No\"),SUMIFS('Track by Mode'!N:N,'Track by Mode'!$I:$I,\">=\"&$B56,'Track by Mode'!$AI:$AI,\"=No\"))),IF($A56=\"\",\"\",IF($A56=\"between\",SUMIFS('Track by Mode'!N:N,'Track by Mode'!$I:$I,\">=\"&$B56,'Track by Mode'!$I:$I,\"<\"&$D56),SUMIFS('Track by Mode'!N:N,'Track by Mode'!$I:$I,\">=\"&$B56)))),\"\")","v":734.89999999999986},{"$f":"IFERROR(IF($X$2,IF($A56=\"\",\"\",IF($A56=\"between\",SUMIFS('Track by Mode'!P:P,'Track by Mode'!$I:$I,\">=\"&$B56,'Track by Mode'!$I:$I,\"<\"&$D56,'Track by Mode'!$AI:$AI,\"=No\"),SUMIFS('Track by Mode'!P:P,'Track by Mode'!$I:$I,\">=\"&$B56,'Track by Mode'!$AI:$AI,\"=No\"))),IF($A56=\"\",\"\",IF($A56=\"between\",SUMIFS('Track by Mode'!P:P,'Track by Mode'!$I:$I,\">=\"&$B56,'Track by Mode'!$I:$I,\"<\"&$D56),SUMIFS('Track by Mode'!P:P,'Track by Mode'!$I:$I,\">=\"&$B56)))),\"\")","v":13.3},{"$f":"IFERROR(IF($X$2,IF($A56=\"\",\"\",IF($A56=\"between\",SUMIFS('Track by Mode'!R:R,'Track by Mode'!$I:$I,\">=\"&$B56,'Track by Mode'!$I:$I,\"<\"&$D56,'Track by Mode'!$AI:$AI,\"=No\"),SUMIFS('Track by Mode'!R:R,'Track by Mode'!$I:$I,\">=\"&$B56,'Track by Mode'!$AI:$AI,\"=No\"))),IF($A56=\"\",\"\",IF($A56=\"between\",SUMIFS('Track by Mode'!R:R,'Track by Mode'!$I:$I,\">=\"&$B56,'Track by Mode'!$I:$I,\"<\"&$D56),SUMIFS('Track by Mode'!R:R,'Track by Mode'!$I:$I,\">=\"&$B56)))),\"\")","v":111.19999999999999},{"$f":"IFERROR(IF($X$2,IF($A56=\"\",\"\",IF($A56=\"between\",SUMIFS('Track by Mode'!T:T,'Track by Mode'!$I:$I,\">=\"&$B56,'Track by Mode'!$I:$I,\"<\"&$D56,'Track by Mode'!$AI:$AI,\"=No\"),SUMIFS('Track by Mode'!T:T,'Track by Mode'!$I:$I,\">=\"&$B56,'Track by Mode'!$AI:$AI,\"=No\"))),IF($A56=\"\",\"\",IF($A56=\"between\",SUMIFS('Track by Mode'!T:T,'Track by Mode'!$I:$I,\">=\"&$B56,'Track by Mode'!$I:$I,\"<\"&$D56),SUMIFS('Track by Mode'!T:T,'Track by Mode'!$I:$I,\">=\"&$B56)))),\"\")","v":17.899999999999999},{"$f":"IFERROR(IF($X$2,IF($A56=\"\",\"\",IF($A56=\"between\",SUMIFS('Track by Mode'!V:V,'Track by Mode'!$I:$I,\">=\"&$B56,'Track by Mode'!$I:$I,\"<\"&$D56,'Track by Mode'!$AI:$AI,\"=No\"),SUMIFS('Track by Mode'!V:V,'Track by Mode'!$I:$I,\">=\"&$B56,'Track by Mode'!$AI:$AI,\"=No\"))),IF($A56=\"\",\"\",IF($A56=\"between\",SUMIFS('Track by Mode'!V:V,'Track by Mode'!$I:$I,\">=\"&$B56,'Track by Mode'!$I:$I,\"<\"&$D56),SUMIFS('Track by Mode'!V:V,'Track by Mode'!$I:$I,\">=\"&$B56)))),\"\")","v":18.100000000000001},{"$f":"IFERROR(IF($X$2,IF($A56=\"\",\"\",IF($A56=\"between\",SUMIFS('Track by Mode'!X:X,'Track by Mode'!$I:$I,\">=\"&$B56,'Track by Mode'!$I:$I,\"<\"&$D56,'Track by Mode'!$AI:$AI,\"=No\"),SUMIFS('Track by Mode'!X:X,'Track by Mode'!$I:$I,\">=\"&$B56,'Track by Mode'!$AI:$AI,\"=No\"))),IF($A56=\"\",\"\",IF($A56=\"between\",SUMIFS('Track by Mode'!X:X,'Track by Mode'!$I:$I,\">=\"&$B56,'Track by Mode'!$I:$I,\"<\"&$D56),SUMIFS('Track by Mode'!X:X,'Track by Mode'!$I:$I,\">=\"&$B56)))),\"\")","v":95.800000000000011},{"$f":"IFERROR(IF($X$2,IF($A56=\"\",\"\",IF($A56=\"between\",SUMIFS('Track by Mode'!Z:Z,'Track by Mode'!$I:$I,\">=\"&$B56,'Track by Mode'!$I:$I,\"<\"&$D56,'Track by Mode'!$AI:$AI,\"=No\"),SUMIFS('Track by Mode'!Z:Z,'Track by Mode'!$I:$I,\">=\"&$B56,'Track by Mode'!$AI:$AI,\"=No\"))),IF($A56=\"\",\"\",IF($A56=\"between\",SUMIFS('Track by Mode'!Z:Z,'Track by Mode'!$I:$I,\">=\"&$B56,'Track by Mode'!$I:$I,\"<\"&$D56),SUMIFS('Track by Mode'!Z:Z,'Track by Mode'!$I:$I,\">=\"&$B56)))),\"\")","v":991.2},{"$f":"IFERROR(IF($X$2,IF($A56=\"\",\"\",IF($A56=\"between\",SUMIFS('Track by Mode'!AC:AC,'Track by Mode'!$I:$I,\">=\"&$B56,'Track by Mode'!$I:$I,\"<\"&$D56,'Track by Mode'!$AI:$AI,\"=No\"),SUMIFS('Track by Mode'!AC:AC,'Track by Mode'!$I:$I,\">=\"&$B56,'Track by Mode'!$AI:$AI,\"=No\"))),IF($A56=\"\",\"\",IF($A56=\"between\",SUMIFS('Track by Mode'!AC:AC,'Track by Mode'!$I:$I,\">=\"&$B56,'Track by Mode'!$I:$I,\"<\"&$D56),SUMIFS('Track by Mode'!AC:AC,'Track by Mode'!$I:$I,\">=\"&$B56)))),\"\")","v":730},{"$f":"IFERROR(IF($X$2,IF($A56=\"\",\"\",IF($A56=\"between\",SUMIFS('Track by Mode'!AE:AE,'Track by Mode'!$I:$I,\">=\"&$B56,'Track by Mode'!$I:$I,\"<\"&$D56,'Track by Mode'!$AI:$AI,\"=No\"),SUMIFS('Track by Mode'!AE:AE,'Track by Mode'!$I:$I,\">=\"&$B56,'Track by Mode'!$AI:$AI,\"=No\"))),IF($A56=\"\",\"\",IF($A56=\"between\",SUMIFS('Track by Mode'!AE:AE,'Track by Mode'!$I:$I,\">=\"&$B56,'Track by Mode'!$I:$I,\"<\"&$D56),SUMIFS('Track by Mode'!AE:AE,'Track by Mode'!$I:$I,\">=\"&$B56)))),\"\")","v":31},{"$f":"IFERROR(IF($X$2,IF($A56=\"\",\"\",IF($A56=\"between\",SUMIFS('Track by Mode'!AG:AG,'Track by Mode'!$I:$I,\">=\"&$B56,'Track by Mode'!$I:$I,\"<\"&$D56,'Track by Mode'!$AI:$AI,\"=No\"),SUMIFS('Track by Mode'!AG:AG,'Track by Mode'!$I:$I,\">=\"&$B56,'Track by Mode'!$AI:$AI,\"=No\"))),IF($A56=\"\",\"\",IF($A56=\"between\",SUMIFS('Track by Mode'!AG:AG,'Track by Mode'!$I:$I,\">=\"&$B56,'Track by Mode'!$I:$I,\"<\"&$D56),SUMIFS('Track by Mode'!AG:AG,'Track by Mode'!$I:$I,\">=\"&$B56)))),\"\")","v":761},{"$f":"IFERROR(IF($O$2,IF($A56=\"\",\"\",IF($A56=\"between\",SUMIFS('Roadway by Mode'!N:N,'Roadway by Mode'!$I:$I,\">=\"&$B56,'Roadway by Mode'!$I:$I,\"<\"&$D56,'Roadway by Mode'!$V:$V,\"=No\"),SUMIFS('Roadway by Mode'!N:N,'Roadway by Mode'!$I:$I,\">=\"&$B56,'Roadway by Mode'!$V:$V,\"=No\"))),IF($A56=\"\",\"\",IF($A56=\"between\",SUMIFS('Roadway by Mode'!N:N,'Roadway by Mode'!$I:$I,\">=\"&$B56,'Roadway by Mode'!$I:$I,\"<\"&$D56),SUMIFS('Roadway by Mode'!N:N,'Roadway by Mode'!$I:$I,\">=\"&$B56)))),\"\")","v":146.89999999999998},{"$f":"IFERROR(IF($O$2,IF($A56=\"\",\"\",IF($A56=\"between\",SUMIFS('Roadway by Mode'!P:P,'Roadway by Mode'!$I:$I,\">=\"&$B56,'Roadway by Mode'!$I:$I,\"<\"&$D56,'Roadway by Mode'!$V:$V,\"=No\"),SUMIFS('Roadway by Mode'!P:P,'Roadway by Mode'!$I:$I,\">=\"&$B56,'Roadway by Mode'!$V:$V,\"=No\"))),IF($A56=\"\",\"\",IF($A56=\"between\",SUMIFS('Roadway by Mode'!P:P,'Roadway by Mode'!$I:$I,\">=\"&$B56,'Roadway by Mode'!$I:$I,\"<\"&$D56),SUMIFS('Roadway by Mode'!P:P,'Roadway by Mode'!$I:$I,\">=\"&$B56)))),\"\")","v":509.5},{"$f":"IFERROR(IF($O$2,IF($A56=\"\",\"\",IF($A56=\"between\",SUMIFS('Roadway by Mode'!R:R,'Roadway by Mode'!$I:$I,\">=\"&$B56,'Roadway by Mode'!$I:$I,\"<\"&$D56,'Roadway by Mode'!$V:$V,\"=No\"),SUMIFS('Roadway by Mode'!R:R,'Roadway by Mode'!$I:$I,\">=\"&$B56,'Roadway by Mode'!$V:$V,\"=No\"))),IF($A56=\"\",\"\",IF($A56=\"between\",SUMIFS('Roadway by Mode'!R:R,'Roadway by Mode'!$I:$I,\">=\"&$B56,'Roadway by Mode'!$I:$I,\"<\"&$D56),SUMIFS('Roadway by Mode'!R:R,'Roadway by Mode'!$I:$I,\">=\"&$B56)))),\"\")","v":185},{"$f":"IFERROR(IF($O$2,IF($A56=\"\",\"\",IF($A56=\"between\",SUMIFS('Roadway by Mode'!T:T,'Roadway by Mode'!$I:$I,\">=\"&$B56,'Roadway by Mode'!$I:$I,\"<\"&$D56,'Roadway by Mode'!$V:$V,\"=No\"),SUMIFS('Roadway by Mode'!T:T,'Roadway by Mode'!$I:$I,\">=\"&$B56,'Roadway by Mode'!$V:$V,\"=No\"))),IF($A56=\"\",\"\",IF($A56=\"between\",SUMIFS('Roadway by Mode'!T:T,'Roadway by Mode'!$I:$I,\">=\"&$B56,'Roadway by Mode'!$I:$I,\"<\"&$D56),SUMIFS('Roadway by Mode'!T:T,'Roadway by Mode'!$I:$I,\">=\"&$B56)))),\"\")","v":841.4}]
["between",1000,"and",2000,"between 1,000 and 2,000",{"$f":"IFERROR(IF($X$2,IF($A57=\"\",\"\",IF($A57=\"between\",SUMIFS('Track by Mode'!L:L,'Track by Mode'!$I:$I,\">=\"&$B57,'Track by Mode'!$I:$I,\"<\"&$D57,'Track by Mode'!$AI:$AI,\"=No\"),SUMIFS('Track by Mode'!L:L,'Track by Mode'!$I:$I,\">=\"&$B57,'Track by Mode'!$AI:$AI,\"=No\"))),IF($A57=\"\",\"\",IF($A57=\"between\",SUMIFS('Track by Mode'!L:L,'Track by Mode'!$I:$I,\">=\"&$B57,'Track by Mode'!$I:$I,\"<\"&$D57),SUMIFS('Track by Mode'!L:L,'Track by Mode'!$I:$I,\">=\"&$B57))))+IF($X$2,IF($A57=\"\",\"\",IF($A57=\"between\",SUMIFS('Roadway by Mode'!L:L,'Roadway by Mode'!$I:$I,\">=\"&$B57,'Roadway by Mode'!$I:$I,\"<\"&$D57,'Roadway by Mode'!$V:$V,\"=No\"),SUMIFS('Roadway by Mode'!L:L,'Roadway by Mode'!$I:$I,\">=\"&$B57,'Roadway by Mode'!$V:$V,\"=No\"))),IF($A57=\"\",\"\",IF($A57=\"between\",SUMIFS('Roadway by Mode'!L:L,'Roadway by Mode'!$I:$I,\">=\"&$B57,'Roadway by Mode'!$I:$I,\"<\"&$D57),SUMIFS('Roadway by Mode'!L:L,'Roadway by Mode'!$I:$I,\">=\"&$B57)))),\"\")","v":10328},{"$f":"IFERROR(IF($X$2,IF($A57=\"\",\"\",IF($A57=\"between\",SUMIFS('Track by Mode'!N:N,'Track by Mode'!$I:$I,\">=\"&$B57,'Track by Mode'!$I:$I,\"<\"&$D57,'Track by Mode'!$AI:$AI,\"=No\"),SUMIFS('Track by Mode'!N:N,'Track by Mode'!$I:$I,\">=\"&$B57,'Track by Mode'!$AI:$AI,\"=No\"))),IF($A57=\"\",\"\",IF($A57=\"between\",SUMIFS('Track by Mode'!N:N,'Track by Mode'!$I:$I,\">=\"&$B57,'Track by Mode'!$I:$I,\"<\"&$D57),SUMIFS('Track by Mode'!N:N,'Track by Mode'!$I:$I,\">=\"&$B57)))),\"\")","v":3269.3999999999996},{"$f":"IFERROR(IF($X$2,IF($A57=\"\",\"\",IF($A57=\"between\",SUMIFS('Track by Mode'!P:P,'Track by Mode'!$I:$I,\">=\"&$B57,'Track by Mode'!$I:$I,\"<\"&$D57,'Track by Mode'!$AI:$AI,\"=No\"),SUMIFS('Track by Mode'!P:P,'Track by Mode'!$I:$I,\">=\"&$B57,'Track by Mode'!$AI:$AI,\"=No\"))),IF($A57=\"\",\"\",IF($A57=\"between\",SUMIFS('Track by Mode'!P:P,'Track by Mode'!$I:$I,\">=\"&$B57,'Track by Mode'!$I:$I,\"<\"&$D57),SUMIFS('Track by Mode'!P:P,'Track by Mode'!$I:$I,\">=\"&$B57)))),\"\")","v":61.6},{"$f":"IFERROR(IF($X$2,IF($A57=\"\",\"\",IF($A57=\"between\",SUMIFS('Track by Mode'!R:R,'Track by Mode'!$I:$I,\">=\"&$B57,'Track by Mode'!$I:$I,\"<\"&$D57,'Track by Mode'!$AI:$AI,\"=No\"),SUMIFS('Track by Mode'!R:R,'Track by Mode'!$I:$I,\">=\"&$B57,'Track by Mode'!$AI:$AI,\"=No\"))),IF($A57=\"\",\"\",IF($A57=\"between\",SUMIFS('Track by Mode'!R:R,'Track by Mode'!$I:$I,\">=\"&$B57,'Track by Mode'!$I:$I,\"<\"&$D57),SUMIFS('Track by Mode'!R:R,'Track by Mode'!$I:$I,\">=\"&$B57)))),\"\")","v":192.79999999999998},{"$f":"IFERROR(IF($X$2,IF($A57=\"\",\"\",IF($A57=\"between\",SUMIFS('Track by Mode'!T:T,'Track by Mode'!$I:$I,\">=\"&$B57,'Track by Mode'!$I:$I,\"<\"&$D57,'Track by Mode'!$AI:$AI,\"=No\"),SUMIFS('Track by Mode'!T:T,'Track by Mode'!$I:$I,\">=\"&$B57,'Track by Mode'!$AI:$AI,\"=No\"))),IF($A57=\"\",\"\",IF($A57=\"between\",SUMIFS('Track by Mode'!T:T,'Track by Mode'!$I:$I,\">=\"&$B57,'Track by Mode'!$I:$I,\"<\"&$D57),SUMIFS('Track by Mode'!T:T,'Track by Mode'!$I:$I,\">=\"&$B57)))),\"\")","v":365.8},{"$f":"IFERROR(IF($X$2,IF($A57=\"\",\"\",IF($A57=\"between\",SUMIFS('Track by Mode'!V:V,'Track by Mode'!$I:$I,\">=\"&$B57,'Track by Mode'!$I:$I,\"<\"&$D57,'Track by Mode'!$AI:$AI,\"=No\"),SUMIFS('Track by Mode'!V:V,'Track by Mode'!$I:$I,\">=\"&$B57,'Track by Mode'!$AI:$AI,\"=No\"))),IF($A57=\"\",\"\",IF($A57=\"between\",SUMIFS('Track by Mode'!V:V,'Track by Mode'!$I:$I,\">=\"&$B57,'Track by Mode'!$I:$I,\"<\"&$D57),SUMIFS('Track by Mode'!V:V,'Track by Mode'!$I:$I,\">=\"&$B57)))),\"\")","v":55.6},{"$f":"IFERROR(IF($X$2,IF($A57=\"\",\"\",IF($A57=\"between\",SUMIFS('Track by Mode'!X:X,'Track by Mode'!$I:$I,\">=\"&$B57,'Track by Mode'!$I:$I,\"<\"&$D57,'Track by Mode'!$AI:$AI,\"=No\"),SUMIFS('Track by Mode'!X:X,'Track by Mode'!$I:$I,\">=\"&$B57,'Track by Mode'!$AI:$AI,\"=No\"))),IF($A57=\"\",\"\",IF($A57=\"between\",SUMIFS('Track by Mode'!X:X,'Track by Mode'!$I:$I,\">=\"&$B57,'Track by Mode'!$I:$I,\"<\"&$D57),SUMIFS('Track by Mode'!X:X,'Track by Mode'!$I:$I,\">=\"&$B57)))),\"\")","v":50.2},{"$f":"IFERROR(IF($X$2,IF($A57=\"\",\"\",IF($A57=\"between\",SUMIFS('Track by Mode'!Z:Z,'Track by Mode'!$I:$I,\">=\"&$B57,'Track by Mode'!$I:$I,\"<\"&$D57,'Track by Mode'!$AI:$AI,\"=No\"),SUMIFS('Track by Mode'!Z:Z,'Track by Mode'!$I:$I,\">=\"&$B57,'Track by Mode'!$AI:$AI,\"=No\"))),IF($A57=\"\",\"\",IF($A57=\"between\",SUMIFS('Track by Mode'!Z:Z,'Track by Mode'!$I:$I,\">=\"&$B57,'Track by Mode'!$I:$I,\"<\"&$D57),SUMIFS('Track by Mode'!Z:Z,'Track by Mode'!$I:$I,\">=\"&$B57)))),\"\")","v":3995.4000000000005},{"$f":"IFERROR(IF($X$2,IF($A57=\"\",\"\",IF($A57=\"between\",SUMIFS('Track by Mode'!AC:AC,'Track by Mode'!$I:$I,\">=\"&$B57,'Track by Mode'!$I:$I,\"<\"&$D57,'Track by Mode'!$AI:$AI,\"=No\"),SUMIFS('Track by Mode'!AC:AC,'Track by Mode'!$I:$I,\">=\"&$B57,'Track by Mode'!$AI:$AI,\"=No\"))),IF($A57=\"\",\"\",IF($A57=\"between\",SUMIFS('Track by Mode'!AC:AC,'Track by Mode'!$I:$I,\">=\"&$B57,'Track by Mode'!$I:$I,\"<\"&$D57),SUMIFS('Track by Mode'!AC:AC,'Track by Mode'!$I:$I,\">=\"&$B57)))),\"\")","v":1587},{"$f":"IFERROR(IF($X$2,IF($A57=\"\",\"\",IF($A57=\"between\",SUMIFS('Track by Mode'!AE:AE,'Track by Mode'!$I:$I,\">=\"&$B57,'Track by Mode'!$I:$I,\"<\"&$D57,'Track by Mode'!$AI:$AI,\"=No\"),SUMIFS('Track by Mode'!AE:AE,'Track by Mode'!$I:$I,\">=\"&$B57,'Track by Mode'!$AI:$AI,\"=No\"))),IF($A57=\"\",\"\",IF($A57=\"between\",SUMIFS('Track by Mode'!AE:AE,'Track by Mode'!$I:$I,\">=\"&$B57,'Track by Mode'!$I:$I,\"<\"&$D57),SUMIFS('Track by Mode'!AE:AE,'Track by Mode'!$I:$I,\">=\"&$B57)))),\"\")","v":539},{"$f":"IFERROR(IF($X$2,IF($A57=\"\",\"\",IF($A57=\"between\",SUMIFS('Track by Mode'!AG:AG,'Track by Mode'!$I:$I,\">=\"&$B57,'Track by Mode'!$I:$I,\"<\"&$D57,'Track by Mode'!$AI:$AI,\"=No\"),SUMIFS('Track by Mode'!AG:AG,'Track by Mode'!$I:$I,\">=\"&$B57,'Track by Mode'!$AI:$AI,\"=No\"))),IF($A57=\"\",\"\",IF($A57=\"between\",SUMIFS('Track by Mode'!AG:AG,'Track by Mode'!$I:$I,\">=\"&$B57,'Track by Mode'!$I:$I,\"<\"&$D57),SUMIFS('Track by Mode'!AG:AG,'Track by Mode'!$I:$I,\">=\"&$B57)))),\"\")","v":2126},{"$f":"IFERROR(IF($O$2,IF($A57=\"\",\"\",IF($A57=\"between\",SUMIFS('Roadway by Mode'!N:N,'Roadway by Mode'!$I:$I,\">=\"&$B57,'Roadway by Mode'!$I:$I,\"<\"&$D57,'Roadway by Mode'!$V:$V,\"=No\"),SUMIFS('Roadway by Mode'!N:N,'Roadway by Mode'!$I:$I,\">=\"&$B57,'Roadway by Mode'!$V:$V,\"=No\"))),IF($A57=\"\",\"\",IF($A57=\"between\",SUMIFS('Roadway by Mode'!N:N,'Roadway by Mode'!$I:$I,\">=\"&$B57,'Roadway by Mode'!$I:$I,\"<\"&$D57),SUMIFS('Roadway by Mode'!N:N,'Roadway by Mode'!$I:$I,\">=\"&$B57)))),\"\")","v":222.30000000000004},{"$f":"IFERROR(IF($O$2,IF($A57=\"\",\"\",IF($A57=\"between\",SUMIFS('Roadway by Mode'!P:P,'Roadway by Mode'!$I:$I,\">=\"&$B57,'Roadway by Mode'!$I:$I,\"<\"&$D57,'Roadway by Mode'!$V:$V,\"=No\"),SUMIFS('Roadway by Mode'!P:P,'Roadway by Mode'!$I:$I,\">=\"&$B57,'Roadway by Mode'!$V:$V,\"=No\"))),IF($A57=\"\",\"\",IF($A57=\"between\",SUMIFS('Roadway by Mode'!P:P,'Roadway by Mode'!$I:$I,\">=\"&$B57,'Roadway by Mode'!$I:$I,\"<\"&$D57),SUMIFS('Roadway by Mode'!P:P,'Roadway by Mode'!$I:$I,\">=\"&$B57)))),\"\")","v":100.6},{"$f":"IFERROR(IF($O$2,IF($A57=\"\",\"\",IF($A57=\"between\",SUMIFS('Roadway by Mode'!R:R,'Roadway by Mode'!$I:$I,\">=\"&$B57,'Roadway by Mode'!$I:$I,\"<\"&$D57,'Roadway by Mode'!$V:$V,\"=No\"),SUMIFS('Roadway by Mode'!R:R,'Roadway by Mode'!$I:$I,\">=\"&$B57,'Roadway by Mode'!$V:$V,\"=No\"))),IF($A57=\"\",\"\",IF($A57=\"between\",SUMIFS('Roadway by Mode'!R:R,'Roadway by Mode'!$I:$I,\">=\"&$B57,'Roadway by Mode'!$I:$I,\"<\"&$D57),SUMIFS('Roadway by Mode'!R:R,'Roadway by Mode'!$I:$I,\">=\"&$B57)))),\"\")","v":418.79999999999995},{"$f":"IFERROR(IF($O$2,IF($A57=\"\",\"\",IF($A57=\"between\",SUMIFS('Roadway by Mode'!T:T,'Roadway by Mode'!$I:$I,\">=\"&$B57,'Roadway by Mode'!$I:$I,\"<\"&$D57,'Roadway by Mode'!$V:$V,\"=No\"),SUMIFS('Roadway by Mode'!T:T,'Roadway by Mode'!$I:$I,\">=\"&$B57,'Roadway by Mode'!$V:$V,\"=No\"))),IF($A57=\"\",\"\",IF($A57=\"between\",SUMIFS('Roadway by Mode'!T:T,'Roadway by Mode'!$I:$I,\">=\"&$B57,'Roadway by Mode'!$I:$I,\"<\"&$D57),SUMIFS('Roadway by Mode'!T:T,'Roadway by Mode'!$I:$I,\">=\"&$B57)))),\"\")","v":741.69999999999982}]
["over",2000,"",null,"over 2,000",{"$f":"IFERROR(IF($X$2,IF($A58=\"\",\"\",IF($A58=\"between\",SUMIFS('Track by Mode'!L:L,'Track by Mode'!$I:$I,\">=\"&$B58,'Track by Mode'!$I:$I,\"<\"&$D58,'Track by Mode'!$AI:$AI,\"=No\"),SUMIFS('Track by Mode'!L:L,'Track by Mode'!$I:$I,\">=\"&$B58,'Track by Mode'!$AI:$AI,\"=No\"))),IF($A58=\"\",\"\",IF($A58=\"between\",SUMIFS('Track by Mode'!L:L,'Track by Mode'!$I:$I,\">=\"&$B58,'Track by Mode'!$I:$I,\"<\"&$D58),SUMIFS('Track by Mode'!L:L,'Track by Mode'!$I:$I,\">=\"&$B58))))+IF($X$2,IF($A58=\"\",\"\",IF($A58=\"between\",SUMIFS('Roadway by Mode'!L:L,'Roadway by Mode'!$I:$I,\">=\"&$B58,'Roadway by Mode'!$I:$I,\"<\"&$D58,'Roadway by Mode'!$V:$V,\"=No\"),SUMIFS('Roadway by Mode'!L:L,'Roadway by Mode'!$I:$I,\">=\"&$B58,'Roadway by Mode'!$V:$V,\"=No\"))),IF($A58=\"\",\"\",IF($A58=\"between\",SUMIFS('Roadway by Mode'!L:L,'Roadway by Mode'!$I:$I,\">=\"&$B58,'Roadway by Mode'!$I:$I,\"<\"&$D58),SUMIFS('Roadway by Mode'!L:L,'Roadway by Mode'!$I:$I,\">=\"&$B58)))),\"\")","v":25541},{"$f":"IFERROR(IF($X$2,IF($A58=\"\",\"\",IF($A58=\"between\",SUMIFS('Track by Mode'!N:N,'Track by Mode'!$I:$I,\">=\"&$B58,'Track by Mode'!$I:$I,\"<\"&$D58,'Track by Mode'!$AI:$AI,\"=No\"),SUMIFS('Track by Mode'!N:N,'Track by Mode'!$I:$I,\">=\"&$B58,'Track by Mode'!$AI:$AI,\"=No\"))),IF($A58=\"\",\"\",IF($A58=\"between\",SUMIFS('Track by Mode'!N:N,'Track by Mode'!$I:$I,\">=\"&$B58,'Track by Mode'!$I:$I,\"<\"&$D58),SUMIFS('Track by Mode'!N:N,'Track by Mode'!$I:$I,\">=\"&$B58)))),\"\")","v":2909.6999999999994},{"$f":"IFERROR(IF($X$2,IF($A58=\"\",\"\",IF($A58=\"between\",SUMIFS('Track by Mode'!P:P,'Track by Mode'!$I:$I,\">=\"&$B58,'Track by Mode'!$I:$I,\"<\"&$D58,'Track by Mode'!$AI:$AI,\"=No\"),SUMIFS('Track by Mode'!P:P,'Track by Mode'!$I:$I,\">=\"&$B58,'Track by Mode'!$AI:$AI,\"=No\"))),IF($A58=\"\",\"\",IF($A58=\"between\",SUMIFS('Track by Mode'!P:P,'Track by Mode'!$I:$I,\">=\"&$B58,'Track by Mode'!$I:$I,\"<\"&$D58),SUMIFS('Track by Mode'!P:P,'Track by Mode'!$I:$I,\">=\"&$B58)))),\"\")","v":205.2},{"$f":"IFERROR(IF($X$2,IF($A58=\"\",\"\",IF($A58=\"between\",SUMIFS('Track by Mode'!R:R,'Track by Mode'!$I:$I,\">=\"&$B58,'Track by Mode'!$I:$I,\"<\"&$D58,'Track by Mode'!$AI:$AI,\"=No\"),SUMIFS('Track by Mode'!R:R,'Track by Mode'!$I:$I,\">=\"&$B58,'Track by Mode'!$AI:$AI,\"=No\"))),IF($A58=\"\",\"\",IF($A58=\"between\",SUMIFS('Track by Mode'!R:R,'Track by Mode'!$I:$I,\">=\"&$B58,'Track by Mode'!$I:$I,\"<\"&$D58),SUMIFS('Track by Mode'!R:R,'Track by Mode'!$I:$I,\">=\"&$B58)))),\"\")","v":393.40000000000003},{"$f":"IFERROR(IF($X$2,IF($A58=\"\",\"\",IF($A58=\"between\",SUMIFS('Track by Mode'!T:T,'Track by Mode'!$I:$I,\">=\"&$B58,'Track by Mode'!$I:$I,\"<\"&$D58,'Track by Mode'!$AI:$AI,\"=No\"),SUMIFS('Track by Mode'!T:T,'Track by Mode'!$I:$I,\">=\"&$B58,'Track by Mode'!$AI:$AI,\"=No\"))),IF($A58=\"\",\"\",IF($A58=\"between\",SUMIFS('Track by Mode'!T:T,'Track by Mode'!$I:$I,\">=\"&$B58,'Track by Mode'!$I:$I,\"<\"&$D58),SUMIFS('Track by Mode'!T:T,'Track by Mode'!$I:$I,\">=\"&$B58)))),\"\")","v":135},{"$f":"IFERROR(IF($X$2,IF($A58=\"\",\"\",IF($A58=\"between\",SUMIFS('Track by Mode'!V:V,'Track by Mode'!$I:$I,\">=\"&$B58,'Track by Mode'!$I:$I,\"<\"&$D58,'Track by Mode'!$AI:$AI,\"=No\"),SUMIFS('Track by Mode'!V:V,'Track by Mode'!$I:$I,\">=\"&$B58,'Track by Mode'!$AI:$AI,\"=No\"))),IF($A58=\"\",\"\",IF($A58=\"between\",SUMIFS('Track by Mode'!V:V,'Track by Mode'!$I:$I,\">=\"&$B58,'Track by Mode'!$I:$I,\"<\"&$D58),SUMIFS('Track by Mode'!V:V,'Track by Mode'!$I:$I,\">=\"&$B58)))),\"\")","v":70.800000000000011},{"$f":"IFERROR(IF($X$2,IF($A58=\"\",\"\",IF($A58=\"between\",SUMIFS('Track by Mode'!X:X,'Track by Mode'!$I:$I,\">=\"&$B58,'Track by Mode'!$I:$I,\"<\"&$D58,'Track by Mode'!$AI:$AI,\"=No\"),SUMIFS('Track by Mode'!X:X,'Track by Mode'!$I:$I,\">=\"&$B58,'Track by Mode'!$AI:$AI,\"=No\"))),IF($A58=\"\",\"\",IF($A58=\"between\",SUMIFS('Track by Mode'!X:X,'Track by Mode'!$I:$I,\">=\"&$B58,'Track by Mode'!$I:$I,\"<\"&$D58),SUMIFS('Track by Mode'!X:X,'Track by Mode'!$I:$I,\">=\"&$B58)))),\"\")","v":735},{"$f":"IFERROR(IF($X$2,IF($A58=\"\",\"\",IF($A58=\"between\",SUMIFS('Track by Mode'!Z:Z,'Track by Mode'!$I:$I,\">=\"&$B58,'Track by Mode'!$I:$I,\"<\"&$D58,'Track by Mode'!$AI:$AI,\"=No\"),SUMIFS('Track by Mode'!Z:Z,'Track by Mode'!$I:$I,\">=\"&$B58,'Track by Mode'!$AI:$AI,\"=No\"))),IF($A58=\"\",\"\",IF($A58=\"between\",SUMIFS('Track by Mode'!Z:Z,'Track by Mode'!$I:$I,\">=\"&$B58,'Track by Mode'!$I:$I,\"<\"&$D58),SUMIFS('Track by Mode'!Z:Z,'Track by Mode'!$I:$I,\">=\"&$B58)))),\"\")","v":4449.1000000000004},{"$f":"IFERROR(IF($X$2,IF($A58=\"\",\"\",IF($A58=\"between\",SUMIFS('Track by Mode'!AC:AC,'Track by Mode'!$I:$I,\">=\"&$B58,'Track by Mode'!$I:$I,\"<\"&$D58,'Track by Mode'!$AI:$AI,\"=No\"),SUMIFS('Track by Mode'!AC:AC,'Track by Mode'!$I:$I,\">=\"&$B58,'Track by Mode'!$AI:$AI,\"=No\"))),IF($A58=\"\",\"\",IF($A58=\"between\",SUMIFS('Track by Mode'!AC:AC,'Track by Mode'!$I:$I,\">=\"&$B58,'Track by Mode'!$I:$I,\"<\"&$D58),SUMIFS('Track by Mode'!AC:AC,'Track by Mode'!$I:$I,\">=\"&$B58)))),\"\")","v":1370},{"$f":"IFERROR(IF($X$2,IF($A58=\"\",\"\",IF($A58=\"between\",SUMIFS('Track by Mode'!AE:AE,'Track by Mode'!$I:$I,\">=\"&$B58,'Track by Mode'!$I:$I,\"<\"&$D58,'Track by Mode'!$AI:$AI,\"=No\"),SUMIFS('Track by Mode'!AE:AE,'Track by Mode'!$I:$I,\">=\"&$B58,'Track by Mode'!$AI:$AI,\"=No\"))),IF($A58=\"\",\"\",IF($A58=\"between\",SUMIFS('Track by Mode'!AE:AE,'Track by Mode'!$I:$I,\">=\"&$B58,'Track by Mode'!$I:$I,\"<\"&$D58),SUMIFS('Track by Mode'!AE:AE,'Track by Mode'!$I:$I,\">=\"&$B58)))),\"\")","v":739},{"$f":"IFERROR(IF($X$2,IF($A58=\"\",\"\",IF($A58=\"between\",SUMIFS('Track by Mode'!AG:AG,'Track by Mode'!$I:$I,\">=\"&$B58,'Track by Mode'!$I:$I,\"<\"&$D58,'Track by Mode'!$AI:$AI,\"=No\"),SUMIFS('Track by Mode'!AG:AG,'Track by Mode'!$I:$I,\">=\"&$B58,'Track by Mode'!$AI:$AI,\"=No\"))),IF($A58=\"\",\"\",IF($A58=\"between\",SUMIFS('Track by Mode'!AG:AG,'Track by Mode'!$I:$I,\">=\"&$B58,'Track by Mode'!$I:$I,\"<\"&$D58),SUMIFS('Track by Mode'!AG:AG,'Track by Mode'!$I:$I,\">=\"&$B58)))),\"\")","v":2109},{"$f":"IFERROR(IF($O$2,IF($A58=\"\",\"\",IF($A58=\"between\",SUMIFS('Roadway by Mode'!N:N,'Roadway by Mode'!$I:$I,\">=\"&$B58,'Roadway by Mode'!$I:$I,\"<\"&$D58,'Roadway by Mode'!$V:$V,\"=No\"),SUMIFS('Roadway by Mode'!N:N,'Roadway by Mode'!$I:$I,\">=\"&$B58,'Roadway by Mode'!$V:$V,\"=No\"))),IF($A58=\"\",\"\",IF($A58=\"between\",SUMIFS('Roadway by Mode'!N:N,'Roadway by Mode'!$I:$I,\">=\"&$B58,'Roadway by Mode'!$I:$I,\"<\"&$D58),SUMIFS('Roadway by Mode'!N:N,'Roadway by Mode'!$I:$I,\">=\"&$B58)))),\"\")","v":298.80000000000007},{"$f":"IFERROR(IF($O$2,IF($A58=\"\",\"\",IF($A58=\"between\",SUMIFS('Roadway by Mode'!P:P,'Roadway by Mode'!$I:$I,\">=\"&$B58,'Roadway by Mode'!$I:$I,\"<\"&$D58,'Roadway by Mode'!$V:$V,\"=No\"),SUMIFS('Roadway by Mode'!P:P,'Roadway by Mode'!$I:$I,\">=\"&$B58,'Roadway by Mode'!$V:$V,\"=No\"))),IF($A58=\"\",\"\",IF($A58=\"between\",SUMIFS('Roadway by Mode'!P:P,'Roadway by Mode'!$I:$I,\">=\"&$B58,'Roadway by Mode'!$I:$I,\"<\"&$D58),SUMIFS('Roadway by Mode'!P:P,'Roadway by Mode'!$I:$I,\">=\"&$B58)))),\"\")","v":298.90000000000003},{"$f":"IFERROR(IF($O$2,IF($A58=\"\",\"\",IF($A58=\"between\",SUMIFS('Roadway by Mode'!R:R,'Roadway by Mode'!$I:$I,\">=\"&$B58,'Roadway by Mode'!$I:$I,\"<\"&$D58,'Roadway by Mode'!$V:$V,\"=No\"),SUMIFS('Roadway by Mode'!R:R,'Roadway by Mode'!$I:$I,\">=\"&$B58,'Roadway by Mode'!$V:$V,\"=No\"))),IF($A58=\"\",\"\",IF($A58=\"between\",SUMIFS('Roadway by Mode'!R:R,'Roadway by Mode'!$I:$I,\">=\"&$B58,'Roadway by Mode'!$I:$I,\"<\"&$D58),SUMIFS('Roadway by Mode'!R:R,'Roadway by Mode'!$I:$I,\">=\"&$B58)))),\"\")","v":345.90000000000003},{"$f":"IFERROR(IF($O$2,IF($A58=\"\",\"\",IF($A58=\"between\",SUMIFS('Roadway by Mode'!T:T,'Roadway by Mode'!$I:$I,\">=\"&$B58,'Roadway by Mode'!$I:$I,\"<\"&$D58,'Roadway by Mode'!$V:$V,\"=No\"),SUMIFS('Roadway by Mode'!T:T,'Roadway by Mode'!$I:$I,\">=\"&$B58,'Roadway by Mode'!$V:$V,\"=No\"))),IF($A58=\"\",\"\",IF($A58=\"between\",SUMIFS('Roadway by Mode'!T:T,'Roadway by Mode'!$I:$I,\">=\"&$B58,'Roadway by Mode'!$I:$I,\"<\"&$D58),SUMIFS('Roadway by Mode'!T:T,'Roadway by Mode'!$I:$I,\">=\"&$B58)))),\"\")","v":943.59999999999991}]
[null,null,null,null,null,{"$f":"IFERROR(G61&\":\"&CHAR(10)&G59&CHAR(10)&H59&CHAR(10)&I59&CHAR(10)&J59&CHAR(10)&K59&CHAR(10)&L59,\"\")","v":"agency size under 10 vehicles:\nAt Grade: Restricted Right-of-Way: 1%\nStreet Running: 79%\nElevated on Structure: 20%\nElevated on Fill: 0%\nOpen Cut: 0%\nSubway: 0%"},{"$f":"G1&\": \"&ROUND(100*G60/$M$60,0)&\"%\"","v":"At Grade: Restricted Right-of-Way: 1%"},{"$f":"H1&\": \"&ROUND(100*H60/$M$60,0)&\"%\"","v":"Street Running: 79%"},"Elevated on Structure: 20%","Elevated on Fill: 0%","Open Cut: 0%","Subway: 0%"]
[null,null,null,null,null,null,{"$f":"INDIRECT(\"G\"&(49+$F$61))","v":0.1},{"$f":"INDIRECT(\"H\"&(49+$F$61))","v":7.1},{"$f":"INDIRECT(\"I\"&(49+$F$61))","v":1.8},{"$f":"INDIRECT(\"J\"&(49+$F$61))","v":0},{"$f":"INDIRECT(\"K\"&(49+$F$61))","v":0},{"$f":"INDIRECT(\"L\"&(49+$F$61))","v":0},{"$f":"INDIRECT(\"M\"&(49+$F61))","v":9}]
[null,null,null,null,null,1,{"$f":"IF(INDIRECT(\"A\"&(49+F61))=\"\",\"Please select a valid bin to graph.\",IF(OR(INDIRECT(\"A\"&(49+F61))=\"under\",INDIRECT(\"A\"&(49+F61))=\"over\"),\"agency size \"&INDIRECT(\"A\"&(49+F61))&\" \"&FIXED(INDIRECT(\"B\"&(49+F61)),0,0)&\" vehicles\",\"agency size \"&\"between \"&FIXED(INDIRECT(\"B\"&(49+F61)),0,0)&\" and \"&FIXED(INDIRECT(\"D\"&(49+F61)),0,0)&\" vehicles\"))","v":"agency size under 10 vehicles"}]
[]
["By State"]
[null,null,null,null,null,null,"Miles of Track",null,null,null,null,null,null,"Number of Crossings",null,null,"Miles of Roadway"]
[null,null,"Abbreviation","State","Column1","VOMS","At Grade: Restricted Right-of-Way\nTrack Miles","\n\nStreet Running\nTrack Miles","\n\nElevated on Structure\nTrack Miles","\n\nElevated on Fill\nTrack Miles","\n\n\nOpen Cut\nTrack Miles","\n\n\nSubway\nTrack Miles","Total Track Miles","At Grade: Restricted Right-of-Way\nCrossings","\n\nStreet Running\nCrossings","Total Crossings","\n\nPermanent Busway\nRoadway Miles","\n\nPermanent HOV\nRoadway Miles","\nPart-Time Busway or HOV\nRoadway Miles","Total Roadway Miles"]
[null,null,"AK","Alaska",null,{"$f":"IF($X$2,SUMIFS('Track by Mode'!L:L,'Track by Mode'!$C:$C,\"=\"&$C66,'Track by Mode'!$AI:$AI,\"=No\"),SUMIFS('Track by Mode'!L:L,'Track by Mode'!$C:$C,\"=\"&$C66))+IF($X$2,SUMIFS('Roadway by Mode'!L:L,'Roadway by Mode'!$C:$C,\"=\"&$C66,'Roadway by Mode'!$V:$V,\"=No\"),SUMIFS('Roadway by Mode'!L:L,'Roadway by Mode'!$C:$C,\"=\"&$C66))","v":83},{"$f":"IF($X$2,SUMIFS('Track by Mode'!N:N,'Track by Mode'!$C:$C,\"=\"&$C66,'Track by Mode'!$AI:$AI,\"=No\"),SUMIFS('Track by Mode'!N:N,'Track by Mode'!$C:$C,\"=\"&$C66))","v":676.1},{"$f":"IF($X$2,SUMIFS('Track by Mode'!P:P,'Track by Mode'!$C:$C,\"=\"&$C66,'Track by Mode'!$AI:$AI,\"=No\"),SUMIFS('Track by Mode'!P:P,'Track by Mode'!$C:$C,\"=\"&$C66))","v":2.6},{"$f":"IF($X$2,SUMIFS('Track by Mode'!R:R,'Track by Mode'!$C:$C,\"=\"&$C66,'Track by Mode'!$AI:$AI,\"=No\"),SUMIFS('Track by Mode'!R:R,'Track by Mode'!$C:$C,\"=\"&$C66))","v":0},{"$f":"IF($X$2,SUMIFS('Track by Mode'!T:T,'Track by Mode'!$C:$C,\"=\"&$C66,'Track by Mode'!$AI:$AI,\"=No\"),SUMIFS('Track by Mode'!T:T,'Track by Mode'!$C:$C,\"=\"&$C66))","v":0},{"$f":"IF($X$2,SUMIFS('Track by Mode'!V:V,'Track by Mode'!$C:$C,\"=\"&$C66,'Track by Mode'!$AI:$AI,\"=No\"),SUMIFS('Track by Mode'!V:V,'Track by Mode'!$C:$C,\"=\"&$C66))","v":0},{"$f":"IF($X$2,SUMIFS('Track by Mode'!X:X,'Track by Mode'!$C:$C,\"=\"&$C66,'Track by Mode'!$AI:$AI,\"=No\"),SUMIFS('Track by Mode'!X:X,'Track by Mode'!$C:$C,\"=\"&$C66))","v":4.0999999999999996},{"$f":"IF($X$2,SUMIFS('Track by Mode'!Z:Z,'Track by Mode'!$C:$C,\"=\"&$C66,'Track by Mode'!$AI:$AI,\"=No\"),SUMIFS('Track by Mode'!Z:Z,'Track by Mode'!$C:$C,\"=\"&$C66))","v":682.80000000000007},{"$f":"IF($X$2,SUMIFS('Track by Mode'!AC:AC,'Track by Mode'!$C:$C,\"=\"&$C66,'Track by Mode'!$AI:$AI,\"=No\"),SUMIFS('Track by Mode'!AC:AC,'Track by Mode'!$C:$C,\"=\"&$C66))","v":132},{"$f":"IF($X$2,SUMIFS('Track by Mode'!AE:AE,'Track by Mode'!$C:$C,\"=\"&$C66,'Track by Mode'!$AI:$AI,\"=No\"),SUMIFS('Track by Mode'!AE:AE,'Track by Mode'!$C:$C,\"=\"&$C66))","v":1},{"$f":"IF($X$2,SUMIFS('Track by Mode'!AG:AG,'Track by Mode'!$C:$C,\"=\"&$C66,'Track by Mode'!$AI:$AI,\"=No\"),SUMIFS('Track by Mode'!AG:AG,'Track by Mode'!$C:$C,\"=\"&$C66))","v":133},{"$f":"IF($X$2,SUMIFS('Roadway by Mode'!N:N,'Roadway by Mode'!$C:$C,\"=\"&$C66,'Roadway by Mode'!$V:$V,\"=No\"),SUMIFS('Roadway by Mode'!N:N,'Roadway by Mode'!$C:$C,\"=\"&$C66))","v":0},{"$f":"IF($X$2,SUMIFS('Roadway by Mode'!P:P,'Roadway by Mode'!$C:$C,\"=\"&$C66,'Roadway by Mode'!$V:$V,\"=No\"),SUMIFS('Roadway by Mode'!P:P,'Roadway by Mode'!$C:$C,\"=\"&$C66))","v":0},{"$f":"IF($X$2,SUMIFS('Roadway by Mode'!R:R,'Roadway by Mode'!$C:$C,\"=\"&$C66,'Roadway by Mode'!$V:$V,\"=No\"),SUMIFS('Roadway by Mode'!R:R,'Roadway by Mode'!$C:$C,\"=\"&$C66))","v":0},{"$f":"IF($X$2,SUMIFS('Roadway by Mode'!T:T,'Roadway by Mode'!$C:$C,\"=\"&$C66,'Roadway by Mode'!$V:$V,\"=No\"),SUMIFS('Roadway by Mode'!T:T,'Roadway by Mode'!$C:$C,\"=\"&$C66))","v":0}]
[null,null,"AL","Alabama",null,{"$f":"IF($X$2,SUMIFS('Track by Mode'!L:L,'Track by Mode'!$C:$C,\"=\"&$C67,'Track by Mode'!$AI:$AI,\"=No\"),SUMIFS('Track by Mode'!L:L,'Track by Mode'!$C:$C,\"=\"&$C67))+IF($X$2,SUMIFS('Roadway by Mode'!L:L,'Roadway by Mode'!$C:$C,\"=\"&$C67,'Roadway by Mode'!$V:$V,\"=No\"),SUMIFS('Roadway by Mode'!L:L,'Roadway by Mode'!$C:$C,\"=\"&$C67))","v":123},{"$f":"IF($X$2,SUMIFS('Track by Mode'!N:N,'Track by Mode'!$C:$C,\"=\"&$C67,'Track by Mode'!$AI:$AI,\"=No\"),SUMIFS('Track by Mode'!N:N,'Track by Mode'!$C:$C,\"=\"&$C67))","v":0},{"$f":"IF($X$2,SUMIFS('Track by Mode'!P:P,'Track by Mode'!$C:$C,\"=\"&$C67,'Track by Mode'!$AI:$AI,\"=No\"),SUMIFS('Track by Mode'!P:P,'Track by Mode'!$C:$C,\"=\"&$C67))","v":0},{"$f":"IF($X$2,SUMIFS('Track by Mode'!R:R,'Track by Mode'!$C:$C,\"=\"&$C67,'Track by Mode'!$AI:$AI,\"=No\"),SUMIFS('Track by Mode'!R:R,'Track by Mode'!$C:$C,\"=\"&$C67))","v":0},{"$f":"IF($X$2,SUMIFS('Track by Mode'!T:T,'Track by Mode'!$C:$C,\"=\"&$C67,'Track by Mode'!$AI:$AI,\"=No\"),SUMIFS('Track by Mode'!T:T,'Track by Mode'!$C:$C,\"=\"&$C67))","v":0},{"$f":"IF($X$2,SUMIFS('Track by Mode'!V:V,'Track by Mode'!$C:$C,\"=\"&$C67,'Track by Mode'!$AI:$AI,\"=No\"),SUMIFS('Track by Mode'!V:V,'Track by Mode'!$C:$C,\"=\"&$C67))","v":0},{"$f":"IF($X$2,SUMIFS('Track by Mode'!X:X,'Track by Mode'!$C:$C,\"=\"&$C67,'Track by Mode'!$AI:$AI,\"=No\"),SUMIFS('Track by Mode'!X:X,'Track by Mode'!$C:$C,\"=\"&$C67))","v":0},{"$f":"IF($X$2,SUMIFS('Track by Mode'!Z:Z,'Track by Mode'!$C:$C,\"=\"&$C67,'Track by Mode'!$AI:$AI,\"=No\"),SUMIFS('Track by Mode'!Z:Z,'Track by Mode'!$C:$C,\"=\"&$C67))","v":0},{"$f":"IF($X$2,SUMIFS('Track by Mode'!AC:AC,'Track by Mode'!$C:$C,\"=\"&$C67,'Track by Mode'!$AI:$AI,\"=No\"),SUMIFS('Track by Mode'!AC:AC,'Track by Mode'!$C:$C,\"=\"&$C67))","v":0},{"$f":"IF($X$2,SUMIFS('Track by Mode'!AE:AE,'Track by Mode'!$C:$C,\"=\"&$C67,'Track by Mode'!$AI:$AI,\"=No\"),SUMIFS('Track by Mode'!AE:AE,'Track by Mode'!$C:$C,\"=\"&$C67))","v":0},{"$f":"IF($X$2,SUMIFS('Track by Mode'!AG:AG,'Track by Mode'!$C:$C,\"=\"&$C67,'Track by Mode'!$AI:$AI,\"=No\"),SUMIFS('Track by Mode'!AG:AG,'Track by Mode'!$C:$C,\"=\"&$C67))","v":0},{"$f":"IF($X$2,SUMIFS('Roadway by Mode'!N:N,'Roadway by Mode'!$C:$C,\"=\"&$C67,'Roadway by Mode'!$V:$V,\"=No\"),SUMIFS('Roadway by Mode'!N:N,'Roadway by Mode'!$C:$C,\"=\"&$C67))","v":0},{"$f":"IF($X$2,SUMIFS('Roadway by Mode'!P:P,'Roadway by Mode'!$C:$C,\"=\"&$C67,'Roadway by Mode'!$V:$V,\"=No\"),SUMIFS('Roadway by Mode'!P:P,'Roadway by Mode'!$C:$C,\"=\"&$C67))","v":0},{"$f":"IF($X$2,SUMIFS('Roadway by Mode'!R:R,'Roadway by Mode'!$C:$C,\"=\"&$C67,'Roadway by Mode'!$V:$V,\"=No\"),SUMIFS('Roadway by Mode'!R:R,'Roadway by Mode'!$C:$C,\"=\"&$C67))","v":0},{"$f":"IF($X$2,SUMIFS('Roadway by Mode'!T:T,'Roadway by Mode'!$C:$C,\"=\"&$C67,'Roadway by Mode'!$V:$V,\"=No\"),SUMIFS('Roadway by Mode'!T:T,'Roadway by Mode'!$C:$C,\"=\"&$C67))","v":0}]
[null,null,"AR","Arkansas",null,{"$f":"IF($X$2,SUMIFS('Track by Mode'!L:L,'Track by Mode'!$C:$C,\"=\"&$C68,'Track by Mode'!$AI:$AI,\"=No\"),SUMIFS('Track by Mode'!L:L,'Track by Mode'!$C:$C,\"=\"&$C68))+IF($X$2,SUMIFS('Roadway by Mode'!L:L,'Roadway by Mode'!$C:$C,\"=\"&$C68,'Roadway by Mode'!$V:$V,\"=No\"),SUMIFS('Roadway by Mode'!L:L,'Roadway by Mode'!$C:$C,\"=\"&$C68))","v":70},{"$f":"IF($X$2,SUMIFS('Track by Mode'!N:N,'Track by Mode'!$C:$C,\"=\"&$C68,'Track by Mode'!$AI:$AI,\"=No\"),SUMIFS('Track by Mode'!N:N,'Track by Mode'!$C:$C,\"=\"&$C68))","v":0},{"$f":"IF($X$2,SUMIFS('Track by Mode'!P:P,'Track by Mode'!$C:$C,\"=\"&$C68,'Track by Mode'!$AI:$AI,\"=No\"),SUMIFS('Track by Mode'!P:P,'Track by Mode'!$C:$C,\"=\"&$C68))","v":3},{"$f":"IF($X$2,SUMIFS('Track by Mode'!R:R,'Track by Mode'!$C:$C,\"=\"&$C68,'Track by Mode'!$AI:$AI,\"=No\"),SUMIFS('Track by Mode'!R:R,'Track by Mode'!$C:$C,\"=\"&$C68))","v":0.5},{"$f":"IF($X$2,SUMIFS('Track by Mode'!T:T,'Track by Mode'!$C:$C,\"=\"&$C68,'Track by Mode'!$AI:$AI,\"=No\"),SUMIFS('Track by Mode'!T:T,'Track by Mode'!$C:$C,\"=\"&$C68))","v":0},{"$f":"IF($X$2,SUMIFS('Track by Mode'!V:V,'Track by Mode'!$C:$C,\"=\"&$C68,'Track by Mode'!$AI:$AI,\"=No\"),SUMIFS('Track by Mode'!V:V,'Track by Mode'!$C:$C,\"=\"&$C68))","v":0},{"$f":"IF($X$2,SUMIFS('Track by Mode'!X:X,'Track by Mode'!$C:$C,\"=\"&$C68,'Track by Mode'!$AI:$AI,\"=No\"),SUMIFS('Track by Mode'!X:X,'Track by Mode'!$C:$C,\"=\"&$C68))","v":0},{"$f":"IF($X$2,SUMIFS('Track by Mode'!Z:Z,'Track by Mode'!$C:$C,\"=\"&$C68,'Track by Mode'!$AI:$AI,\"=No\"),SUMIFS('Track by Mode'!Z:Z,'Track by Mode'!$C:$C,\"=\"&$C68))","v":3.5},{"$f":"IF($X$2,SUMIFS('Track by Mode'!AC:AC,'Track by Mode'!$C:$C,\"=\"&$C68,'Track by Mode'!$AI:$AI,\"=No\"),SUMIFS('Track by Mode'!AC:AC,'Track by Mode'!$C:$C,\"=\"&$C68))","v":0},{"$f":"IF($X$2,SUMIFS('Track by Mode'!AE:AE,'Track by Mode'!$C:$C,\"=\"&$C68,'Track by Mode'!$AI:$AI,\"=No\"),SUMIFS('Track by Mode'!AE:AE,'Track by Mode'!$C:$C,\"=\"&$C68))","v":24},{"$f":"IF($X$2,SUMIFS('Track by Mode'!AG:AG,'Track by Mode'!$C:$C,\"=\"&$C68,'Track by Mode'!$AI:$AI,\"=No\"),SUMIFS('Track by Mode'!AG:AG,'Track by Mode'!$C:$C,\"=\"&$C68))","v":24},{"$f":"IF($X$2,SUMIFS('Roadway by Mode'!N:N,'Roadway by Mode'!$C:$C,\"=\"&$C68,'Roadway by Mode'!$V:$V,\"=No\"),SUMIFS('Roadway by Mode'!N:N,'Roadway by Mode'!$C:$C,\"=\"&$C68))","v":0},{"$f":"IF($X$2,SUMIFS('Roadway by Mode'!P:P,'Roadway by Mode'!$C:$C,\"=\"&$C68,'Roadway by Mode'!$V:$V,\"=No\"),SUMIFS('Roadway by Mode'!P:P,'Roadway by Mode'!$C:$C,\"=\"&$C68))","v":0},{"$f":"IF($X$2,SUMIFS('Roadway by Mode'!R:R,'Roadway by Mode'!$C:$C,\"=\"&$C68,'Roadway by Mode'!$V:$V,\"=No\"),SUMIFS('Roadway by Mode'!R:R,'Roadway by Mode'!$C:$C,\"=\"&$C68))","v":0},{"$f":"IF($X$2,SUMIFS('Roadway by Mode'!T:T,'Roadway by Mode'!$C:$C,\"=\"&$C68,'Roadway by Mode'!$V:$V,\"=No\"),SUMIFS('Roadway by Mode'!T:T,'Roadway by Mode'!$C:$C,\"=\"&$C68))","v":0}]
[null,null,"AS","American Samoa",null,{"$f":"IF($X$2,SUMIFS('Track by Mode'!L:L,'Track by Mode'!$C:$C,\"=\"&$C69,'Track by Mode'!$AI:$AI,\"=No\"),SUMIFS('Track by Mode'!L:L,'Track by Mode'!$C:$C,\"=\"&$C69))+IF($X$2,SUMIFS('Roadway by Mode'!L:L,'Roadway by Mode'!$C:$C,\"=\"&$C69,'Roadway by Mode'!$V:$V,\"=No\"),SUMIFS('Roadway by Mode'!L:L,'Roadway by Mode'!$C:$C,\"=\"&$C69))","v":0},{"$f":"IF($X$2,SUMIFS('Track by Mode'!N:N,'Track by Mode'!$C:$C,\"=\"&$C69,'Track by Mode'!$AI:$AI,\"=No\"),SUMIFS('Track by Mode'!N:N,'Track by Mode'!$C:$C,\"=\"&$C69))","v":0},{"$f":"IF($X$2,SUMIFS('Track by Mode'!P:P,'Track by Mode'!$C:$C,\"=\"&$C69,'Track by Mode'!$AI:$AI,\"=No\"),SUMIFS('Track by Mode'!P:P,'Track by Mode'!$C:$C,\"=\"&$C69))","v":0},{"$f":"IF($X$2,SUMIFS('Track by Mode'!R:R,'Track by Mode'!$C:$C,\"=\"&$C69,'Track by Mode'!$AI:$AI,\"=No\"),SUMIFS('Track by Mode'!R:R,'Track by Mode'!$C:$C,\"=\"&$C69))","v":0},{"$f":"IF($X$2,SUMIFS('Track by Mode'!T:T,'Track by Mode'!$C:$C,\"=\"&$C69,'Track by Mode'!$AI:$AI,\"=No\"),SUMIFS('Track by Mode'!T:T,'Track by Mode'!$C:$C,\"=\"&$C69))","v":0},{"$f":"IF($X$2,SUMIFS('Track by Mode'!V:V,'Track by Mode'!$C:$C,\"=\"&$C69,'Track by Mode'!$AI:$AI,\"=No\"),SUMIFS('Track by Mode'!V:V,'Track by Mode'!$C:$C,\"=\"&$C69))","v":0},{"$f":"IF($X$2,SUMIFS('Track by Mode'!X:X,'Track by Mode'!$C:$C,\"=\"&$C69,'Track by Mode'!$AI:$AI,\"=No\"),SUMIFS('Track by Mode'!X:X,'Track by Mode'!$C:$C,\"=\"&$C69))","v":0},{"$f":"IF($X$2,SUMIFS('Track by Mode'!Z:Z,'Track by Mode'!$C:$C,\"=\"&$C69,'Track by Mode'!$AI:$AI,\"=No\"),SUMIFS('Track by Mode'!Z:Z,'Track by Mode'!$C:$C,\"=\"&$C69))","v":0},{"$f":"IF($X$2,SUMIFS('Track by Mode'!AC:AC,'Track by Mode'!$C:$C,\"=\"&$C69,'Track by Mode'!$AI:$AI,\"=No\"),SUMIFS('Track by Mode'!AC:AC,'Track by Mode'!$C:$C,\"=\"&$C69))","v":0},{"$f":"IF($X$2,SUMIFS('Track by Mode'!AE:AE,'Track by Mode'!$C:$C,\"=\"&$C69,'Track by Mode'!$AI:$AI,\"=No\"),SUMIFS('Track by Mode'!AE:AE,'Track by Mode'!$C:$C,\"=\"&$C69))","v":0},{"$f":"IF($X$2,SUMIFS('Track by Mode'!AG:AG,'Track by Mode'!$C:$C,\"=\"&$C69,'Track by Mode'!$AI:$AI,\"=No\"),SUMIFS('Track by Mode'!AG:AG,'Track by Mode'!$C:$C,\"=\"&$C69))","v":0},{"$f":"IF($X$2,SUMIFS('Roadway by Mode'!N:N,'Roadway by Mode'!$C:$C,\"=\"&$C69,'Roadway by Mode'!$V:$V,\"=No\"),SUMIFS('Roadway by Mode'!N:N,'Roadway by Mode'!$C:$C,\"=\"&$C69))","v":0},{"$f":"IF($X$2,SUMIFS('Roadway by Mode'!P:P,'Roadway by Mode'!$C:$C,\"=\"&$C69,'Roadway by Mode'!$V:$V,\"=No\"),SUMIFS('Roadway by Mode'!P:P,'Roadway by Mode'!$C:$C,\"=\"&$C69))","v":0},{"$f":"IF($X$2,SUMIFS('Roadway by Mode'!R:R,'Roadway by Mode'!$C:$C,\"=\"&$C69,'Roadway by Mode'!$V:$V,\"=No\"),SUMIFS('Roadway by Mode'!R:R,'Roadway by Mode'!$C:$C,\"=\"&$C69))","v":0},{"$f":"IF($X$2,SUMIFS('Roadway by Mode'!T:T,'Roadway by Mode'!$C:$C,\"=\"&$C69,'Roadway by Mode'!$V:$V,\"=No\"),SUMIFS('Roadway by Mode'!T:T,'Roadway by Mode'!$C:$C,\"=\"&$C69))","v":0}]
[null,null,"AZ","Arizona",null,{"$f":"IF($X$2,SUMIFS('Track by Mode'!L:L,'Track by Mode'!$C:$C,\"=\"&$C70,'Track by Mode'!$AI:$AI,\"=No\"),SUMIFS('Track by Mode'!L:L,'Track by Mode'!$C:$C,\"=\"&$C70))+IF($X$2,SUMIFS('Roadway by Mode'!L:L,'Roadway by Mode'!$C:$C,\"=\"&$C70,'Roadway by Mode'!$V:$V,\"=No\"),SUMIFS('Roadway by Mode'!L:L,'Roadway by Mode'!$C:$C,\"=\"&$C70))","v":1035},{"$f":"IF($X$2,SUMIFS('Track by Mode'!N:N,'Track by Mode'!$C:$C,\"=\"&$C70,'Track by Mode'!$AI:$AI,\"=No\"),SUMIFS('Track by Mode'!N:N,'Track by Mode'!$C:$C,\"=\"&$C70))","v":42.4},{"$f":"IF($X$2,SUMIFS('Track by Mode'!P:P,'Track by Mode'!$C:$C,\"=\"&$C70,'Track by Mode'!$AI:$AI,\"=No\"),SUMIFS('Track by Mode'!P:P,'Track by Mode'!$C:$C,\"=\"&$C70))","v":3.8000000000000003},{"$f":"IF($X$2,SUMIFS('Track by Mode'!R:R,'Track by Mode'!$C:$C,\"=\"&$C70,'Track by Mode'!$AI:$AI,\"=No\"),SUMIFS('Track by Mode'!R:R,'Track by Mode'!$C:$C,\"=\"&$C70))","v":0.7},{"$f":"IF($X$2,SUMIFS('Track by Mode'!T:T,'Track by Mode'!$C:$C,\"=\"&$C70,'Track by Mode'!$AI:$AI,\"=No\"),SUMIFS('Track by Mode'!T:T,'Track by Mode'!$C:$C,\"=\"&$C70))","v":0},{"$f":"IF($X$2,SUMIFS('Track by Mode'!V:V,'Track by Mode'!$C:$C,\"=\"&$C70,'Track by Mode'!$AI:$AI,\"=No\"),SUMIFS('Track by Mode'!V:V,'Track by Mode'!$C:$C,\"=\"&$C70))","v":0},{"$f":"IF($X$2,SUMIFS('Track by Mode'!X:X,'Track by Mode'!$C:$C,\"=\"&$C70,'Track by Mode'!$AI:$AI,\"=No\"),SUMIFS('Track by Mode'!X:X,'Track by Mode'!$C:$C,\"=\"&$C70))","v":0},{"$f":"IF($X$2,SUMIFS('Track by Mode'!Z:Z,'Track by Mode'!$C:$C,\"=\"&$C70,'Track by Mode'!$AI:$AI,\"=No\"),SUMIFS('Track by Mode'!Z:Z,'Track by Mode'!$C:$C,\"=\"&$C70))","v":46.899999999999991},{"$f":"IF($X$2,SUMIFS('Track by Mode'!AC:AC,'Track by Mode'!$C:$C,\"=\"&$C70,'Track by Mode'!$AI:$AI,\"=No\"),SUMIFS('Track by Mode'!AC:AC,'Track by Mode'!$C:$C,\"=\"&$C70))","v":141},{"$f":"IF($X$2,SUMIFS('Track by Mode'!AE:AE,'Track by Mode'!$C:$C,\"=\"&$C70,'Track by Mode'!$AI:$AI,\"=No\"),SUMIFS('Track by Mode'!AE:AE,'Track by Mode'!$C:$C,\"=\"&$C70))","v":41},{"$f":"IF($X$2,SUMIFS('Track by Mode'!AG:AG,'Track by Mode'!$C:$C,\"=\"&$C70,'Track by Mode'!$AI:$AI,\"=No\"),SUMIFS('Track by Mode'!AG:AG,'Track by Mode'!$C:$C,\"=\"&$C70))","v":182},{"$f":"IF($X$2,SUMIFS('Roadway by Mode'!N:N,'Roadway by Mode'!$C:$C,\"=\"&$C70,'Roadway by Mode'!$V:$V,\"=No\"),SUMIFS('Roadway by Mode'!N:N,'Roadway by Mode'!$C:$C,\"=\"&$C70))","v":0},{"$f":"IF($X$2,SUMIFS('Roadway by Mode'!P:P,'Roadway by Mode'!$C:$C,\"=\"&$C70,'Roadway by Mode'!$V:$V,\"=No\"),SUMIFS('Roadway by Mode'!P:P,'Roadway by Mode'!$C:$C,\"=\"&$C70))","v":0},{"$f":"IF($X$2,SUMIFS('Roadway by Mode'!R:R,'Roadway by Mode'!$C:$C,\"=\"&$C70,'Roadway by Mode'!$V:$V,\"=No\"),SUMIFS('Roadway by Mode'!R:R,'Roadway by Mode'!$C:$C,\"=\"&$C70))","v":345.1},{"$f":"IF($X$2,SUMIFS('Roadway by Mode'!T:T,'Roadway by Mode'!$C:$C,\"=\"&$C70,'Roadway by Mode'!$V:$V,\"=No\"),SUMIFS('Roadway by Mode'!T:T,'Roadway by Mode'!$C:$C,\"=\"&$C70))","v":345.1}]
[null,null,"CA","California",null,{"$f":"IF($X$2,SUMIFS('Track by Mode'!L:L,'Track by Mode'!$C:$C,\"=\"&$C71,'Track by Mode'!$AI:$AI,\"=No\"),SUMIFS('Track by Mode'!L:L,'Track by Mode'!$C:$C,\"=\"&$C71))+IF($X$2,SUMIFS('Roadway by Mode'!L:L,'Roadway by Mode'!$C:$C,\"=\"&$C71,'Roadway by Mode'!$V:$V,\"=No\"),SUMIFS('Roadway by Mode'!L:L,'Roadway by Mode'!$C:$C,\"=\"&$C71))","v":10051},{"$f":"IF($X$2,SUMIFS('Track by Mode'!N:N,'Track by Mode'!$C:$C,\"=\"&$C71,'Track by Mode'!$AI:$AI,\"=No\"),SUMIFS('Track by Mode'!N:N,'Track by Mode'!$C:$C,\"=\"&$C71))","v":1457.6000000000001},{"$f":"IF($X$2,SUMIFS('Track by Mode'!P:P,'Track by Mode'!$C:$C,\"=\"&$C71,'Track by Mode'!$AI:$AI,\"=No\"),SUMIFS('Track by Mode'!P:P,'Track by Mode'!$C:$C,\"=\"&$C71))","v":68.5},{"$f":"IF($X$2,SUMIFS('Track by Mode'!R:R,'Track by Mode'!$C:$C,\"=\"&$C71,'Track by Mode'!$AI:$AI,\"=No\"),SUMIFS('Track by Mode'!R:R,'Track by Mode'!$C:$C,\"=\"&$C71))","v":99},{"$f":"IF($X$2,SUMIFS('Track by Mode'!T:T,'Track by Mode'!$C:$C,\"=\"&$C71,'Track by Mode'!$AI:$AI,\"=No\"),SUMIFS('Track by Mode'!T:T,'Track by Mode'!$C:$C,\"=\"&$C71))","v":51.5},{"$f":"IF($X$2,SUMIFS('Track by Mode'!V:V,'Track by Mode'!$C:$C,\"=\"&$C71,'Track by Mode'!$AI:$AI,\"=No\"),SUMIFS('Track by Mode'!V:V,'Track by Mode'!$C:$C,\"=\"&$C71))","v":24.799999999999997},{"$f":"IF($X$2,SUMIFS('Track by Mode'!X:X,'Track by Mode'!$C:$C,\"=\"&$C71,'Track by Mode'!$AI:$AI,\"=No\"),SUMIFS('Track by Mode'!X:X,'Track by Mode'!$C:$C,\"=\"&$C71))","v":111.2},{"$f":"IF($X$2,SUMIFS('Track by Mode'!Z:Z,'Track by Mode'!$C:$C,\"=\"&$C71,'Track by Mode'!$AI:$AI,\"=No\"),SUMIFS('Track by Mode'!Z:Z,'Track by Mode'!$C:$C,\"=\"&$C71))","v":1812.6000000000001},{"$f":"IF($X$2,SUMIFS('Track by Mode'!AC:AC,'Track by Mode'!$C:$C,\"=\"&$C71,'Track by Mode'!$AI:$AI,\"=No\"),SUMIFS('Track by Mode'!AC:AC,'Track by Mode'!$C:$C,\"=\"&$C71))","v":1208},{"$f":"IF($X$2,SUMIFS('Track by Mode'!AE:AE,'Track by Mode'!$C:$C,\"=\"&$C71,'Track by Mode'!$AI:$AI,\"=No\"),SUMIFS('Track by Mode'!AE:AE,'Track by Mode'!$C:$C,\"=\"&$C71))","v":517},{"$f":"IF($X$2,SUMIFS('Track by Mode'!AG:AG,'Track by Mode'!$C:$C,\"=\"&$C71,'Track by Mode'!$AI:$AI,\"=No\"),SUMIFS('Track by Mode'!AG:AG,'Track by Mode'!$C:$C,\"=\"&$C71))","v":1725},{"$f":"IF($X$2,SUMIFS('Roadway by Mode'!N:N,'Roadway by Mode'!$C:$C,\"=\"&$C71,'Roadway by Mode'!$V:$V,\"=No\"),SUMIFS('Roadway by Mode'!N:N,'Roadway by Mode'!$C:$C,\"=\"&$C71))","v":227.70000000000002},{"$f":"IF($X$2,SUMIFS('Roadway by Mode'!P:P,'Roadway by Mode'!$C:$C,\"=\"&$C71,'Roadway by Mode'!$V:$V,\"=No\"),SUMIFS('Roadway by Mode'!P:P,'Roadway by Mode'!$C:$C,\"=\"&$C71))","v":457.80000000000007},{"$f":"IF($X$2,SUMIFS('Roadway by Mode'!R:R,'Roadway by Mode'!$C:$C,\"=\"&$C71,'Roadway by Mode'!$V:$V,\"=No\"),SUMIFS('Roadway by Mode'!R:R,'Roadway by Mode'!$C:$C,\"=\"&$C71))","v":469.59999999999997},{"$f":"IF($X$2,SUMIFS('Roadway by Mode'!T:T,'Roadway by Mode'!$C:$C,\"=\"&$C71,'Roadway by Mode'!$V:$V,\"=No\"),SUMIFS('Roadway by Mode'!T:T,'Roadway by Mode'!$C:$C,\"=\"&$C71))","v":1155.0999999999999}]
[null,null,"CO","Colorado",null,{"$f":"IF($X$2,SUMIFS('Track by Mode'!L:L,'Track by Mode'!$C:$C,\"=\"&$C72,'Track by Mode'!$AI:$AI,\"=No\"),SUMIFS('Track by Mode'!L:L,'Track by Mode'!$C:$C,\"=\"&$C72))+IF($X$2,SUMIFS('Roadway by Mode'!L:L,'Roadway by Mode'!$C:$C,\"=\"&$C72,'Roadway by Mode'!$V:$V,\"=No\"),SUMIFS('Roadway by Mode'!L:L,'Roadway by Mode'!$C:$C,\"=\"&$C72))","v":1095},{"$f":"IF($X$2,SUMIFS('Track by Mode'!N:N,'Track by Mode'!$C:$C,\"=\"&$C72,'Track by Mode'!$AI:$AI,\"=No\"),SUMIFS('Track by Mode'!N:N,'Track by Mode'!$C:$C,\"=\"&$C72))","v":63.3},{"$f":"IF($X$2,SUMIFS('Track by Mode'!P:P,'Track by Mode'!$C:$C,\"=\"&$C72,'Track by Mode'!$AI:$AI,\"=No\"),SUMIFS('Track by Mode'!P:P,'Track by Mode'!$C:$C,\"=\"&$C72))","v":0},{"$f":"IF($X$2,SUMIFS('Track by Mode'!R:R,'Track by Mode'!$C:$C,\"=\"&$C72,'Track by Mode'!$AI:$AI,\"=No\"),SUMIFS('Track by Mode'!R:R,'Track by Mode'!$C:$C,\"=\"&$C72))","v":7.9},{"$f":"IF($X$2,SUMIFS('Track by Mode'!T:T,'Track by Mode'!$C:$C,\"=\"&$C72,'Track by Mode'!$AI:$AI,\"=No\"),SUMIFS('Track by Mode'!T:T,'Track by Mode'!$C:$C,\"=\"&$C72))","v":19.8},{"$f":"IF($X$2,SUMIFS('Track by Mode'!V:V,'Track by Mode'!$C:$C,\"=\"&$C72,'Track by Mode'!$AI:$AI,\"=No\"),SUMIFS('Track by Mode'!V:V,'Track by Mode'!$C:$C,\"=\"&$C72))","v":2.4},{"$f":"IF($X$2,SUMIFS('Track by Mode'!X:X,'Track by Mode'!$C:$C,\"=\"&$C72,'Track by Mode'!$AI:$AI,\"=No\"),SUMIFS('Track by Mode'!X:X,'Track by Mode'!$C:$C,\"=\"&$C72))","v":0.6},{"$f":"IF($X$2,SUMIFS('Track by Mode'!Z:Z,'Track by Mode'!$C:$C,\"=\"&$C72,'Track by Mode'!$AI:$AI,\"=No\"),SUMIFS('Track by Mode'!Z:Z,'Track by Mode'!$C:$C,\"=\"&$C72))","v":94},{"$f":"IF($X$2,SUMIFS('Track by Mode'!AC:AC,'Track by Mode'!$C:$C,\"=\"&$C72,'Track by Mode'!$AI:$AI,\"=No\"),SUMIFS('Track by Mode'!AC:AC,'Track by Mode'!$C:$C,\"=\"&$C72))","v":57},{"$f":"IF($X$2,SUMIFS('Track by Mode'!AE:AE,'Track by Mode'!$C:$C,\"=\"&$C72,'Track by Mode'!$AI:$AI,\"=No\"),SUMIFS('Track by Mode'!AE:AE,'Track by Mode'!$C:$C,\"=\"&$C72))","v":0},{"$f":"IF($X$2,SUMIFS('Track by Mode'!AG:AG,'Track by Mode'!$C:$C,\"=\"&$C72,'Track by Mode'!$AI:$AI,\"=No\"),SUMIFS('Track by Mode'!AG:AG,'Track by Mode'!$C:$C,\"=\"&$C72))","v":57},{"$f":"IF($X$2,SUMIFS('Roadway by Mode'!N:N,'Roadway by Mode'!$C:$C,\"=\"&$C72,'Roadway by Mode'!$V:$V,\"=No\"),SUMIFS('Roadway by Mode'!N:N,'Roadway by Mode'!$C:$C,\"=\"&$C72))","v":7.8000000000000007},{"$f":"IF($X$2,SUMIFS('Roadway by Mode'!P:P,'Roadway by Mode'!$C:$C,\"=\"&$C72,'Roadway by Mode'!$V:$V,\"=No\"),SUMIFS('Roadway by Mode'!P:P,'Roadway by Mode'!$C:$C,\"=\"&$C72))","v":0},{"$f":"IF($X$2,SUMIFS('Roadway by Mode'!R:R,'Roadway by Mode'!$C:$C,\"=\"&$C72,'Roadway by Mode'!$V:$V,\"=No\"),SUMIFS('Roadway by Mode'!R:R,'Roadway by Mode'!$C:$C,\"=\"&$C72))","v":50.6},{"$f":"IF($X$2,SUMIFS('Roadway by Mode'!T:T,'Roadway by Mode'!$C:$C,\"=\"&$C72,'Roadway by Mode'!$V:$V,\"=No\"),SUMIFS('Roadway by Mode'!T:T,'Roadway by Mode'!$C:$C,\"=\"&$C72))","v":58.4}]
[null,null,"CT","Connecticut",null,{"$f":"IF($X$2,SUMIFS('Track by Mode'!L:L,'Track by Mode'!$C:$C,\"=\"&$C73,'Track by Mode'!$AI:$AI,\"=No\"),SUMIFS('Track by Mode'!L:L,'Track by Mode'!$C:$C,\"=\"&$C73))+IF($X$2,SUMIFS('Roadway by Mode'!L:L,'Roadway by Mode'!$C:$C,\"=\"&$C73,'Roadway by Mode'!$V:$V,\"=No\"),SUMIFS('Roadway by Mode'!L:L,'Roadway by Mode'!$C:$C,\"=\"&$C73))","v":636},{"$f":"IF($X$2,SUMIFS('Track by Mode'!N:N,'Track by Mode'!$C:$C,\"=\"&$C73,'Track by Mode'!$AI:$AI,\"=No\"),SUMIFS('Track by Mode'!N:N,'Track by Mode'!$C:$C,\"=\"&$C73))","v":50.7},{"$f":"IF($X$2,SUMIFS('Track by Mode'!P:P,'Track by Mode'!$C:$C,\"=\"&$C73,'Track by Mode'!$AI:$AI,\"=No\"),SUMIFS('Track by Mode'!P:P,'Track by Mode'!$C:$C,\"=\"&$C73))","v":0},{"$f":"IF($X$2,SUMIFS('Track by Mode'!R:R,'Track by Mode'!$C:$C,\"=\"&$C73,'Track by Mode'!$AI:$AI,\"=No\"),SUMIFS('Track by Mode'!R:R,'Track by Mode'!$C:$C,\"=\"&$C73))","v":3.2},{"$f":"IF($X$2,SUMIFS('Track by Mode'!T:T,'Track by Mode'!$C:$C,\"=\"&$C73,'Track by Mode'!$AI:$AI,\"=No\"),SUMIFS('Track by Mode'!T:T,'Track by Mode'!$C:$C,\"=\"&$C73))","v":43.1},{"$f":"IF($X$2,SUMIFS('Track by Mode'!V:V,'Track by Mode'!$C:$C,\"=\"&$C73,'Track by Mode'!$AI:$AI,\"=No\"),SUMIFS('Track by Mode'!V:V,'Track by Mode'!$C:$C,\"=\"&$C73))","v":11.1},{"$f":"IF($X$2,SUMIFS('Track by Mode'!X:X,'Track by Mode'!$C:$C,\"=\"&$C73,'Track by Mode'!$AI:$AI,\"=No\"),SUMIFS('Track by Mode'!X:X,'Track by Mode'!$C:$C,\"=\"&$C73))","v":1},{"$f":"IF($X$2,SUMIFS('Track by Mode'!Z:Z,'Track by Mode'!$C:$C,\"=\"&$C73,'Track by Mode'!$AI:$AI,\"=No\"),SUMIFS('Track by Mode'!Z:Z,'Track by Mode'!$C:$C,\"=\"&$C73))","v":109.10000000000001},{"$f":"IF($X$2,SUMIFS('Track by Mode'!AC:AC,'Track by Mode'!$C:$C,\"=\"&$C73,'Track by Mode'!$AI:$AI,\"=No\"),SUMIFS('Track by Mode'!AC:AC,'Track by Mode'!$C:$C,\"=\"&$C73))","v":0},{"$f":"IF($X$2,SUMIFS('Track by Mode'!AE:AE,'Track by Mode'!$C:$C,\"=\"&$C73,'Track by Mode'!$AI:$AI,\"=No\"),SUMIFS('Track by Mode'!AE:AE,'Track by Mode'!$C:$C,\"=\"&$C73))","v":0},{"$f":"IF($X$2,SUMIFS('Track by Mode'!AG:AG,'Track by Mode'!$C:$C,\"=\"&$C73,'Track by Mode'!$AI:$AI,\"=No\"),SUMIFS('Track by Mode'!AG:AG,'Track by Mode'!$C:$C,\"=\"&$C73))","v":0},{"$f":"IF($X$2,SUMIFS('Roadway by Mode'!N:N,'Roadway by Mode'!$C:$C,\"=\"&$C73,'Roadway by Mode'!$V:$V,\"=No\"),SUMIFS('Roadway by Mode'!N:N,'Roadway by Mode'!$C:$C,\"=\"&$C73))","v":54.599999999999994},{"$f":"IF($X$2,SUMIFS('Roadway by Mode'!P:P,'Roadway by Mode'!$C:$C,\"=\"&$C73,'Roadway by Mode'!$V:$V,\"=No\"),SUMIFS('Roadway by Mode'!P:P,'Roadway by Mode'!$C:$C,\"=\"&$C73))","v":52.400000000000006},{"$f":"IF($X$2,SUMIFS('Roadway by Mode'!R:R,'Roadway by Mode'!$C:$C,\"=\"&$C73,'Roadway by Mode'!$V:$V,\"=No\"),SUMIFS('Roadway by Mode'!R:R,'Roadway by Mode'!$C:$C,\"=\"&$C73))","v":0},{"$f":"IF($X$2,SUMIFS('Roadway by Mode'!T:T,'Roadway by Mode'!$C:$C,\"=\"&$C73,'Roadway by Mode'!$V:$V,\"=No\"),SUMIFS('Roadway by Mode'!T:T,'Roadway by Mode'!$C:$C,\"=\"&$C73))","v":107.00000000000001}]
[null,null,"DC","District of Columbia",null,{"$f":"IF($X$2,SUMIFS('Track by Mode'!L:L,'Track by Mode'!$C:$C,\"=\"&$C74,'Track by Mode'!$AI:$AI,\"=No\"),SUMIFS('Track by Mode'!L:L,'Track by Mode'!$C:$C,\"=\"&$C74))+IF($X$2,SUMIFS('Roadway by Mode'!L:L,'Roadway by Mode'!$C:$C,\"=\"&$C74,'Roadway by Mode'!$V:$V,\"=No\"),SUMIFS('Roadway by Mode'!L:L,'Roadway by Mode'!$C:$C,\"=\"&$C74))","v":2348},{"$f":"IF($X$2,SUMIFS('Track by Mode'!N:N,'Track by Mode'!$C:$C,\"=\"&$C74,'Track by Mode'!$AI:$AI,\"=No\"),SUMIFS('Track by Mode'!N:N,'Track by Mode'!$C:$C,\"=\"&$C74))","v":152.19999999999999},{"$f":"IF($X$2,SUMIFS('Track by Mode'!P:P,'Track by Mode'!$C:$C,\"=\"&$C74,'Track by Mode'!$AI:$AI,\"=No\"),SUMIFS('Track by Mode'!P:P,'Track by Mode'!$C:$C,\"=\"&$C74))","v":0},{"$f":"IF($X$2,SUMIFS('Track by Mode'!R:R,'Track by Mode'!$C:$C,\"=\"&$C74,'Track by Mode'!$AI:$AI,\"=No\"),SUMIFS('Track by Mode'!R:R,'Track by Mode'!$C:$C,\"=\"&$C74))","v":24.2},{"$f":"IF($X$2,SUMIFS('Track by Mode'!T:T,'Track by Mode'!$C:$C,\"=\"&$C74,'Track by Mode'!$AI:$AI,\"=No\"),SUMIFS('Track by Mode'!T:T,'Track by Mode'!$C:$C,\"=\"&$C74))","v":0.5},{"$f":"IF($X$2,SUMIFS('Track by Mode'!V:V,'Track by Mode'!$C:$C,\"=\"&$C74,'Track by Mode'!$AI:$AI,\"=No\"),SUMIFS('Track by Mode'!V:V,'Track by Mode'!$C:$C,\"=\"&$C74))","v":3.1},{"$f":"IF($X$2,SUMIFS('Track by Mode'!X:X,'Track by Mode'!$C:$C,\"=\"&$C74,'Track by Mode'!$AI:$AI,\"=No\"),SUMIFS('Track by Mode'!X:X,'Track by Mode'!$C:$C,\"=\"&$C74))","v":112.3},{"$f":"IF($X$2,SUMIFS('Track by Mode'!Z:Z,'Track by Mode'!$C:$C,\"=\"&$C74,'Track by Mode'!$AI:$AI,\"=No\"),SUMIFS('Track by Mode'!Z:Z,'Track by Mode'!$C:$C,\"=\"&$C74))","v":292.29999999999995},{"$f":"IF($X$2,SUMIFS('Track by Mode'!AC:AC,'Track by Mode'!$C:$C,\"=\"&$C74,'Track by Mode'!$AI:$AI,\"=No\"),SUMIFS('Track by Mode'!AC:AC,'Track by Mode'!$C:$C,\"=\"&$C74))","v":0},{"$f":"IF($X$2,SUMIFS('Track by Mode'!AE:AE,'Track by Mode'!$C:$C,\"=\"&$C74,'Track by Mode'!$AI:$AI,\"=No\"),SUMIFS('Track by Mode'!AE:AE,'Track by Mode'!$C:$C,\"=\"&$C74))","v":0},{"$f":"IF($X$2,SUMIFS('Track by Mode'!AG:AG,'Track by Mode'!$C:$C,\"=\"&$C74,'Track by Mode'!$AI:$AI,\"=No\"),SUMIFS('Track by Mode'!AG:AG,'Track by Mode'!$C:$C,\"=\"&$C74))","v":0},{"$f":"IF($X$2,SUMIFS('Roadway by Mode'!N:N,'Roadway by Mode'!$C:$C,\"=\"&$C74,'Roadway by Mode'!$V:$V,\"=No\"),SUMIFS('Roadway by Mode'!N:N,'Roadway by Mode'!$C:$C,\"=\"&$C74))","v":1.3},{"$f":"IF($X$2,SUMIFS('Roadway by Mode'!P:P,'Roadway by Mode'!$C:$C,\"=\"&$C74,'Roadway by Mode'!$V:$V,\"=No\"),SUMIFS('Roadway by Mode'!P:P,'Roadway by Mode'!$C:$C,\"=\"&$C74))","v":10.4},{"$f":"IF($X$2,SUMIFS('Roadway by Mode'!R:R,'Roadway by Mode'!$C:$C,\"=\"&$C74,'Roadway by Mode'!$V:$V,\"=No\"),SUMIFS('Roadway by Mode'!R:R,'Roadway by Mode'!$C:$C,\"=\"&$C74))","v":61.8},{"$f":"IF($X$2,SUMIFS('Roadway by Mode'!T:T,'Roadway by Mode'!$C:$C,\"=\"&$C74,'Roadway by Mode'!$V:$V,\"=No\"),SUMIFS('Roadway by Mode'!T:T,'Roadway by Mode'!$C:$C,\"=\"&$C74))","v":73.5}]
[null,null,"DE","Delaware",null,{"$f":"IF($X$2,SUMIFS('Track by Mode'!L:L,'Track by Mode'!$C:$C,\"=\"&$C75,'Track by Mode'!$AI:$AI,\"=No\"),SUMIFS('Track by Mode'!L:L,'Track by Mode'!$C:$C,\"=\"&$C75))+IF($X$2,SUMIFS('Roadway by Mode'!L:L,'Roadway by Mode'!$C:$C,\"=\"&$C75,'Roadway by Mode'!$V:$V,\"=No\"),SUMIFS('Roadway by Mode'!L:L,'Roadway by Mode'!$C:$C,\"=\"&$C75))","v":196},{"$f":"IF($X$2,SUMIFS('Track by Mode'!N:N,'Track by Mode'!$C:$C,\"=\"&$C75,'Track by Mode'!$AI:$AI,\"=No\"),SUMIFS('Track by Mode'!N:N,'Track by Mode'!$C:$C,\"=\"&$C75))","v":0},{"$f":"IF($X$2,SUMIFS('Track by Mode'!P:P,'Track by Mode'!$C:$C,\"=\"&$C75,'Track by Mode'!$AI:$AI,\"=No\"),SUMIFS('Track by Mode'!P:P,'Track by Mode'!$C:$C,\"=\"&$C75))","v":0},{"$f":"IF($X$2,SUMIFS('Track by Mode'!R:R,'Track by Mode'!$C:$C,\"=\"&$C75,'Track by Mode'!$AI:$AI,\"=No\"),SUMIFS('Track by Mode'!R:R,'Track by Mode'!$C:$C,\"=\"&$C75))","v":0},{"$f":"IF($X$2,SUMIFS('Track by Mode'!T:T,'Track by Mode'!$C:$C,\"=\"&$C75,'Track by Mode'!$AI:$AI,\"=No\"),SUMIFS('Track by Mode'!T:T,'Track by Mode'!$C:$C,\"=\"&$C75))","v":0},{"$f":"IF($X$2,SUMIFS('Track by Mode'!V:V,'Track by Mode'!$C:$C,\"=\"&$C75,'Track by Mode'!$AI:$AI,\"=No\"),SUMIFS('Track by Mode'!V:V,'Track by Mode'!$C:$C,\"=\"&$C75))","v":0},{"$f":"IF($X$2,SUMIFS('Track by Mode'!X:X,'Track by Mode'!$C:$C,\"=\"&$C75,'Track by Mode'!$AI:$AI,\"=No\"),SUMIFS('Track by Mode'!X:X,'Track by Mode'!$C:$C,\"=\"&$C75))","v":0},{"$f":"IF($X$2,SUMIFS('Track by Mode'!Z:Z,'Track by Mode'!$C:$C,\"=\"&$C75,'Track by Mode'!$AI:$AI,\"=No\"),SUMIFS('Track by Mode'!Z:Z,'Track by Mode'!$C:$C,\"=\"&$C75))","v":0},{"$f":"IF($X$2,SUMIFS('Track by Mode'!AC:AC,'Track by Mode'!$C:$C,\"=\"&$C75,'Track by Mode'!$AI:$AI,\"=No\"),SUMIFS('Track by Mode'!AC:AC,'Track by Mode'!$C:$C,\"=\"&$C75))","v":0},{"$f":"IF($X$2,SUMIFS('Track by Mode'!AE:AE,'Track by Mode'!$C:$C,\"=\"&$C75,'Track by Mode'!$AI:$AI,\"=No\"),SUMIFS('Track by Mode'!AE:AE,'Track by Mode'!$C:$C,\"=\"&$C75))","v":0},{"$f":"IF($X$2,SUMIFS('Track by Mode'!AG:AG,'Track by Mode'!$C:$C,\"=\"&$C75,'Track by Mode'!$AI:$AI,\"=No\"),SUMIFS('Track by Mode'!AG:AG,'Track by Mode'!$C:$C,\"=\"&$C75))","v":0},{"$f":"IF($X$2,SUMIFS('Roadway by Mode'!N:N,'Roadway by Mode'!$C:$C,\"=\"&$C75,'Roadway by Mode'!$V:$V,\"=No\"),SUMIFS('Roadway by Mode'!N:N,'Roadway by Mode'!$C:$C,\"=\"&$C75))","v":0},{"$f":"IF($X$2,SUMIFS('Roadway by Mode'!P:P,'Roadway by Mode'!$C:$C,\"=\"&$C75,'Roadway by Mode'!$V:$V,\"=No\"),SUMIFS('Roadway by Mode'!P:P,'Roadway by Mode'!$C:$C,\"=\"&$C75))","v":0},{"$f":"IF($X$2,SUMIFS('Roadway by Mode'!R:R,'Roadway by Mode'!$C:$C,\"=\"&$C75,'Roadway by Mode'!$V:$V,\"=No\"),SUMIFS('Roadway by Mode'!R:R,'Roadway by Mode'!$C:$C,\"=\"&$C75))","v":0},{"$f":"IF($X$2,SUMIFS('Roadway by Mode'!T:T,'Roadway by Mode'!$C:$C,\"=\"&$C75,'Roadway by Mode'!$V:$V,\"=No\"),SUMIFS('Roadway by Mode'!T:T,'Roadway by Mode'!$C:$C,\"=\"&$C75))","v":0}]
[null,null,"FL","Florida",null,{"$f":"IF($X$2,SUMIFS('Track by Mode'!L:L,'Track by Mode'!$C:$C,\"=\"&$C76,'Track by Mode'!$AI:$AI,\"=No\"),SUMIFS('Track by Mode'!L:L,'Track by Mode'!$C:$C,\"=\"&$C76))+IF($X$2,SUMIFS('Roadway by Mode'!L:L,'Roadway by Mode'!$C:$C,\"=\"&$C76,'Roadway by Mode'!$V:$V,\"=No\"),SUMIFS('Roadway by Mode'!L:L,'Roadway by Mode'!$C:$C,\"=\"&$C76))","v":2665},{"$f":"IF($X$2,SUMIFS('Track by Mode'!N:N,'Track by Mode'!$C:$C,\"=\"&$C76,'Track by Mode'!$AI:$AI,\"=No\"),SUMIFS('Track by Mode'!N:N,'Track by Mode'!$C:$C,\"=\"&$C76))","v":199.1},{"$f":"IF($X$2,SUMIFS('Track by Mode'!P:P,'Track by Mode'!$C:$C,\"=\"&$C76,'Track by Mode'!$AI:$AI,\"=No\"),SUMIFS('Track by Mode'!P:P,'Track by Mode'!$C:$C,\"=\"&$C76))","v":0},{"$f":"IF($X$2,SUMIFS('Track by Mode'!R:R,'Track by Mode'!$C:$C,\"=\"&$C76,'Track by Mode'!$AI:$AI,\"=No\"),SUMIFS('Track by Mode'!R:R,'Track by Mode'!$C:$C,\"=\"&$C76))","v":61.8},{"$f":"IF($X$2,SUMIFS('Track by Mode'!T:T,'Track by Mode'!$C:$C,\"=\"&$C76,'Track by Mode'!$AI:$AI,\"=No\"),SUMIFS('Track by Mode'!T:T,'Track by Mode'!$C:$C,\"=\"&$C76))","v":1.6},{"$f":"IF($X$2,SUMIFS('Track by Mode'!V:V,'Track by Mode'!$C:$C,\"=\"&$C76,'Track by Mode'!$AI:$AI,\"=No\"),SUMIFS('Track by Mode'!V:V,'Track by Mode'!$C:$C,\"=\"&$C76))","v":0},{"$f":"IF($X$2,SUMIFS('Track by Mode'!X:X,'Track by Mode'!$C:$C,\"=\"&$C76,'Track by Mode'!$AI:$AI,\"=No\"),SUMIFS('Track by Mode'!X:X,'Track by Mode'!$C:$C,\"=\"&$C76))","v":0},{"$f":"IF($X$2,SUMIFS('Track by Mode'!Z:Z,'Track by Mode'!$C:$C,\"=\"&$C76,'Track by Mode'!$AI:$AI,\"=No\"),SUMIFS('Track by Mode'!Z:Z,'Track by Mode'!$C:$C,\"=\"&$C76))","v":262.5},{"$f":"IF($X$2,SUMIFS('Track by Mode'!AC:AC,'Track by Mode'!$C:$C,\"=\"&$C76,'Track by Mode'!$AI:$AI,\"=No\"),SUMIFS('Track by Mode'!AC:AC,'Track by Mode'!$C:$C,\"=\"&$C76))","v":187},{"$f":"IF($X$2,SUMIFS('Track by Mode'!AE:AE,'Track by Mode'!$C:$C,\"=\"&$C76,'Track by Mode'!$AI:$AI,\"=No\"),SUMIFS('Track by Mode'!AE:AE,'Track by Mode'!$C:$C,\"=\"&$C76))","v":0},{"$f":"IF($X$2,SUMIFS('Track by Mode'!AG:AG,'Track by Mode'!$C:$C,\"=\"&$C76,'Track by Mode'!$AI:$AI,\"=No\"),SUMIFS('Track by Mode'!AG:AG,'Track by Mode'!$C:$C,\"=\"&$C76))","v":187},{"$f":"IF($X$2,SUMIFS('Roadway by Mode'!N:N,'Roadway by Mode'!$C:$C,\"=\"&$C76,'Roadway by Mode'!$V:$V,\"=No\"),SUMIFS('Roadway by Mode'!N:N,'Roadway by Mode'!$C:$C,\"=\"&$C76))","v":43.9},{"$f":"IF($X$2,SUMIFS('Roadway by Mode'!P:P,'Roadway by Mode'!$C:$C,\"=\"&$C76,'Roadway by Mode'!$V:$V,\"=No\"),SUMIFS('Roadway by Mode'!P:P,'Roadway by Mode'!$C:$C,\"=\"&$C76))","v":0},{"$f":"IF($X$2,SUMIFS('Roadway by Mode'!R:R,'Roadway by Mode'!$C:$C,\"=\"&$C76,'Roadway by Mode'!$V:$V,\"=No\"),SUMIFS('Roadway by Mode'!R:R,'Roadway by Mode'!$C:$C,\"=\"&$C76))","v":79.199999999999989},{"$f":"IF($X$2,SUMIFS('Roadway by Mode'!T:T,'Roadway by Mode'!$C:$C,\"=\"&$C76,'Roadway by Mode'!$V:$V,\"=No\"),SUMIFS('Roadway by Mode'!T:T,'Roadway by Mode'!$C:$C,\"=\"&$C76))","v":123.1}]
[null,null,"GA","Georgia",null,{"$f":"IF($X$2,SUMIFS('Track by Mode'!L:L,'Track by Mode'!$C:$C,\"=\"&$C77,'Track by Mode'!$AI:$AI,\"=No\"),SUMIFS('Track by Mode'!L:L,'Track by Mode'!$C:$C,\"=\"&$C77))+IF($X$2,SUMIFS('Roadway by Mode'!L:L,'Roadway by Mode'!$C:$C,\"=\"&$C77,'Roadway by Mode'!$V:$V,\"=No\"),SUMIFS('Roadway by Mode'!L:L,'Roadway by Mode'!$C:$C,\"=\"&$C77))","v":1102},{"$f":"IF($X$2,SUMIFS('Track by Mode'!N:N,'Track by Mode'!$C:$C,\"=\"&$C77,'Track by Mode'!$AI:$AI,\"=No\"),SUMIFS('Track by Mode'!N:N,'Track by Mode'!$C:$C,\"=\"&$C77))","v":58.300000000000004},{"$f":"IF($X$2,SUMIFS('Track by Mode'!P:P,'Track by Mode'!$C:$C,\"=\"&$C77,'Track by Mode'!$AI:$AI,\"=No\"),SUMIFS('Track by Mode'!P:P,'Track by Mode'!$C:$C,\"=\"&$C77))","v":2.6},{"$f":"IF($X$2,SUMIFS('Track by Mode'!R:R,'Track by Mode'!$C:$C,\"=\"&$C77,'Track by Mode'!$AI:$AI,\"=No\"),SUMIFS('Track by Mode'!R:R,'Track by Mode'!$C:$C,\"=\"&$C77))","v":24.4},{"$f":"IF($X$2,SUMIFS('Track by Mode'!T:T,'Track by Mode'!$C:$C,\"=\"&$C77,'Track by Mode'!$AI:$AI,\"=No\"),SUMIFS('Track by Mode'!T:T,'Track by Mode'!$C:$C,\"=\"&$C77))","v":0},{"$f":"IF($X$2,SUMIFS('Track by Mode'!V:V,'Track by Mode'!$C:$C,\"=\"&$C77,'Track by Mode'!$AI:$AI,\"=No\"),SUMIFS('Track by Mode'!V:V,'Track by Mode'!$C:$C,\"=\"&$C77))","v":0},{"$f":"IF($X$2,SUMIFS('Track by Mode'!X:X,'Track by Mode'!$C:$C,\"=\"&$C77,'Track by Mode'!$AI:$AI,\"=No\"),SUMIFS('Track by Mode'!X:X,'Track by Mode'!$C:$C,\"=\"&$C77))","v":21.1},{"$f":"IF($X$2,SUMIFS('Track by Mode'!Z:Z,'Track by Mode'!$C:$C,\"=\"&$C77,'Track by Mode'!$AI:$AI,\"=No\"),SUMIFS('Track by Mode'!Z:Z,'Track by Mode'!$C:$C,\"=\"&$C77))","v":106.4},{"$f":"IF($X$2,SUMIFS('Track by Mode'!AC:AC,'Track by Mode'!$C:$C,\"=\"&$C77,'Track by Mode'!$AI:$AI,\"=No\"),SUMIFS('Track by Mode'!AC:AC,'Track by Mode'!$C:$C,\"=\"&$C77))","v":0},{"$f":"IF($X$2,SUMIFS('Track by Mode'!AE:AE,'Track by Mode'!$C:$C,\"=\"&$C77,'Track by Mode'!$AI:$AI,\"=No\"),SUMIFS('Track by Mode'!AE:AE,'Track by Mode'!$C:$C,\"=\"&$C77))","v":33},{"$f":"IF($X$2,SUMIFS('Track by Mode'!AG:AG,'Track by Mode'!$C:$C,\"=\"&$C77,'Track by Mode'!$AI:$AI,\"=No\"),SUMIFS('Track by Mode'!AG:AG,'Track by Mode'!$C:$C,\"=\"&$C77))","v":33},{"$f":"IF($X$2,SUMIFS('Roadway by Mode'!N:N,'Roadway by Mode'!$C:$C,\"=\"&$C77,'Roadway by Mode'!$V:$V,\"=No\"),SUMIFS('Roadway by Mode'!N:N,'Roadway by Mode'!$C:$C,\"=\"&$C77))","v":0.2},{"$f":"IF($X$2,SUMIFS('Roadway by Mode'!P:P,'Roadway by Mode'!$C:$C,\"=\"&$C77,'Roadway by Mode'!$V:$V,\"=No\"),SUMIFS('Roadway by Mode'!P:P,'Roadway by Mode'!$C:$C,\"=\"&$C77))","v":150.4},{"$f":"IF($X$2,SUMIFS('Roadway by Mode'!R:R,'Roadway by Mode'!$C:$C,\"=\"&$C77,'Roadway by Mode'!$V:$V,\"=No\"),SUMIFS('Roadway by Mode'!R:R,'Roadway by Mode'!$C:$C,\"=\"&$C77))","v":33},{"$f":"IF($X$2,SUMIFS('Roadway by Mode'!T:T,'Roadway by Mode'!$C:$C,\"=\"&$C77,'Roadway by Mode'!$V:$V,\"=No\"),SUMIFS('Roadway by Mode'!T:T,'Roadway by Mode'!$C:$C,\"=\"&$C77))","v":183.60000000000002}]
[null,null,"GU","Guam",null,{"$f":"IF($X$2,SUMIFS('Track by Mode'!L:L,'Track by Mode'!$C:$C,\"=\"&$C78,'Track by Mode'!$AI:$AI,\"=No\"),SUMIFS('Track by Mode'!L:L,'Track by Mode'!$C:$C,\"=\"&$C78))+IF($X$2,SUMIFS('Roadway by Mode'!L:L,'Roadway by Mode'!$C:$C,\"=\"&$C78,'Roadway by Mode'!$V:$V,\"=No\"),SUMIFS('Roadway by Mode'!L:L,'Roadway by Mode'!$C:$C,\"=\"&$C78))","v":0},{"$f":"IF($X$2,SUMIFS('Track by Mode'!N:N,'Track by Mode'!$C:$C,\"=\"&$C78,'Track by Mode'!$AI:$AI,\"=No\"),SUMIFS('Track by Mode'!N:N,'Track by Mode'!$C:$C,\"=\"&$C78))","v":0},{"$f":"IF($X$2,SUMIFS('Track by Mode'!P:P,'Track by Mode'!$C:$C,\"=\"&$C78,'Track by Mode'!$AI:$AI,\"=No\"),SUMIFS('Track by Mode'!P:P,'Track by Mode'!$C:$C,\"=\"&$C78))","v":0},{"$f":"IF($X$2,SUMIFS('Track by Mode'!R:R,'Track by Mode'!$C:$C,\"=\"&$C78,'Track by Mode'!$AI:$AI,\"=No\"),SUMIFS('Track by Mode'!R:R,'Track by Mode'!$C:$C,\"=\"&$C78))","v":0},{"$f":"IF($X$2,SUMIFS('Track by Mode'!T:T,'Track by Mode'!$C:$C,\"=\"&$C78,'Track by Mode'!$AI:$AI,\"=No\"),SUMIFS('Track by Mode'!T:T,'Track by Mode'!$C:$C,\"=\"&$C78))","v":0},{"$f":"IF($X$2,SUMIFS('Track by Mode'!V:V,'Track by Mode'!$C:$C,\"=\"&$C78,'Track by Mode'!$AI:$AI,\"=No\"),SUMIFS('Track by Mode'!V:V,'Track by Mode'!$C:$C,\"=\"&$C78))","v":0},{"$f":"IF($X$2,SUMIFS('Track by Mode'!X:X,'Track by Mode'!$C:$C,\"=\"&$C78,'Track by Mode'!$AI:$AI,\"=No\"),SUMIFS('Track by Mode'!X:X,'Track by Mode'!$C:$C,\"=\"&$C78))","v":0},{"$f":"IF($X$2,SUMIFS('Track by Mode'!Z:Z,'Track by Mode'!$C:$C,\"=\"&$C78,'Track by Mode'!$AI:$AI,\"=No\"),SUMIFS('Track by Mode'!Z:Z,'Track by Mode'!$C:$C,\"=\"&$C78))","v":0},{"$f":"IF($X$2,SUMIFS('Track by Mode'!AC:AC,'Track by Mode'!$C:$C,\"=\"&$C78,'Track by Mode'!$AI:$AI,\"=No\"),SUMIFS('Track by Mode'!AC:AC,'Track by Mode'!$C:$C,\"=\"&$C78))","v":0},{"$f":"IF($X$2,SUMIFS('Track by Mode'!AE:AE,'Track by Mode'!$C:$C,\"=\"&$C78,'Track by Mode'!$AI:$AI,\"=No\"),SUMIFS('Track by Mode'!AE:AE,'Track by Mode'!$C:$C,\"=\"&$C78))","v":0},{"$f":"IF($X$2,SUMIFS('Track by Mode'!AG:AG,'Track by Mode'!$C:$C,\"=\"&$C78,'Track by Mode'!$AI:$AI,\"=No\"),SUMIFS('Track by Mode'!AG:AG,'Track by Mode'!$C:$C,\"=\"&$C78))","v":0},{"$f":"IF($X$2,SUMIFS('Roadway by Mode'!N:N,'Roadway by Mode'!$C:$C,\"=\"&$C78,'Roadway by Mode'!$V:$V,\"=No\"),SUMIFS('Roadway by Mode'!N:N,'Roadway by Mode'!$C:$C,\"=\"&$C78))","v":0},{"$f":"IF($X$2,SUMIFS('Roadway by Mode'!P:P,'Roadway by Mode'!$C:$C,\"=\"&$C78,'Roadway by Mode'!$V:$V,\"=No\"),SUMIFS('Roadway by Mode'!P:P,'Roadway by Mode'!$C:$C,\"=\"&$C78))","v":0},{"$f":"IF($X$2,SUMIFS('Roadway by Mode'!R:R,'Roadway by Mode'!$C:$C,\"=\"&$C78,'Roadway by Mode'!$V:$V,\"=No\"),SUMIFS('Roadway by Mode'!R:R,'Roadway by Mode'!$C:$C,\"=\"&$C78))","v":0},{"$f":"IF($X$2,SUMIFS('Roadway by Mode'!T:T,'Roadway by Mode'!$C:$C,\"=\"&$C78,'Roadway by Mode'!$V:$V,\"=No\"),SUMIFS('Roadway by Mode'!T:T,'Roadway by Mode'!$C:$C,\"=\"&$C78))","v":0}]
[null,null,"HI","Hawaii",null,{"$f":"IF($X$2,SUMIFS('Track by Mode'!L:L,'Track by Mode'!$C:$C,\"=\"&$C79,'Track by Mode'!$AI:$AI,\"=No\"),SUMIFS('Track by Mode'!L:L,'Track by Mode'!$C:$C,\"=\"&$C79))+IF($X$2,SUMIFS('Roadway by Mode'!L:L,'Roadway by Mode'!$C:$C,\"=\"&$C79,'Roadway by Mode'!$V:$V,\"=No\"),SUMIFS('Roadway by Mode'!L:L,'Roadway by Mode'!$C:$C,\"=\"&$C79))","v":467},{"$f":"IF($X$2,SUMIFS('Track by Mode'!N:N,'Track by Mode'!$C:$C,\"=\"&$C79,'Track by Mode'!$AI:$AI,\"=No\"),SUMIFS('Track by Mode'!N:N,'Track by Mode'!$C:$C,\"=\"&$C79))","v":0},{"$f":"IF($X$2,SUMIFS('Track by Mode'!P:P,'Track by Mode'!$C:$C,\"=\"&$C79,'Track by Mode'!$AI:$AI,\"=No\"),SUMIFS('Track by Mode'!P:P,'Track by Mode'!$C:$C,\"=\"&$C79))","v":0},{"$f":"IF($X$2,SUMIFS('Track by Mode'!R:R,'Track by Mode'!$C:$C,\"=\"&$C79,'Track by Mode'!$AI:$AI,\"=No\"),SUMIFS('Track by Mode'!R:R,'Track by Mode'!$C:$C,\"=\"&$C79))","v":0},{"$f":"IF($X$2,SUMIFS('Track by Mode'!T:T,'Track by Mode'!$C:$C,\"=\"&$C79,'Track by Mode'!$AI:$AI,\"=No\"),SUMIFS('Track by Mode'!T:T,'Track by Mode'!$C:$C,\"=\"&$C79))","v":0},{"$f":"IF($X$2,SUMIFS('Track by Mode'!V:V,'Track by Mode'!$C:$C,\"=\"&$C79,'Track by Mode'!$AI:$AI,\"=No\"),SUMIFS('Track by Mode'!V:V,'Track by Mode'!$C:$C,\"=\"&$C79))","v":0},{"$f":"IF($X$2,SUMIFS('Track by Mode'!X:X,'Track by Mode'!$C:$C,\"=\"&$C79,'Track by Mode'!$AI:$AI,\"=No\"),SUMIFS('Track by Mode'!X:X,'Track by Mode'!$C:$C,\"=\"&$C79))","v":0},{"$f":"IF($X$2,SUMIFS('Track by Mode'!Z:Z,'Track by Mode'!$C:$C,\"=\"&$C79,'Track by Mode'!$AI:$AI,\"=No\"),SUMIFS('Track by Mode'!Z:Z,'Track by Mode'!$C:$C,\"=\"&$C79))","v":0},{"$f":"IF($X$2,SUMIFS('Track by Mode'!AC:AC,'Track by Mode'!$C:$C,\"=\"&$C79,'Track by Mode'!$AI:$AI,\"=No\"),SUMIFS('Track by Mode'!AC:AC,'Track by Mode'!$C:$C,\"=\"&$C79))","v":0},{"$f":"IF($X$2,SUMIFS('Track by Mode'!AE:AE,'Track by Mode'!$C:$C,\"=\"&$C79,'Track by Mode'!$AI:$AI,\"=No\"),SUMIFS('Track by Mode'!AE:AE,'Track by Mode'!$C:$C,\"=\"&$C79))","v":0},{"$f":"IF($X$2,SUMIFS('Track by Mode'!AG:AG,'Track by Mode'!$C:$C,\"=\"&$C79,'Track by Mode'!$AI:$AI,\"=No\"),SUMIFS('Track by Mode'!AG:AG,'Track by Mode'!$C:$C,\"=\"&$C79))","v":0},{"$f":"IF($X$2,SUMIFS('Roadway by Mode'!N:N,'Roadway by Mode'!$C:$C,\"=\"&$C79,'Roadway by Mode'!$V:$V,\"=No\"),SUMIFS('Roadway by Mode'!N:N,'Roadway by Mode'!$C:$C,\"=\"&$C79))","v":1.2},{"$f":"IF($X$2,SUMIFS('Roadway by Mode'!P:P,'Roadway by Mode'!$C:$C,\"=\"&$C79,'Roadway by Mode'!$V:$V,\"=No\"),SUMIFS('Roadway by Mode'!P:P,'Roadway by Mode'!$C:$C,\"=\"&$C79))","v":0},{"$f":"IF($X$2,SUMIFS('Roadway by Mode'!R:R,'Roadway by Mode'!$C:$C,\"=\"&$C79,'Roadway by Mode'!$V:$V,\"=No\"),SUMIFS('Roadway by Mode'!R:R,'Roadway by Mode'!$C:$C,\"=\"&$C79))","v":34.700000000000003},{"$f":"IF($X$2,SUMIFS('Roadway by Mode'!T:T,'Roadway by Mode'!$C:$C,\"=\"&$C79,'Roadway by Mode'!$V:$V,\"=No\"),SUMIFS('Roadway by Mode'!T:T,'Roadway by Mode'!$C:$C,\"=\"&$C79))","v":35.900000000000006}]
[null,null,"IA","Iowa",null,{"$f":"IF($X$2,SUMIFS('Track by Mode'!L:L,'Track by Mode'!$C:$C,\"=\"&$C80,'Track by Mode'!$AI:$AI,\"=No\"),SUMIFS('Track by Mode'!L:L,'Track by Mode'!$C:$C,\"=\"&$C80))+IF($X$2,SUMIFS('Roadway by Mode'!L:L,'Roadway by Mode'!$C:$C,\"=\"&$C80,'Roadway by Mode'!$V:$V,\"=No\"),SUMIFS('Roadway by Mode'!L:L,'Roadway by Mode'!$C:$C,\"=\"&$C80))","v":289},{"$f":"IF($X$2,SUMIFS('Track by Mode'!N:N,'Track by Mode'!$C:$C,\"=\"&$C80,'Track by Mode'!$AI:$AI,\"=No\"),SUMIFS('Track by Mode'!N:N,'Track by Mode'!$C:$C,\"=\"&$C80))","v":0},{"$f":"IF($X$2,SUMIFS('Track by Mode'!P:P,'Track by Mode'!$C:$C,\"=\"&$C80,'Track by Mode'!$AI:$AI,\"=No\"),SUMIFS('Track by Mode'!P:P,'Track by Mode'!$C:$C,\"=\"&$C80))","v":0},{"$f":"IF($X$2,SUMIFS('Track by Mode'!R:R,'Track by Mode'!$C:$C,\"=\"&$C80,'Track by Mode'!$AI:$AI,\"=No\"),SUMIFS('Track by Mode'!R:R,'Track by Mode'!$C:$C,\"=\"&$C80))","v":0},{"$f":"IF($X$2,SUMIFS('Track by Mode'!T:T,'Track by Mode'!$C:$C,\"=\"&$C80,'Track by Mode'!$AI:$AI,\"=No\"),SUMIFS('Track by Mode'!T:T,'Track by Mode'!$C:$C,\"=\"&$C80))","v":0},{"$f":"IF($X$2,SUMIFS('Track by Mode'!V:V,'Track by Mode'!$C:$C,\"=\"&$C80,'Track by Mode'!$AI:$AI,\"=No\"),SUMIFS('Track by Mode'!V:V,'Track by Mode'!$C:$C,\"=\"&$C80))","v":0},{"$f":"IF($X$2,SUMIFS('Track by Mode'!X:X,'Track by Mode'!$C:$C,\"=\"&$C80,'Track by Mode'!$AI:$AI,\"=No\"),SUMIFS('Track by Mode'!X:X,'Track by Mode'!$C:$C,\"=\"&$C80))","v":0},{"$f":"IF($X$2,SUMIFS('Track by Mode'!Z:Z,'Track by Mode'!$C:$C,\"=\"&$C80,'Track by Mode'!$AI:$AI,\"=No\"),SUMIFS('Track by Mode'!Z:Z,'Track by Mode'!$C:$C,\"=\"&$C80))","v":0},{"$f":"IF($X$2,SUMIFS('Track by Mode'!AC:AC,'Track by Mode'!$C:$C,\"=\"&$C80,'Track by Mode'!$AI:$AI,\"=No\"),SUMIFS('Track by Mode'!AC:AC,'Track by Mode'!$C:$C,\"=\"&$C80))","v":0},{"$f":"IF($X$2,SUMIFS('Track by Mode'!AE:AE,'Track by Mode'!$C:$C,\"=\"&$C80,'Track by Mode'!$AI:$AI,\"=No\"),SUMIFS('Track by Mode'!AE:AE,'Track by Mode'!$C:$C,\"=\"&$C80))","v":0},{"$f":"IF($X$2,SUMIFS('Track by Mode'!AG:AG,'Track by Mode'!$C:$C,\"=\"&$C80,'Track by Mode'!$AI:$AI,\"=No\"),SUMIFS('Track by Mode'!AG:AG,'Track by Mode'!$C:$C,\"=\"&$C80))","v":0},{"$f":"IF($X$2,SUMIFS('Roadway by Mode'!N:N,'Roadway by Mode'!$C:$C,\"=\"&$C80,'Roadway by Mode'!$V:$V,\"=No\"),SUMIFS('Roadway by Mode'!N:N,'Roadway by Mode'!$C:$C,\"=\"&$C80))","v":0},{"$f":"IF($X$2,SUMIFS('Roadway by Mode'!P:P,'Roadway by Mode'!$C:$C,\"=\"&$C80,'Roadway by Mode'!$V:$V,\"=No\"),SUMIFS('Roadway by Mode'!P:P,'Roadway by Mode'!$C:$C,\"=\"&$C80))","v":0},{"$f":"IF($X$2,SUMIFS('Roadway by Mode'!R:R,'Roadway by Mode'!$C:$C,\"=\"&$C80,'Roadway by Mode'!$V:$V,\"=No\"),SUMIFS('Roadway by Mode'!R:R,'Roadway by Mode'!$C:$C,\"=\"&$C80))","v":0},{"$f":"IF($X$2,SUMIFS('Roadway by Mode'!T:T,'Roadway by Mode'!$C:$C,\"=\"&$C80,'Roadway by Mode'!$V:$V,\"=No\"),SUMIFS('Roadway by Mode'!T:T,'Roadway by Mode'!$C:$C,\"=\"&$C80))","v":0}]
[null,null,"ID","Idaho",null,{"$f":"IF($X$2,SUMIFS('Track by Mode'!L:L,'Track by Mode'!$C:$C,\"=\"&$C81,'Track by Mode'!$AI:$AI,\"=No\"),SUMIFS('Track by Mode'!L:L,'Track by Mode'!$C:$C,\"=\"&$C81))+IF($X$2,SUMIFS('Roadway by Mode'!L:L,'Roadway by Mode'!$C:$C,\"=\"&$C81,'Roadway by Mode'!$V:$V,\"=No\"),SUMIFS('Roadway by Mode'!L:L,'Roadway by Mode'!$C:$C,\"=\"&$C81))","v":44},{"$f":"IF($X$2,SUMIFS('Track by Mode'!N:N,'Track by Mode'!$C:$C,\"=\"&$C81,'Track by Mode'!$AI:$AI,\"=No\"),SUMIFS('Track by Mode'!N:N,'Track by Mode'!$C:$C,\"=\"&$C81))","v":0},{"$f":"IF($X$2,SUMIFS('Track by Mode'!P:P,'Track by Mode'!$C:$C,\"=\"&$C81,'Track by Mode'!$AI:$AI,\"=No\"),SUMIFS('Track by Mode'!P:P,'Track by Mode'!$C:$C,\"=\"&$C81))","v":0},{"$f":"IF($X$2,SUMIFS('Track by Mode'!R:R,'Track by Mode'!$C:$C,\"=\"&$C81,'Track by Mode'!$AI:$AI,\"=No\"),SUMIFS('Track by Mode'!R:R,'Track by Mode'!$C:$C,\"=\"&$C81))","v":0},{"$f":"IF($X$2,SUMIFS('Track by Mode'!T:T,'Track by Mode'!$C:$C,\"=\"&$C81,'Track by Mode'!$AI:$AI,\"=No\"),SUMIFS('Track by Mode'!T:T,'Track by Mode'!$C:$C,\"=\"&$C81))","v":0},{"$f":"IF($X$2,SUMIFS('Track by Mode'!V:V,'Track by Mode'!$C:$C,\"=\"&$C81,'Track by Mode'!$AI:$AI,\"=No\"),SUMIFS('Track by Mode'!V:V,'Track by Mode'!$C:$C,\"=\"&$C81))","v":0},{"$f":"IF($X$2,SUMIFS('Track by Mode'!X:X,'Track by Mode'!$C:$C,\"=\"&$C81,'Track by Mode'!$AI:$AI,\"=No\"),SUMIFS('Track by Mode'!X:X,'Track by Mode'!$C:$C,\"=\"&$C81))","v":0},{"$f":"IF($X$2,SUMIFS('Track by Mode'!Z:Z,'Track by Mode'!$C:$C,\"=\"&$C81,'Track by Mode'!$AI:$AI,\"=No\"),SUMIFS('Track by Mode'!Z:Z,'Track by Mode'!$C:$C,\"=\"&$C81))","v":0},{"$f":"IF($X$2,SUMIFS('Track by Mode'!AC:AC,'Track by Mode'!$C:$C,\"=\"&$C81,'Track by Mode'!$AI:$AI,\"=No\"),SUMIFS('Track by Mode'!AC:AC,'Track by Mode'!$C:$C,\"=\"&$C81))","v":0},{"$f":"IF($X$2,SUMIFS('Track by Mode'!AE:AE,'Track by Mode'!$C:$C,\"=\"&$C81,'Track by Mode'!$AI:$AI,\"=No\"),SUMIFS('Track by Mode'!AE:AE,'Track by Mode'!$C:$C,\"=\"&$C81))","v":0},{"$f":"IF($X$2,SUMIFS('Track by Mode'!AG:AG,'Track by Mode'!$C:$C,\"=\"&$C81,'Track by Mode'!$AI:$AI,\"=No\"),SUMIFS('Track by Mode'!AG:AG,'Track by Mode'!$C:$C,\"=\"&$C81))","v":0},{"$f":"IF($X$2,SUMIFS('Roadway by Mode'!N:N,'Roadway by Mode'!$C:$C,\"=\"&$C81,'Roadway by Mode'!$V:$V,\"=No\"),SUMIFS('Roadway by Mode'!N:N,'Roadway by Mode'!$C:$C,\"=\"&$C81))","v":0},{"$f":"IF($X$2,SUMIFS('Roadway by Mode'!P:P,'Roadway by Mode'!$C:$C,\"=\"&$C81,'Roadway by Mode'!$V:$V,\"=No\"),SUMIFS('Roadway by Mode'!P:P,'Roadway by Mode'!$C:$C,\"=\"&$C81))","v":0},{"$f":"IF($X$2,SUMIFS('Roadway by Mode'!R:R,'Roadway by Mode'!$C:$C,\"=\"&$C81,'Roadway by Mode'!$V:$V,\"=No\"),SUMIFS('Roadway by Mode'!R:R,'Roadway by Mode'!$C:$C,\"=\"&$C81))","v":0},{"$f":"IF($X$2,SUMIFS('Roadway by Mode'!T:T,'Roadway by Mode'!$C:$C,\"=\"&$C81,'Roadway by Mode'!$V:$V,\"=No\"),SUMIFS('Roadway by Mode'!T:T,'Roadway by Mode'!$C:$C,\"=\"&$C81))","v":0}]
[null,null,"IL","Illinois",null,{"$f":"IF($X$2,SUMIFS('Track by Mode'!L:L,'Track by Mode'!$C:$C,\"=\"&$C82,'Track by Mode'!$AI:$AI,\"=No\"),SUMIFS('Track by Mode'!L:L,'Track by Mode'!$C:$C,\"=\"&$C82))+IF($X$2,SUMIFS('Roadway by Mode'!L:L,'Roadway by Mode'!$C:$C,\"=\"&$C82,'Roadway by Mode'!$V:$V,\"=No\"),SUMIFS('Roadway by Mode'!L:L,'Roadway by Mode'!$C:$C,\"=\"&$C82))","v":4914},{"$f":"IF($X$2,SUMIFS('Track by Mode'!N:N,'Track by Mode'!$C:$C,\"=\"&$C82,'Track by Mode'!$AI:$AI,\"=No\"),SUMIFS('Track by Mode'!N:N,'Track by Mode'!$C:$C,\"=\"&$C82))","v":941.5},{"$f":"IF($X$2,SUMIFS('Track by Mode'!P:P,'Track by Mode'!$C:$C,\"=\"&$C82,'Track by Mode'!$AI:$AI,\"=No\"),SUMIFS('Track by Mode'!P:P,'Track by Mode'!$C:$C,\"=\"&$C82))","v":0},{"$f":"IF($X$2,SUMIFS('Track by Mode'!R:R,'Track by Mode'!$C:$C,\"=\"&$C82,'Track by Mode'!$AI:$AI,\"=No\"),SUMIFS('Track by Mode'!R:R,'Track by Mode'!$C:$C,\"=\"&$C82))","v":116.5},{"$f":"IF($X$2,SUMIFS('Track by Mode'!T:T,'Track by Mode'!$C:$C,\"=\"&$C82,'Track by Mode'!$AI:$AI,\"=No\"),SUMIFS('Track by Mode'!T:T,'Track by Mode'!$C:$C,\"=\"&$C82))","v":360.6},{"$f":"IF($X$2,SUMIFS('Track by Mode'!V:V,'Track by Mode'!$C:$C,\"=\"&$C82,'Track by Mode'!$AI:$AI,\"=No\"),SUMIFS('Track by Mode'!V:V,'Track by Mode'!$C:$C,\"=\"&$C82))","v":51.6},{"$f":"IF($X$2,SUMIFS('Track by Mode'!X:X,'Track by Mode'!$C:$C,\"=\"&$C82,'Track by Mode'!$AI:$AI,\"=No\"),SUMIFS('Track by Mode'!X:X,'Track by Mode'!$C:$C,\"=\"&$C82))","v":23.5},{"$f":"IF($X$2,SUMIFS('Track by Mode'!Z:Z,'Track by Mode'!$C:$C,\"=\"&$C82,'Track by Mode'!$AI:$AI,\"=No\"),SUMIFS('Track by Mode'!Z:Z,'Track by Mode'!$C:$C,\"=\"&$C82))","v":1493.7},{"$f":"IF($X$2,SUMIFS('Track by Mode'!AC:AC,'Track by Mode'!$C:$C,\"=\"&$C82,'Track by Mode'!$AI:$AI,\"=No\"),SUMIFS('Track by Mode'!AC:AC,'Track by Mode'!$C:$C,\"=\"&$C82))","v":593},{"$f":"IF($X$2,SUMIFS('Track by Mode'!AE:AE,'Track by Mode'!$C:$C,\"=\"&$C82,'Track by Mode'!$AI:$AI,\"=No\"),SUMIFS('Track by Mode'!AE:AE,'Track by Mode'!$C:$C,\"=\"&$C82))","v":0},{"$f":"IF($X$2,SUMIFS('Track by Mode'!AG:AG,'Track by Mode'!$C:$C,\"=\"&$C82,'Track by Mode'!$AI:$AI,\"=No\"),SUMIFS('Track by Mode'!AG:AG,'Track by Mode'!$C:$C,\"=\"&$C82))","v":593},{"$f":"IF($X$2,SUMIFS('Roadway by Mode'!N:N,'Roadway by Mode'!$C:$C,\"=\"&$C82,'Roadway by Mode'!$V:$V,\"=No\"),SUMIFS('Roadway by Mode'!N:N,'Roadway by Mode'!$C:$C,\"=\"&$C82))","v":3.8},{"$f":"IF($X$2,SUMIFS('Roadway by Mode'!P:P,'Roadway by Mode'!$C:$C,\"=\"&$C82,'Roadway by Mode'!$V:$V,\"=No\"),SUMIFS('Roadway by Mode'!P:P,'Roadway by Mode'!$C:$C,\"=\"&$C82))","v":0},{"$f":"IF($X$2,SUMIFS('Roadway by Mode'!R:R,'Roadway by Mode'!$C:$C,\"=\"&$C82,'Roadway by Mode'!$V:$V,\"=No\"),SUMIFS('Roadway by Mode'!R:R,'Roadway by Mode'!$C:$C,\"=\"&$C82))","v":0},{"$f":"IF($X$2,SUMIFS('Roadway by Mode'!T:T,'Roadway by Mode'!$C:$C,\"=\"&$C82,'Roadway by Mode'!$V:$V,\"=No\"),SUMIFS('Roadway by Mode'!T:T,'Roadway by Mode'!$C:$C,\"=\"&$C82))","v":3.8}]
[null,null,"IN","Indiana",null,{"$f":"IF($X$2,SUMIFS('Track by Mode'!L:L,'Track by Mode'!$C:$C,\"=\"&$C83,'Track by Mode'!$AI:$AI,\"=No\"),SUMIFS('Track by Mode'!L:L,'Track by Mode'!$C:$C,\"=\"&$C83))+IF($X$2,SUMIFS('Roadway by Mode'!L:L,'Roadway by Mode'!$C:$C,\"=\"&$C83,'Roadway by Mode'!$V:$V,\"=No\"),SUMIFS('Roadway by Mode'!L:L,'Roadway by Mode'!$C:$C,\"=\"&$C83))","v":446},{"$f":"IF($X$2,SUMIFS('Track by Mode'!N:N,'Track by Mode'!$C:$C,\"=\"&$C83,'Track by Mode'!$AI:$AI,\"=No\"),SUMIFS('Track by Mode'!N:N,'Track by Mode'!$C:$C,\"=\"&$C83))","v":95.6},{"$f":"IF($X$2,SUMIFS('Track by Mode'!P:P,'Track by Mode'!$C:$C,\"=\"&$C83,'Track by Mode'!$AI:$AI,\"=No\"),SUMIFS('Track by Mode'!P:P,'Track by Mode'!$C:$C,\"=\"&$C83))","v":2},{"$f":"IF($X$2,SUMIFS('Track by Mode'!R:R,'Track by Mode'!$C:$C,\"=\"&$C83,'Track by Mode'!$AI:$AI,\"=No\"),SUMIFS('Track by Mode'!R:R,'Track by Mode'!$C:$C,\"=\"&$C83))","v":0},{"$f":"IF($X$2,SUMIFS('Track by Mode'!T:T,'Track by Mode'!$C:$C,\"=\"&$C83,'Track by Mode'!$AI:$AI,\"=No\"),SUMIFS('Track by Mode'!T:T,'Track by Mode'!$C:$C,\"=\"&$C83))","v":32.799999999999997},{"$f":"IF($X$2,SUMIFS('Track by Mode'!V:V,'Track by Mode'!$C:$C,\"=\"&$C83,'Track by Mode'!$AI:$AI,\"=No\"),SUMIFS('Track by Mode'!V:V,'Track by Mode'!$C:$C,\"=\"&$C83))","v":0},{"$f":"IF($X$2,SUMIFS('Track by Mode'!X:X,'Track by Mode'!$C:$C,\"=\"&$C83,'Track by Mode'!$AI:$AI,\"=No\"),SUMIFS('Track by Mode'!X:X,'Track by Mode'!$C:$C,\"=\"&$C83))","v":0},{"$f":"IF($X$2,SUMIFS('Track by Mode'!Z:Z,'Track by Mode'!$C:$C,\"=\"&$C83,'Track by Mode'!$AI:$AI,\"=No\"),SUMIFS('Track by Mode'!Z:Z,'Track by Mode'!$C:$C,\"=\"&$C83))","v":130.39999999999998},{"$f":"IF($X$2,SUMIFS('Track by Mode'!AC:AC,'Track by Mode'!$C:$C,\"=\"&$C83,'Track by Mode'!$AI:$AI,\"=No\"),SUMIFS('Track by Mode'!AC:AC,'Track by Mode'!$C:$C,\"=\"&$C83))","v":85},{"$f":"IF($X$2,SUMIFS('Track by Mode'!AE:AE,'Track by Mode'!$C:$C,\"=\"&$C83,'Track by Mode'!$AI:$AI,\"=No\"),SUMIFS('Track by Mode'!AE:AE,'Track by Mode'!$C:$C,\"=\"&$C83))","v":32},{"$f":"IF($X$2,SUMIFS('Track by Mode'!AG:AG,'Track by Mode'!$C:$C,\"=\"&$C83,'Track by Mode'!$AI:$AI,\"=No\"),SUMIFS('Track by Mode'!AG:AG,'Track by Mode'!$C:$C,\"=\"&$C83))","v":117},{"$f":"IF($X$2,SUMIFS('Roadway by Mode'!N:N,'Roadway by Mode'!$C:$C,\"=\"&$C83,'Roadway by Mode'!$V:$V,\"=No\"),SUMIFS('Roadway by Mode'!N:N,'Roadway by Mode'!$C:$C,\"=\"&$C83))","v":0},{"$f":"IF($X$2,SUMIFS('Roadway by Mode'!P:P,'Roadway by Mode'!$C:$C,\"=\"&$C83,'Roadway by Mode'!$V:$V,\"=No\"),SUMIFS('Roadway by Mode'!P:P,'Roadway by Mode'!$C:$C,\"=\"&$C83))","v":0},{"$f":"IF($X$2,SUMIFS('Roadway by Mode'!R:R,'Roadway by Mode'!$C:$C,\"=\"&$C83,'Roadway by Mode'!$V:$V,\"=No\"),SUMIFS('Roadway by Mode'!R:R,'Roadway by Mode'!$C:$C,\"=\"&$C83))","v":0},{"$f":"IF($X$2,SUMIFS('Roadway by Mode'!T:T,'Roadway by Mode'!$C:$C,\"=\"&$C83,'Roadway by Mode'!$V:$V,\"=No\"),SUMIFS('Roadway by Mode'!T:T,'Roadway by Mode'!$C:$C,\"=\"&$C83))","v":0}]
[null,null,"KS","Kansas",null,{"$f":"IF($X$2,SUMIFS('Track by Mode'!L:L,'Track by Mode'!$C:$C,\"=\"&$C84,'Track by Mode'!$AI:$AI,\"=No\"),SUMIFS('Track by Mode'!L:L,'Track by Mode'!$C:$C,\"=\"&$C84))+IF($X$2,SUMIFS('Roadway by Mode'!L:L,'Roadway by Mode'!$C:$C,\"=\"&$C84,'Roadway by Mode'!$V:$V,\"=No\"),SUMIFS('Roadway by Mode'!L:L,'Roadway by Mode'!$C:$C,\"=\"&$C84))","v":140},{"$f":"IF($X$2,SUMIFS('Track by Mode'!N:N,'Track by Mode'!$C:$C,\"=\"&$C84,'Track by Mode'!$AI:$AI,\"=No\"),SUMIFS('Track by Mode'!N:N,'Track by Mode'!$C:$C,\"=\"&$C84))","v":0},{"$f":"IF($X$2,SUMIFS('Track by Mode'!P:P,'Track by Mode'!$C:$C,\"=\"&$C84,'Track by Mode'!$AI:$AI,\"=No\"),SUMIFS('Track by Mode'!P:P,'Track by Mode'!$C:$C,\"=\"&$C84))","v":0},{"$f":"IF($X$2,SUMIFS('Track by Mode'!R:R,'Track by Mode'!$C:$C,\"=\"&$C84,'Track by Mode'!$AI:$AI,\"=No\"),SUMIFS('Track by Mode'!R:R,'Track by Mode'!$C:$C,\"=\"&$C84))","v":0},{"$f":"IF($X$2,SUMIFS('Track by Mode'!T:T,'Track by Mode'!$C:$C,\"=\"&$C84,'Track by Mode'!$AI:$AI,\"=No\"),SUMIFS('Track by Mode'!T:T,'Track by Mode'!$C:$C,\"=\"&$C84))","v":0},{"$f":"IF($X$2,SUMIFS('Track by Mode'!V:V,'Track by Mode'!$C:$C,\"=\"&$C84,'Track by Mode'!$AI:$AI,\"=No\"),SUMIFS('Track by Mode'!V:V,'Track by Mode'!$C:$C,\"=\"&$C84))","v":0},{"$f":"IF($X$2,SUMIFS('Track by Mode'!X:X,'Track by Mode'!$C:$C,\"=\"&$C84,'Track by Mode'!$AI:$AI,\"=No\"),SUMIFS('Track by Mode'!X:X,'Track by Mode'!$C:$C,\"=\"&$C84))","v":0},{"$f":"IF($X$2,SUMIFS('Track by Mode'!Z:Z,'Track by Mode'!$C:$C,\"=\"&$C84,'Track by Mode'!$AI:$AI,\"=No\"),SUMIFS('Track by Mode'!Z:Z,'Track by Mode'!$C:$C,\"=\"&$C84))","v":0},{"$f":"IF($X$2,SUMIFS('Track by Mode'!AC:AC,'Track by Mode'!$C:$C,\"=\"&$C84,'Track by Mode'!$AI:$AI,\"=No\"),SUMIFS('Track by Mode'!AC:AC,'Track by Mode'!$C:$C,\"=\"&$C84))","v":0},{"$f":"IF($X$2,SUMIFS('Track by Mode'!AE:AE,'Track by Mode'!$C:$C,\"=\"&$C84,'Track by Mode'!$AI:$AI,\"=No\"),SUMIFS('Track by Mode'!AE:AE,'Track by Mode'!$C:$C,\"=\"&$C84))","v":0},{"$f":"IF($X$2,SUMIFS('Track by Mode'!AG:AG,'Track by Mode'!$C:$C,\"=\"&$C84,'Track by Mode'!$AI:$AI,\"=No\"),SUMIFS('Track by Mode'!AG:AG,'Track by Mode'!$C:$C,\"=\"&$C84))","v":0},{"$f":"IF($X$2,SUMIFS('Roadway by Mode'!N:N,'Roadway by Mode'!$C:$C,\"=\"&$C84,'Roadway by Mode'!$V:$V,\"=No\"),SUMIFS('Roadway by Mode'!N:N,'Roadway by Mode'!$C:$C,\"=\"&$C84))","v":0},{"$f":"IF($X$2,SUMIFS('Roadway by Mode'!P:P,'Roadway by Mode'!$C:$C,\"=\"&$C84,'Roadway by Mode'!$V:$V,\"=No\"),SUMIFS('Roadway by Mode'!P:P,'Roadway by Mode'!$C:$C,\"=\"&$C84))","v":0},{"$f":"IF($X$2,SUMIFS('Roadway by Mode'!R:R,'Roadway by Mode'!$C:$C,\"=\"&$C84,'Roadway by Mode'!$V:$V,\"=No\"),SUMIFS('Roadway by Mode'!R:R,'Roadway by Mode'!$C:$C,\"=\"&$C84))","v":0},{"$f":"IF($X$2,SUMIFS('Roadway by Mode'!T:T,'Roadway by Mode'!$C:$C,\"=\"&$C84,'Roadway by Mode'!$V:$V,\"=No\"),SUMIFS('Roadway by Mode'!T:T,'Roadway by Mode'!$C:$C,\"=\"&$C84))","v":0}]
[null,null,"KY","Kentucky",null,{"$f":"IF($X$2,SUMIFS('Track by Mode'!L:L,'Track by Mode'!$C:$C,\"=\"&$C85,'Track by Mode'!$AI:$AI,\"=No\"),SUMIFS('Track by Mode'!L:L,'Track by Mode'!$C:$C,\"=\"&$C85))+IF($X$2,SUMIFS('Roadway by Mode'!L:L,'Roadway by Mode'!$C:$C,\"=\"&$C85,'Roadway by Mode'!$V:$V,\"=No\"),SUMIFS('Roadway by Mode'!L:L,'Roadway by Mode'!$C:$C,\"=\"&$C85))","v":321},{"$f":"IF($X$2,SUMIFS('Track by Mode'!N:N,'Track by Mode'!$C:$C,\"=\"&$C85,'Track by Mode'!$AI:$AI,\"=No\"),SUMIFS('Track by Mode'!N:N,'Track by Mode'!$C:$C,\"=\"&$C85))","v":0},{"$f":"IF($X$2,SUMIFS('Track by Mode'!P:P,'Track by Mode'!$C:$C,\"=\"&$C85,'Track by Mode'!$AI:$AI,\"=No\"),SUMIFS('Track by Mode'!P:P,'Track by Mode'!$C:$C,\"=\"&$C85))","v":0},{"$f":"IF($X$2,SUMIFS('Track by Mode'!R:R,'Track by Mode'!$C:$C,\"=\"&$C85,'Track by Mode'!$AI:$AI,\"=No\"),SUMIFS('Track by Mode'!R:R,'Track by Mode'!$C:$C,\"=\"&$C85))","v":0},{"$f":"IF($X$2,SUMIFS('Track by Mode'!T:T,'Track by Mode'!$C:$C,\"=\"&$C85,'Track by Mode'!$AI:$AI,\"=No\"),SUMIFS('Track by Mode'!T:T,'Track by Mode'!$C:$C,\"=\"&$C85))","v":0},{"$f":"IF($X$2,SUMIFS('Track by Mode'!V:V,'Track by Mode'!$C:$C,\"=\"&$C85,'Track by Mode'!$AI:$AI,\"=No\"),SUMIFS('Track by Mode'!V:V,'Track by Mode'!$C:$C,\"=\"&$C85))","v":0},{"$f":"IF($X$2,SUMIFS('Track by Mode'!X:X,'Track by Mode'!$C:$C,\"=\"&$C85,'Track by Mode'!$AI:$AI,\"=No\"),SUMIFS('Track by Mode'!X:X,'Track by Mode'!$C:$C,\"=\"&$C85))","v":0},{"$f":"IF($X$2,SUMIFS('Track by Mode'!Z:Z,'Track by Mode'!$C:$C,\"=\"&$C85,'Track by Mode'!$AI:$AI,\"=No\"),SUMIFS('Track by Mode'!Z:Z,'Track by Mode'!$C:$C,\"=\"&$C85))","v":0},{"$f":"IF($X$2,SUMIFS('Track by Mode'!AC:AC,'Track by Mode'!$C:$C,\"=\"&$C85,'Track by Mode'!$AI:$AI,\"=No\"),SUMIFS('Track by Mode'!AC:AC,'Track by Mode'!$C:$C,\"=\"&$C85))","v":0},{"$f":"IF($X$2,SUMIFS('Track by Mode'!AE:AE,'Track by Mode'!$C:$C,\"=\"&$C85,'Track by Mode'!$AI:$AI,\"=No\"),SUMIFS('Track by Mode'!AE:AE,'Track by Mode'!$C:$C,\"=\"&$C85))","v":0},{"$f":"IF($X$2,SUMIFS('Track by Mode'!AG:AG,'Track by Mode'!$C:$C,\"=\"&$C85,'Track by Mode'!$AI:$AI,\"=No\"),SUMIFS('Track by Mode'!AG:AG,'Track by Mode'!$C:$C,\"=\"&$C85))","v":0},{"$f":"IF($X$2,SUMIFS('Roadway by Mode'!N:N,'Roadway by Mode'!$C:$C,\"=\"&$C85,'Roadway by Mode'!$V:$V,\"=No\"),SUMIFS('Roadway by Mode'!N:N,'Roadway by Mode'!$C:$C,\"=\"&$C85))","v":0},{"$f":"IF($X$2,SUMIFS('Roadway by Mode'!P:P,'Roadway by Mode'!$C:$C,\"=\"&$C85,'Roadway by Mode'!$V:$V,\"=No\"),SUMIFS('Roadway by Mode'!P:P,'Roadway by Mode'!$C:$C,\"=\"&$C85))","v":0},{"$f":"IF($X$2,SUMIFS('Roadway by Mode'!R:R,'Roadway by Mode'!$C:$C,\"=\"&$C85,'Roadway by Mode'!$V:$V,\"=No\"),SUMIFS('Roadway by Mode'!R:R,'Roadway by Mode'!$C:$C,\"=\"&$C85))","v":0},{"$f":"IF($X$2,SUMIFS('Roadway by Mode'!T:T,'Roadway by Mode'!$C:$C,\"=\"&$C85,'Roadway by Mode'!$V:$V,\"=No\"),SUMIFS('Roadway by Mode'!T:T,'Roadway by Mode'!$C:$C,\"=\"&$C85))","v":0}]
[null,null,"LA","Lousiana",null,{"$f":"IF($X$2,SUMIFS('Track by Mode'!L:L,'Track by Mode'!$C:$C,\"=\"&$C86,'Track by Mode'!$AI:$AI,\"=No\"),SUMIFS('Track by Mode'!L:L,'Track by Mode'!$C:$C,\"=\"&$C86))+IF($X$2,SUMIFS('Roadway by Mode'!L:L,'Roadway by Mode'!$C:$C,\"=\"&$C86,'Roadway by Mode'!$V:$V,\"=No\"),SUMIFS('Roadway by Mode'!L:L,'Roadway by Mode'!$C:$C,\"=\"&$C86))","v":278},{"$f":"IF($X$2,SUMIFS('Track by Mode'!N:N,'Track by Mode'!$C:$C,\"=\"&$C86,'Track by Mode'!$AI:$AI,\"=No\"),SUMIFS('Track by Mode'!N:N,'Track by Mode'!$C:$C,\"=\"&$C86))","v":18.600000000000001},{"$f":"IF($X$2,SUMIFS('Track by Mode'!P:P,'Track by Mode'!$C:$C,\"=\"&$C86,'Track by Mode'!$AI:$AI,\"=No\"),SUMIFS('Track by Mode'!P:P,'Track by Mode'!$C:$C,\"=\"&$C86))","v":0},{"$f":"IF($X$2,SUMIFS('Track by Mode'!R:R,'Track by Mode'!$C:$C,\"=\"&$C86,'Track by Mode'!$AI:$AI,\"=No\"),SUMIFS('Track by Mode'!R:R,'Track by Mode'!$C:$C,\"=\"&$C86))","v":0},{"$f":"IF($X$2,SUMIFS('Track by Mode'!T:T,'Track by Mode'!$C:$C,\"=\"&$C86,'Track by Mode'!$AI:$AI,\"=No\"),SUMIFS('Track by Mode'!T:T,'Track by Mode'!$C:$C,\"=\"&$C86))","v":0},{"$f":"IF($X$2,SUMIFS('Track by Mode'!V:V,'Track by Mode'!$C:$C,\"=\"&$C86,'Track by Mode'!$AI:$AI,\"=No\"),SUMIFS('Track by Mode'!V:V,'Track by Mode'!$C:$C,\"=\"&$C86))","v":0},{"$f":"IF($X$2,SUMIFS('Track by Mode'!X:X,'Track by Mode'!$C:$C,\"=\"&$C86,'Track by Mode'!$AI:$AI,\"=No\"),SUMIFS('Track by Mode'!X:X,'Track by Mode'!$C:$C,\"=\"&$C86))","v":0},{"$f":"IF($X$2,SUMIFS('Track by Mode'!Z:Z,'Track by Mode'!$C:$C,\"=\"&$C86,'Track by Mode'!$AI:$AI,\"=No\"),SUMIFS('Track by Mode'!Z:Z,'Track by Mode'!$C:$C,\"=\"&$C86))","v":18.600000000000001},{"$f":"IF($X$2,SUMIFS('Track by Mode'!AC:AC,'Track by Mode'!$C:$C,\"=\"&$C86,'Track by Mode'!$AI:$AI,\"=No\"),SUMIFS('Track by Mode'!AC:AC,'Track by Mode'!$C:$C,\"=\"&$C86))","v":247},{"$f":"IF($X$2,SUMIFS('Track by Mode'!AE:AE,'Track by Mode'!$C:$C,\"=\"&$C86,'Track by Mode'!$AI:$AI,\"=No\"),SUMIFS('Track by Mode'!AE:AE,'Track by Mode'!$C:$C,\"=\"&$C86))","v":0},{"$f":"IF($X$2,SUMIFS('Track by Mode'!AG:AG,'Track by Mode'!$C:$C,\"=\"&$C86,'Track by Mode'!$AI:$AI,\"=No\"),SUMIFS('Track by Mode'!AG:AG,'Track by Mode'!$C:$C,\"=\"&$C86))","v":247},{"$f":"IF($X$2,SUMIFS('Roadway by Mode'!N:N,'Roadway by Mode'!$C:$C,\"=\"&$C86,'Roadway by Mode'!$V:$V,\"=No\"),SUMIFS('Roadway by Mode'!N:N,'Roadway by Mode'!$C:$C,\"=\"&$C86))","v":0},{"$f":"IF($X$2,SUMIFS('Roadway by Mode'!P:P,'Roadway by Mode'!$C:$C,\"=\"&$C86,'Roadway by Mode'!$V:$V,\"=No\"),SUMIFS('Roadway by Mode'!P:P,'Roadway by Mode'!$C:$C,\"=\"&$C86))","v":7},{"$f":"IF($X$2,SUMIFS('Roadway by Mode'!R:R,'Roadway by Mode'!$C:$C,\"=\"&$C86,'Roadway by Mode'!$V:$V,\"=No\"),SUMIFS('Roadway by Mode'!R:R,'Roadway by Mode'!$C:$C,\"=\"&$C86))","v":7},{"$f":"IF($X$2,SUMIFS('Roadway by Mode'!T:T,'Roadway by Mode'!$C:$C,\"=\"&$C86,'Roadway by Mode'!$V:$V,\"=No\"),SUMIFS('Roadway by Mode'!T:T,'Roadway by Mode'!$C:$C,\"=\"&$C86))","v":14}]
[null,null,"MA","Massachusetts",null,{"$f":"IF($X$2,SUMIFS('Track by Mode'!L:L,'Track by Mode'!$C:$C,\"=\"&$C87,'Track by Mode'!$AI:$AI,\"=No\"),SUMIFS('Track by Mode'!L:L,'Track by Mode'!$C:$C,\"=\"&$C87))+IF($X$2,SUMIFS('Roadway by Mode'!L:L,'Roadway by Mode'!$C:$C,\"=\"&$C87,'Roadway by Mode'!$V:$V,\"=No\"),SUMIFS('Roadway by Mode'!L:L,'Roadway by Mode'!$C:$C,\"=\"&$C87))","v":2308},{"$f":"IF($X$2,SUMIFS('Track by Mode'!N:N,'Track by Mode'!$C:$C,\"=\"&$C87,'Track by Mode'!$AI:$AI,\"=No\"),SUMIFS('Track by Mode'!N:N,'Track by Mode'!$C:$C,\"=\"&$C87))","v":823},{"$f":"IF($X$2,SUMIFS('Track by Mode'!P:P,'Track by Mode'!$C:$C,\"=\"&$C87,'Track by Mode'!$AI:$AI,\"=No\"),SUMIFS('Track by Mode'!P:P,'Track by Mode'!$C:$C,\"=\"&$C87))","v":2},{"$f":"IF($X$2,SUMIFS('Track by Mode'!R:R,'Track by Mode'!$C:$C,\"=\"&$C87,'Track by Mode'!$AI:$AI,\"=No\"),SUMIFS('Track by Mode'!R:R,'Track by Mode'!$C:$C,\"=\"&$C87))","v":8},{"$f":"IF($X$2,SUMIFS('Track by Mode'!T:T,'Track by Mode'!$C:$C,\"=\"&$C87,'Track by Mode'!$AI:$AI,\"=No\"),SUMIFS('Track by Mode'!T:T,'Track by Mode'!$C:$C,\"=\"&$C87))","v":0},{"$f":"IF($X$2,SUMIFS('Track by Mode'!V:V,'Track by Mode'!$C:$C,\"=\"&$C87,'Track by Mode'!$AI:$AI,\"=No\"),SUMIFS('Track by Mode'!V:V,'Track by Mode'!$C:$C,\"=\"&$C87))","v":10},{"$f":"IF($X$2,SUMIFS('Track by Mode'!X:X,'Track by Mode'!$C:$C,\"=\"&$C87,'Track by Mode'!$AI:$AI,\"=No\"),SUMIFS('Track by Mode'!X:X,'Track by Mode'!$C:$C,\"=\"&$C87))","v":54.5},{"$f":"IF($X$2,SUMIFS('Track by Mode'!Z:Z,'Track by Mode'!$C:$C,\"=\"&$C87,'Track by Mode'!$AI:$AI,\"=No\"),SUMIFS('Track by Mode'!Z:Z,'Track by Mode'!$C:$C,\"=\"&$C87))","v":897.5},{"$f":"IF($X$2,SUMIFS('Track by Mode'!AC:AC,'Track by Mode'!$C:$C,\"=\"&$C87,'Track by Mode'!$AI:$AI,\"=No\"),SUMIFS('Track by Mode'!AC:AC,'Track by Mode'!$C:$C,\"=\"&$C87))","v":314},{"$f":"IF($X$2,SUMIFS('Track by Mode'!AE:AE,'Track by Mode'!$C:$C,\"=\"&$C87,'Track by Mode'!$AI:$AI,\"=No\"),SUMIFS('Track by Mode'!AE:AE,'Track by Mode'!$C:$C,\"=\"&$C87))","v":9},{"$f":"IF($X$2,SUMIFS('Track by Mode'!AG:AG,'Track by Mode'!$C:$C,\"=\"&$C87,'Track by Mode'!$AI:$AI,\"=No\"),SUMIFS('Track by Mode'!AG:AG,'Track by Mode'!$C:$C,\"=\"&$C87))","v":323},{"$f":"IF($X$2,SUMIFS('Roadway by Mode'!N:N,'Roadway by Mode'!$C:$C,\"=\"&$C87,'Roadway by Mode'!$V:$V,\"=No\"),SUMIFS('Roadway by Mode'!N:N,'Roadway by Mode'!$C:$C,\"=\"&$C87))","v":11.4},{"$f":"IF($X$2,SUMIFS('Roadway by Mode'!P:P,'Roadway by Mode'!$C:$C,\"=\"&$C87,'Roadway by Mode'!$V:$V,\"=No\"),SUMIFS('Roadway by Mode'!P:P,'Roadway by Mode'!$C:$C,\"=\"&$C87))","v":0},{"$f":"IF($X$2,SUMIFS('Roadway by Mode'!R:R,'Roadway by Mode'!$C:$C,\"=\"&$C87,'Roadway by Mode'!$V:$V,\"=No\"),SUMIFS('Roadway by Mode'!R:R,'Roadway by Mode'!$C:$C,\"=\"&$C87))","v":1.6},{"$f":"IF($X$2,SUMIFS('Roadway by Mode'!T:T,'Roadway by Mode'!$C:$C,\"=\"&$C87,'Roadway by Mode'!$V:$V,\"=No\"),SUMIFS('Roadway by Mode'!T:T,'Roadway by Mode'!$C:$C,\"=\"&$C87))","v":13}]
[null,null,"MD","Maryland",null,{"$f":"IF($X$2,SUMIFS('Track by Mode'!L:L,'Track by Mode'!$C:$C,\"=\"&$C88,'Track by Mode'!$AI:$AI,\"=No\"),SUMIFS('Track by Mode'!L:L,'Track by Mode'!$C:$C,\"=\"&$C88))+IF($X$2,SUMIFS('Roadway by Mode'!L:L,'Roadway by Mode'!$C:$C,\"=\"&$C88,'Roadway by Mode'!$V:$V,\"=No\"),SUMIFS('Roadway by Mode'!L:L,'Roadway by Mode'!$C:$C,\"=\"&$C88))","v":1470},{"$f":"IF($X$2,SUMIFS('Track by Mode'!N:N,'Track by Mode'!$C:$C,\"=\"&$C88,'Track by Mode'!$AI:$AI,\"=No\"),SUMIFS('Track by Mode'!N:N,'Track by Mode'!$C:$C,\"=\"&$C88))","v":538.70000000000005},{"$f":"IF($X$2,SUMIFS('Track by Mode'!P:P,'Track by Mode'!$C:$C,\"=\"&$C88,'Track by Mode'!$AI:$AI,\"=No\"),SUMIFS('Track by Mode'!P:P,'Track by Mode'!$C:$C,\"=\"&$C88))","v":3},{"$f":"IF($X$2,SUMIFS('Track by Mode'!R:R,'Track by Mode'!$C:$C,\"=\"&$C88,'Track by Mode'!$AI:$AI,\"=No\"),SUMIFS('Track by Mode'!R:R,'Track by Mode'!$C:$C,\"=\"&$C88))","v":9.9},{"$f":"IF($X$2,SUMIFS('Track by Mode'!T:T,'Track by Mode'!$C:$C,\"=\"&$C88,'Track by Mode'!$AI:$AI,\"=No\"),SUMIFS('Track by Mode'!T:T,'Track by Mode'!$C:$C,\"=\"&$C88))","v":0},{"$f":"IF($X$2,SUMIFS('Track by Mode'!V:V,'Track by Mode'!$C:$C,\"=\"&$C88,'Track by Mode'!$AI:$AI,\"=No\"),SUMIFS('Track by Mode'!V:V,'Track by Mode'!$C:$C,\"=\"&$C88))","v":0},{"$f":"IF($X$2,SUMIFS('Track by Mode'!X:X,'Track by Mode'!$C:$C,\"=\"&$C88,'Track by Mode'!$AI:$AI,\"=No\"),SUMIFS('Track by Mode'!X:X,'Track by Mode'!$C:$C,\"=\"&$C88))","v":11},{"$f":"IF($X$2,SUMIFS('Track by Mode'!Z:Z,'Track by Mode'!$C:$C,\"=\"&$C88,'Track by Mode'!$AI:$AI,\"=No\"),SUMIFS('Track by Mode'!Z:Z,'Track by Mode'!$C:$C,\"=\"&$C88))","v":562.6},{"$f":"IF($X$2,SUMIFS('Track by Mode'!AC:AC,'Track by Mode'!$C:$C,\"=\"&$C88,'Track by Mode'!$AI:$AI,\"=No\"),SUMIFS('Track by Mode'!AC:AC,'Track by Mode'!$C:$C,\"=\"&$C88))","v":75},{"$f":"IF($X$2,SUMIFS('Track by Mode'!AE:AE,'Track by Mode'!$C:$C,\"=\"&$C88,'Track by Mode'!$AI:$AI,\"=No\"),SUMIFS('Track by Mode'!AE:AE,'Track by Mode'!$C:$C,\"=\"&$C88))","v":17},{"$f":"IF($X$2,SUMIFS('Track by Mode'!AG:AG,'Track by Mode'!$C:$C,\"=\"&$C88,'Track by Mode'!$AI:$AI,\"=No\"),SUMIFS('Track by Mode'!AG:AG,'Track by Mode'!$C:$C,\"=\"&$C88))","v":92},{"$f":"IF($X$2,SUMIFS('Roadway by Mode'!N:N,'Roadway by Mode'!$C:$C,\"=\"&$C88,'Roadway by Mode'!$V:$V,\"=No\"),SUMIFS('Roadway by Mode'!N:N,'Roadway by Mode'!$C:$C,\"=\"&$C88))","v":14.8},{"$f":"IF($X$2,SUMIFS('Roadway by Mode'!P:P,'Roadway by Mode'!$C:$C,\"=\"&$C88,'Roadway by Mode'!$V:$V,\"=No\"),SUMIFS('Roadway by Mode'!P:P,'Roadway by Mode'!$C:$C,\"=\"&$C88))","v":0},{"$f":"IF($X$2,SUMIFS('Roadway by Mode'!R:R,'Roadway by Mode'!$C:$C,\"=\"&$C88,'Roadway by Mode'!$V:$V,\"=No\"),SUMIFS('Roadway by Mode'!R:R,'Roadway by Mode'!$C:$C,\"=\"&$C88))","v":17},{"$f":"IF($X$2,SUMIFS('Roadway by Mode'!T:T,'Roadway by Mode'!$C:$C,\"=\"&$C88,'Roadway by Mode'!$V:$V,\"=No\"),SUMIFS('Roadway by Mode'!T:T,'Roadway by Mode'!$C:$C,\"=\"&$C88))","v":31.8}]
[null,null,"ME","Maine",null,{"$f":"IF($X$2,SUMIFS('Track by Mode'!L:L,'Track by Mode'!$C:$C,\"=\"&$C89,'Track by Mode'!$AI:$AI,\"=No\"),SUMIFS('Track by Mode'!L:L,'Track by Mode'!$C:$C,\"=\"&$C89))+IF($X$2,SUMIFS('Roadway by Mode'!L:L,'Roadway by Mode'!$C:$C,\"=\"&$C89,'Roadway by Mode'!$V:$V,\"=No\"),SUMIFS('Roadway by Mode'!L:L,'Roadway by Mode'!$C:$C,\"=\"&$C89))","v":46},{"$f":"IF($X$2,SUMIFS('Track by Mode'!N:N,'Track by Mode'!$C:$C,\"=\"&$C89,'Track by Mode'!$AI:$AI,\"=No\"),SUMIFS('Track by Mode'!N:N,'Track by Mode'!$C:$C,\"=\"&$C89))","v":142.6},{"$f":"IF($X$2,SUMIFS('Track by Mode'!P:P,'Track by Mode'!$C:$C,\"=\"&$C89,'Track by Mode'!$AI:$AI,\"=No\"),SUMIFS('Track by Mode'!P:P,'Track by Mode'!$C:$C,\"=\"&$C89))","v":0},{"$f":"IF($X$2,SUMIFS('Track by Mode'!R:R,'Track by Mode'!$C:$C,\"=\"&$C89,'Track by Mode'!$AI:$AI,\"=No\"),SUMIFS('Track by Mode'!R:R,'Track by Mode'!$C:$C,\"=\"&$C89))","v":0},{"$f":"IF($X$2,SUMIFS('Track by Mode'!T:T,'Track by Mode'!$C:$C,\"=\"&$C89,'Track by Mode'!$AI:$AI,\"=No\"),SUMIFS('Track by Mode'!T:T,'Track by Mode'!$C:$C,\"=\"&$C89))","v":0},{"$f":"IF($X$2,SUMIFS('Track by Mode'!V:V,'Track by Mode'!$C:$C,\"=\"&$C89,'Track by Mode'!$AI:$AI,\"=No\"),SUMIFS('Track by Mode'!V:V,'Track by Mode'!$C:$C,\"=\"&$C89))","v":0},{"$f":"IF($X$2,SUMIFS('Track by Mode'!X:X,'Track by Mode'!$C:$C,\"=\"&$C89,'Track by Mode'!$AI:$AI,\"=No\"),SUMIFS('Track by Mode'!X:X,'Track by Mode'!$C:$C,\"=\"&$C89))","v":0},{"$f":"IF($X$2,SUMIFS('Track by Mode'!Z:Z,'Track by Mode'!$C:$C,\"=\"&$C89,'Track by Mode'!$AI:$AI,\"=No\"),SUMIFS('Track by Mode'!Z:Z,'Track by Mode'!$C:$C,\"=\"&$C89))","v":142.6},{"$f":"IF($X$2,SUMIFS('Track by Mode'!AC:AC,'Track by Mode'!$C:$C,\"=\"&$C89,'Track by Mode'!$AI:$AI,\"=No\"),SUMIFS('Track by Mode'!AC:AC,'Track by Mode'!$C:$C,\"=\"&$C89))","v":103},{"$f":"IF($X$2,SUMIFS('Track by Mode'!AE:AE,'Track by Mode'!$C:$C,\"=\"&$C89,'Track by Mode'!$AI:$AI,\"=No\"),SUMIFS('Track by Mode'!AE:AE,'Track by Mode'!$C:$C,\"=\"&$C89))","v":0},{"$f":"IF($X$2,SUMIFS('Track by Mode'!AG:AG,'Track by Mode'!$C:$C,\"=\"&$C89,'Track by Mode'!$AI:$AI,\"=No\"),SUMIFS('Track by Mode'!AG:AG,'Track by Mode'!$C:$C,\"=\"&$C89))","v":103},{"$f":"IF($X$2,SUMIFS('Roadway by Mode'!N:N,'Roadway by Mode'!$C:$C,\"=\"&$C89,'Roadway by Mode'!$V:$V,\"=No\"),SUMIFS('Roadway by Mode'!N:N,'Roadway by Mode'!$C:$C,\"=\"&$C89))","v":0},{"$f":"IF($X$2,SUMIFS('Roadway by Mode'!P:P,'Roadway by Mode'!$C:$C,\"=\"&$C89,'Roadway by Mode'!$V:$V,\"=No\"),SUMIFS('Roadway by Mode'!P:P,'Roadway by Mode'!$C:$C,\"=\"&$C89))","v":0},{"$f":"IF($X$2,SUMIFS('Roadway by Mode'!R:R,'Roadway by Mode'!$C:$C,\"=\"&$C89,'Roadway by Mode'!$V:$V,\"=No\"),SUMIFS('Roadway by Mode'!R:R,'Roadway by Mode'!$C:$C,\"=\"&$C89))","v":0},{"$f":"IF($X$2,SUMIFS('Roadway by Mode'!T:T,'Roadway by Mode'!$C:$C,\"=\"&$C89,'Roadway by Mode'!$V:$V,\"=No\"),SUMIFS('Roadway by Mode'!T:T,'Roadway by Mode'!$C:$C,\"=\"&$C89))","v":0}]
[null,null,"MI","Michigan",null,{"$f":"IF($X$2,SUMIFS('Track by Mode'!L:L,'Track by Mode'!$C:$C,\"=\"&$C90,'Track by Mode'!$AI:$AI,\"=No\"),SUMIFS('Track by Mode'!L:L,'Track by Mode'!$C:$C,\"=\"&$C90))+IF($X$2,SUMIFS('Roadway by Mode'!L:L,'Roadway by Mode'!$C:$C,\"=\"&$C90,'Roadway by Mode'!$V:$V,\"=No\"),SUMIFS('Roadway by Mode'!L:L,'Roadway by Mode'!$C:$C,\"=\"&$C90))","v":994},{"$f":"IF($X$2,SUMIFS('Track by Mode'!N:N,'Track by Mode'!$C:$C,\"=\"&$C90,'Track by Mode'!$AI:$AI,\"=No\"),SUMIFS('Track by Mode'!N:N,'Track by Mode'!$C:$C,\"=\"&$C90))","v":0},{"$f":"IF($X$2,SUMIFS('Track by Mode'!P:P,'Track by Mode'!$C:$C,\"=\"&$C90,'Track by Mode'!$AI:$AI,\"=No\"),SUMIFS('Track by Mode'!P:P,'Track by Mode'!$C:$C,\"=\"&$C90))","v":0},{"$f":"IF($X$2,SUMIFS('Track by Mode'!R:R,'Track by Mode'!$C:$C,\"=\"&$C90,'Track by Mode'!$AI:$AI,\"=No\"),SUMIFS('Track by Mode'!R:R,'Track by Mode'!$C:$C,\"=\"&$C90))","v":2.9},{"$f":"IF($X$2,SUMIFS('Track by Mode'!T:T,'Track by Mode'!$C:$C,\"=\"&$C90,'Track by Mode'!$AI:$AI,\"=No\"),SUMIFS('Track by Mode'!T:T,'Track by Mode'!$C:$C,\"=\"&$C90))","v":0},{"$f":"IF($X$2,SUMIFS('Track by Mode'!V:V,'Track by Mode'!$C:$C,\"=\"&$C90,'Track by Mode'!$AI:$AI,\"=No\"),SUMIFS('Track by Mode'!V:V,'Track by Mode'!$C:$C,\"=\"&$C90))","v":0},{"$f":"IF($X$2,SUMIFS('Track by Mode'!X:X,'Track by Mode'!$C:$C,\"=\"&$C90,'Track by Mode'!$AI:$AI,\"=No\"),SUMIFS('Track by Mode'!X:X,'Track by Mode'!$C:$C,\"=\"&$C90))","v":0},{"$f":"IF($X$2,SUMIFS('Track by Mode'!Z:Z,'Track by Mode'!$C:$C,\"=\"&$C90,'Track by Mode'!$AI:$AI,\"=No\"),SUMIFS('Track by Mode'!Z:Z,'Track by Mode'!$C:$C,\"=\"&$C90))","v":2.9},{"$f":"IF($X$2,SUMIFS('Track by Mode'!AC:AC,'Track by Mode'!$C:$C,\"=\"&$C90,'Track by Mode'!$AI:$AI,\"=No\"),SUMIFS('Track by Mode'!AC:AC,'Track by Mode'!$C:$C,\"=\"&$C90))","v":0},{"$f":"IF($X$2,SUMIFS('Track by Mode'!AE:AE,'Track by Mode'!$C:$C,\"=\"&$C90,'Track by Mode'!$AI:$AI,\"=No\"),SUMIFS('Track by Mode'!AE:AE,'Track by Mode'!$C:$C,\"=\"&$C90))","v":0},{"$f":"IF($X$2,SUMIFS('Track by Mode'!AG:AG,'Track by Mode'!$C:$C,\"=\"&$C90,'Track by Mode'!$AI:$AI,\"=No\"),SUMIFS('Track by Mode'!AG:AG,'Track by Mode'!$C:$C,\"=\"&$C90))","v":0},{"$f":"IF($X$2,SUMIFS('Roadway by Mode'!N:N,'Roadway by Mode'!$C:$C,\"=\"&$C90,'Roadway by Mode'!$V:$V,\"=No\"),SUMIFS('Roadway by Mode'!N:N,'Roadway by Mode'!$C:$C,\"=\"&$C90))","v":9.5},{"$f":"IF($X$2,SUMIFS('Roadway by Mode'!P:P,'Roadway by Mode'!$C:$C,\"=\"&$C90,'Roadway by Mode'!$V:$V,\"=No\"),SUMIFS('Roadway by Mode'!P:P,'Roadway by Mode'!$C:$C,\"=\"&$C90))","v":0},{"$f":"IF($X$2,SUMIFS('Roadway by Mode'!R:R,'Roadway by Mode'!$C:$C,\"=\"&$C90,'Roadway by Mode'!$V:$V,\"=No\"),SUMIFS('Roadway by Mode'!R:R,'Roadway by Mode'!$C:$C,\"=\"&$C90))","v":0},{"$f":"IF($X$2,SUMIFS('Roadway by Mode'!T:T,'Roadway by Mode'!$C:$C,\"=\"&$C90,'Roadway by Mode'!$V:$V,\"=No\"),SUMIFS('Roadway by Mode'!T:T,'Roadway by Mode'!$C:$C,\"=\"&$C90))","v":9.5}]
[null,null,"MN","Minnesota",null,{"$f":"IF($X$2,SUMIFS('Track by Mode'!L:L,'Track by Mode'!$C:$C,\"=\"&$C91,'Track by Mode'!$AI:$AI,\"=No\"),SUMIFS('Track by Mode'!L:L,'Track by Mode'!$C:$C,\"=\"&$C91))+IF($X$2,SUMIFS('Roadway by Mode'!L:L,'Roadway by Mode'!$C:$C,\"=\"&$C91,'Roadway by Mode'!$V:$V,\"=No\"),SUMIFS('Roadway by Mode'!L:L,'Roadway by Mode'!$C:$C,\"=\"&$C91))","v":1311},{"$f":"IF($X$2,SUMIFS('Track by Mode'!N:N,'Track by Mode'!$C:$C,\"=\"&$C91,'Track by Mode'!$AI:$AI,\"=No\"),SUMIFS('Track by Mode'!N:N,'Track by Mode'!$C:$C,\"=\"&$C91))","v":111.7},{"$f":"IF($X$2,SUMIFS('Track by Mode'!P:P,'Track by Mode'!$C:$C,\"=\"&$C91,'Track by Mode'!$AI:$AI,\"=No\"),SUMIFS('Track by Mode'!P:P,'Track by Mode'!$C:$C,\"=\"&$C91))","v":0},{"$f":"IF($X$2,SUMIFS('Track by Mode'!R:R,'Track by Mode'!$C:$C,\"=\"&$C91,'Track by Mode'!$AI:$AI,\"=No\"),SUMIFS('Track by Mode'!R:R,'Track by Mode'!$C:$C,\"=\"&$C91))","v":3.3000000000000003},{"$f":"IF($X$2,SUMIFS('Track by Mode'!T:T,'Track by Mode'!$C:$C,\"=\"&$C91,'Track by Mode'!$AI:$AI,\"=No\"),SUMIFS('Track by Mode'!T:T,'Track by Mode'!$C:$C,\"=\"&$C91))","v":0.9},{"$f":"IF($X$2,SUMIFS('Track by Mode'!V:V,'Track by Mode'!$C:$C,\"=\"&$C91,'Track by Mode'!$AI:$AI,\"=No\"),SUMIFS('Track by Mode'!V:V,'Track by Mode'!$C:$C,\"=\"&$C91))","v":1},{"$f":"IF($X$2,SUMIFS('Track by Mode'!X:X,'Track by Mode'!$C:$C,\"=\"&$C91,'Track by Mode'!$AI:$AI,\"=No\"),SUMIFS('Track by Mode'!X:X,'Track by Mode'!$C:$C,\"=\"&$C91))","v":3.5},{"$f":"IF($X$2,SUMIFS('Track by Mode'!Z:Z,'Track by Mode'!$C:$C,\"=\"&$C91,'Track by Mode'!$AI:$AI,\"=No\"),SUMIFS('Track by Mode'!Z:Z,'Track by Mode'!$C:$C,\"=\"&$C91))","v":120.4},{"$f":"IF($X$2,SUMIFS('Track by Mode'!AC:AC,'Track by Mode'!$C:$C,\"=\"&$C91,'Track by Mode'!$AI:$AI,\"=No\"),SUMIFS('Track by Mode'!AC:AC,'Track by Mode'!$C:$C,\"=\"&$C91))","v":140},{"$f":"IF($X$2,SUMIFS('Track by Mode'!AE:AE,'Track by Mode'!$C:$C,\"=\"&$C91,'Track by Mode'!$AI:$AI,\"=No\"),SUMIFS('Track by Mode'!AE:AE,'Track by Mode'!$C:$C,\"=\"&$C91))","v":0},{"$f":"IF($X$2,SUMIFS('Track by Mode'!AG:AG,'Track by Mode'!$C:$C,\"=\"&$C91,'Track by Mode'!$AI:$AI,\"=No\"),SUMIFS('Track by Mode'!AG:AG,'Track by Mode'!$C:$C,\"=\"&$C91))","v":140},{"$f":"IF($X$2,SUMIFS('Roadway by Mode'!N:N,'Roadway by Mode'!$C:$C,\"=\"&$C91,'Roadway by Mode'!$V:$V,\"=No\"),SUMIFS('Roadway by Mode'!N:N,'Roadway by Mode'!$C:$C,\"=\"&$C91))","v":20.399999999999999},{"$f":"IF($X$2,SUMIFS('Roadway by Mode'!P:P,'Roadway by Mode'!$C:$C,\"=\"&$C91,'Roadway by Mode'!$V:$V,\"=No\"),SUMIFS('Roadway by Mode'!P:P,'Roadway by Mode'!$C:$C,\"=\"&$C91))","v":69.5},{"$f":"IF($X$2,SUMIFS('Roadway by Mode'!R:R,'Roadway by Mode'!$C:$C,\"=\"&$C91,'Roadway by Mode'!$V:$V,\"=No\"),SUMIFS('Roadway by Mode'!R:R,'Roadway by Mode'!$C:$C,\"=\"&$C91))","v":128},{"$f":"IF($X$2,SUMIFS('Roadway by Mode'!T:T,'Roadway by Mode'!$C:$C,\"=\"&$C91,'Roadway by Mode'!$V:$V,\"=No\"),SUMIFS('Roadway by Mode'!T:T,'Roadway by Mode'!$C:$C,\"=\"&$C91))","v":217.9}]
[null,null,"MO","Missouri",null,{"$f":"IF($X$2,SUMIFS('Track by Mode'!L:L,'Track by Mode'!$C:$C,\"=\"&$C92,'Track by Mode'!$AI:$AI,\"=No\"),SUMIFS('Track by Mode'!L:L,'Track by Mode'!$C:$C,\"=\"&$C92))+IF($X$2,SUMIFS('Roadway by Mode'!L:L,'Roadway by Mode'!$C:$C,\"=\"&$C92,'Roadway by Mode'!$V:$V,\"=No\"),SUMIFS('Roadway by Mode'!L:L,'Roadway by Mode'!$C:$C,\"=\"&$C92))","v":602},{"$f":"IF($X$2,SUMIFS('Track by Mode'!N:N,'Track by Mode'!$C:$C,\"=\"&$C92,'Track by Mode'!$AI:$AI,\"=No\"),SUMIFS('Track by Mode'!N:N,'Track by Mode'!$C:$C,\"=\"&$C92))","v":54.9},{"$f":"IF($X$2,SUMIFS('Track by Mode'!P:P,'Track by Mode'!$C:$C,\"=\"&$C92,'Track by Mode'!$AI:$AI,\"=No\"),SUMIFS('Track by Mode'!P:P,'Track by Mode'!$C:$C,\"=\"&$C92))","v":0},{"$f":"IF($X$2,SUMIFS('Track by Mode'!R:R,'Track by Mode'!$C:$C,\"=\"&$C92,'Track by Mode'!$AI:$AI,\"=No\"),SUMIFS('Track by Mode'!R:R,'Track by Mode'!$C:$C,\"=\"&$C92))","v":8.6},{"$f":"IF($X$2,SUMIFS('Track by Mode'!T:T,'Track by Mode'!$C:$C,\"=\"&$C92,'Track by Mode'!$AI:$AI,\"=No\"),SUMIFS('Track by Mode'!T:T,'Track by Mode'!$C:$C,\"=\"&$C92))","v":12.4},{"$f":"IF($X$2,SUMIFS('Track by Mode'!V:V,'Track by Mode'!$C:$C,\"=\"&$C92,'Track by Mode'!$AI:$AI,\"=No\"),SUMIFS('Track by Mode'!V:V,'Track by Mode'!$C:$C,\"=\"&$C92))","v":14.5},{"$f":"IF($X$2,SUMIFS('Track by Mode'!X:X,'Track by Mode'!$C:$C,\"=\"&$C92,'Track by Mode'!$AI:$AI,\"=No\"),SUMIFS('Track by Mode'!X:X,'Track by Mode'!$C:$C,\"=\"&$C92))","v":5.9},{"$f":"IF($X$2,SUMIFS('Track by Mode'!Z:Z,'Track by Mode'!$C:$C,\"=\"&$C92,'Track by Mode'!$AI:$AI,\"=No\"),SUMIFS('Track by Mode'!Z:Z,'Track by Mode'!$C:$C,\"=\"&$C92))","v":96.3},{"$f":"IF($X$2,SUMIFS('Track by Mode'!AC:AC,'Track by Mode'!$C:$C,\"=\"&$C92,'Track by Mode'!$AI:$AI,\"=No\"),SUMIFS('Track by Mode'!AC:AC,'Track by Mode'!$C:$C,\"=\"&$C92))","v":25},{"$f":"IF($X$2,SUMIFS('Track by Mode'!AE:AE,'Track by Mode'!$C:$C,\"=\"&$C92,'Track by Mode'!$AI:$AI,\"=No\"),SUMIFS('Track by Mode'!AE:AE,'Track by Mode'!$C:$C,\"=\"&$C92))","v":0},{"$f":"IF($X$2,SUMIFS('Track by Mode'!AG:AG,'Track by Mode'!$C:$C,\"=\"&$C92,'Track by Mode'!$AI:$AI,\"=No\"),SUMIFS('Track by Mode'!AG:AG,'Track by Mode'!$C:$C,\"=\"&$C92))","v":25},{"$f":"IF($X$2,SUMIFS('Roadway by Mode'!N:N,'Roadway by Mode'!$C:$C,\"=\"&$C92,'Roadway by Mode'!$V:$V,\"=No\"),SUMIFS('Roadway by Mode'!N:N,'Roadway by Mode'!$C:$C,\"=\"&$C92))","v":1},{"$f":"IF($X$2,SUMIFS('Roadway by Mode'!P:P,'Roadway by Mode'!$C:$C,\"=\"&$C92,'Roadway by Mode'!$V:$V,\"=No\"),SUMIFS('Roadway by Mode'!P:P,'Roadway by Mode'!$C:$C,\"=\"&$C92))","v":0},{"$f":"IF($X$2,SUMIFS('Roadway by Mode'!R:R,'Roadway by Mode'!$C:$C,\"=\"&$C92,'Roadway by Mode'!$V:$V,\"=No\"),SUMIFS('Roadway by Mode'!R:R,'Roadway by Mode'!$C:$C,\"=\"&$C92))","v":14.1},{"$f":"IF($X$2,SUMIFS('Roadway by Mode'!T:T,'Roadway by Mode'!$C:$C,\"=\"&$C92,'Roadway by Mode'!$V:$V,\"=No\"),SUMIFS('Roadway by Mode'!T:T,'Roadway by Mode'!$C:$C,\"=\"&$C92))","v":15.1}]
[null,null,"MP","Northern Marianas",null,{"$f":"IF($X$2,SUMIFS('Track by Mode'!L:L,'Track by Mode'!$C:$C,\"=\"&$C93,'Track by Mode'!$AI:$AI,\"=No\"),SUMIFS('Track by Mode'!L:L,'Track by Mode'!$C:$C,\"=\"&$C93))+IF($X$2,SUMIFS('Roadway by Mode'!L:L,'Roadway by Mode'!$C:$C,\"=\"&$C93,'Roadway by Mode'!$V:$V,\"=No\"),SUMIFS('Roadway by Mode'!L:L,'Roadway by Mode'!$C:$C,\"=\"&$C93))","v":0},{"$f":"IF($X$2,SUMIFS('Track by Mode'!N:N,'Track by Mode'!$C:$C,\"=\"&$C93,'Track by Mode'!$AI:$AI,\"=No\"),SUMIFS('Track by Mode'!N:N,'Track by Mode'!$C:$C,\"=\"&$C93))","v":0},{"$f":"IF($X$2,SUMIFS('Track by Mode'!P:P,'Track by Mode'!$C:$C,\"=\"&$C93,'Track by Mode'!$AI:$AI,\"=No\"),SUMIFS('Track by Mode'!P:P,'Track by Mode'!$C:$C,\"=\"&$C93))","v":0},{"$f":"IF($X$2,SUMIFS('Track by Mode'!R:R,'Track by Mode'!$C:$C,\"=\"&$C93,'Track by Mode'!$AI:$AI,\"=No\"),SUMIFS('Track by Mode'!R:R,'Track by Mode'!$C:$C,\"=\"&$C93))","v":0},{"$f":"IF($X$2,SUMIFS('Track by Mode'!T:T,'Track by Mode'!$C:$C,\"=\"&$C93,'Track by Mode'!$AI:$AI,\"=No\"),SUMIFS('Track by Mode'!T:T,'Track by Mode'!$C:$C,\"=\"&$C93))","v":0},{"$f":"IF($X$2,SUMIFS('Track by Mode'!V:V,'Track by Mode'!$C:$C,\"=\"&$C93,'Track by Mode'!$AI:$AI,\"=No\"),SUMIFS('Track by Mode'!V:V,'Track by Mode'!$C:$C,\"=\"&$C93))","v":0},{"$f":"IF($X$2,SUMIFS('Track by Mode'!X:X,'Track by Mode'!$C:$C,\"=\"&$C93,'Track by Mode'!$AI:$AI,\"=No\"),SUMIFS('Track by Mode'!X:X,'Track by Mode'!$C:$C,\"=\"&$C93))","v":0},{"$f":"IF($X$2,SUMIFS('Track by Mode'!Z:Z,'Track by Mode'!$C:$C,\"=\"&$C93,'Track by Mode'!$AI:$AI,\"=No\"),SUMIFS('Track by Mode'!Z:Z,'Track by Mode'!$C:$C,\"=\"&$C93))","v":0},{"$f":"IF($X$2,SUMIFS('Track by Mode'!AC:AC,'Track by Mode'!$C:$C,\"=\"&$C93,'Track by Mode'!$AI:$AI,\"=No\"),SUMIFS('Track by Mode'!AC:AC,'Track by Mode'!$C:$C,\"=\"&$C93))","v":0},{"$f":"IF($X$2,SUMIFS('Track by Mode'!AE:AE,'Track by Mode'!$C:$C,\"=\"&$C93,'Track by Mode'!$AI:$AI,\"=No\"),SUMIFS('Track by Mode'!AE:AE,'Track by Mode'!$C:$C,\"=\"&$C93))","v":0},{"$f":"IF($X$2,SUMIFS('Track by Mode'!AG:AG,'Track by Mode'!$C:$C,\"=\"&$C93,'Track by Mode'!$AI:$AI,\"=No\"),SUMIFS('Track by Mode'!AG:AG,'Track by Mode'!$C:$C,\"=\"&$C93))","v":0},{"$f":"IF($X$2,SUMIFS('Roadway by Mode'!N:N,'Roadway by Mode'!$C:$C,\"=\"&$C93,'Roadway by Mode'!$V:$V,\"=No\"),SUMIFS('Roadway by Mode'!N:N,'Roadway by Mode'!$C:$C,\"=\"&$C93))","v":0},{"$f":"IF($X$2,SUMIFS('Roadway by Mode'!P:P,'Roadway by Mode'!$C:$C,\"=\"&$C93,'Roadway by Mode'!$V:$V,\"=No\"),SUMIFS('Roadway by Mode'!P:P,'Roadway by Mode'!$C:$C,\"=\"&$C93))","v":0},{"$f":"IF($X$2,SUMIFS('Roadway by Mode'!R:R,'Roadway by Mode'!$C:$C,\"=\"&$C93,'Roadway by Mode'!$V:$V,\"=No\"),SUMIFS('Roadway by Mode'!R:R,'Roadway by Mode'!$C:$C,\"=\"&$C93))","v":0},{"$f":"IF($X$2,SUMIFS('Roadway by Mode'!T:T,'Roadway by Mode'!$C:$C,\"=\"&$C93,'Roadway by Mode'!$V:$V,\"=No\"),SUMIFS('Roadway by Mode'!T:T,'Roadway by Mode'!$C:$C,\"=\"&$C93))","v":0}]
[null,null,"MS","Mississippi",null,{"$f":"IF($X$2,SUMIFS('Track by Mode'!L:L,'Track by Mode'!$C:$C,\"=\"&$C94,'Track by Mode'!$AI:$AI,\"=No\"),SUMIFS('Track by Mode'!L:L,'Track by Mode'!$C:$C,\"=\"&$C94))+IF($X$2,SUMIFS('Roadway by Mode'!L:L,'Roadway by Mode'!$C:$C,\"=\"&$C94,'Roadway by Mode'!$V:$V,\"=No\"),SUMIFS('Roadway by Mode'!L:L,'Roadway by Mode'!$C:$C,\"=\"&$C94))","v":31},{"$f":"IF($X$2,SUMIFS('Track by Mode'!N:N,'Track by Mode'!$C:$C,\"=\"&$C94,'Track by Mode'!$AI:$AI,\"=No\"),SUMIFS('Track by Mode'!N:N,'Track by Mode'!$C:$C,\"=\"&$C94))","v":0},{"$f":"IF($X$2,SUMIFS('Track by Mode'!P:P,'Track by Mode'!$C:$C,\"=\"&$C94,'Track by Mode'!$AI:$AI,\"=No\"),SUMIFS('Track by Mode'!P:P,'Track by Mode'!$C:$C,\"=\"&$C94))","v":0},{"$f":"IF($X$2,SUMIFS('Track by Mode'!R:R,'Track by Mode'!$C:$C,\"=\"&$C94,'Track by Mode'!$AI:$AI,\"=No\"),SUMIFS('Track by Mode'!R:R,'Track by Mode'!$C:$C,\"=\"&$C94))","v":0},{"$f":"IF($X$2,SUMIFS('Track by Mode'!T:T,'Track by Mode'!$C:$C,\"=\"&$C94,'Track by Mode'!$AI:$AI,\"=No\"),SUMIFS('Track by Mode'!T:T,'Track by Mode'!$C:$C,\"=\"&$C94))","v":0},{"$f":"IF($X$2,SUMIFS('Track by Mode'!V:V,'Track by Mode'!$C:$C,\"=\"&$C94,'Track by Mode'!$AI:$AI,\"=No\"),SUMIFS('Track by Mode'!V:V,'Track by Mode'!$C:$C,\"=\"&$C94))","v":0},{"$f":"IF($X$2,SUMIFS('Track by Mode'!X:X,'Track by Mode'!$C:$C,\"=\"&$C94,'Track by Mode'!$AI:$AI,\"=No\"),SUMIFS('Track by Mode'!X:X,'Track by Mode'!$C:$C,\"=\"&$C94))","v":0},{"$f":"IF($X$2,SUMIFS('Track by Mode'!Z:Z,'Track by Mode'!$C:$C,\"=\"&$C94,'Track by Mode'!$AI:$AI,\"=No\"),SUMIFS('Track by Mode'!Z:Z,'Track by Mode'!$C:$C,\"=\"&$C94))","v":0},{"$f":"IF($X$2,SUMIFS('Track by Mode'!AC:AC,'Track by Mode'!$C:$C,\"=\"&$C94,'Track by Mode'!$AI:$AI,\"=No\"),SUMIFS('Track by Mode'!AC:AC,'Track by Mode'!$C:$C,\"=\"&$C94))","v":0},{"$f":"IF($X$2,SUMIFS('Track by Mode'!AE:AE,'Track by Mode'!$C:$C,\"=\"&$C94,'Track by Mode'!$AI:$AI,\"=No\"),SUMIFS('Track by Mode'!AE:AE,'Track by Mode'!$C:$C,\"=\"&$C94))","v":0},{"$f":"IF($X$2,SUMIFS('Track by Mode'!AG:AG,'Track by Mode'!$C:$C,\"=\"&$C94,'Track by Mode'!$AI:$AI,\"=No\"),SUMIFS('Track by Mode'!AG:AG,'Track by Mode'!$C:$C,\"=\"&$C94))","v":0},{"$f":"IF($X$2,SUMIFS('Roadway by Mode'!N:N,'Roadway by Mode'!$C:$C,\"=\"&$C94,'Roadway by Mode'!$V:$V,\"=No\"),SUMIFS('Roadway by Mode'!N:N,'Roadway by Mode'!$C:$C,\"=\"&$C94))","v":0},{"$f":"IF($X$2,SUMIFS('Roadway by Mode'!P:P,'Roadway by Mode'!$C:$C,\"=\"&$C94,'Roadway by Mode'!$V:$V,\"=No\"),SUMIFS('Roadway by Mode'!P:P,'Roadway by Mode'!$C:$C,\"=\"&$C94))","v":0},{"$f":"IF($X$2,SUMIFS('Roadway by Mode'!R:R,'Roadway by Mode'!$C:$C,\"=\"&$C94,'Roadway by Mode'!$V:$V,\"=No\"),SUMIFS('Roadway by Mode'!R:R,'Roadway by Mode'!$C:$C,\"=\"&$C94))","v":0},{"$f":"IF($X$2,SUMIFS('Roadway by Mode'!T:T,'Roadway by Mode'!$C:$C,\"=\"&$C94,'Roadway by Mode'!$V:$V,\"=No\"),SUMIFS('Roadway by Mode'!T:T,'Roadway by Mode'!$C:$C,\"=\"&$C94))","v":0}]
[null,null,"MT","Montana",null,{"$f":"IF($X$2,SUMIFS('Track by Mode'!L:L,'Track by Mode'!$C:$C,\"=\"&$C95,'Track by Mode'!$AI:$AI,\"=No\"),SUMIFS('Track by Mode'!L:L,'Track by Mode'!$C:$C,\"=\"&$C95))+IF($X$2,SUMIFS('Roadway by Mode'!L:L,'Roadway by Mode'!$C:$C,\"=\"&$C95,'Roadway by Mode'!$V:$V,\"=No\"),SUMIFS('Roadway by Mode'!L:L,'Roadway by Mode'!$C:$C,\"=\"&$C95))","v":60},{"$f":"IF($X$2,SUMIFS('Track by Mode'!N:N,'Track by Mode'!$C:$C,\"=\"&$C95,'Track by Mode'!$AI:$AI,\"=No\"),SUMIFS('Track by Mode'!N:N,'Track by Mode'!$C:$C,\"=\"&$C95))","v":0},{"$f":"IF($X$2,SUMIFS('Track by Mode'!P:P,'Track by Mode'!$C:$C,\"=\"&$C95,'Track by Mode'!$AI:$AI,\"=No\"),SUMIFS('Track by Mode'!P:P,'Track by Mode'!$C:$C,\"=\"&$C95))","v":0},{"$f":"IF($X$2,SUMIFS('Track by Mode'!R:R,'Track by Mode'!$C:$C,\"=\"&$C95,'Track by Mode'!$AI:$AI,\"=No\"),SUMIFS('Track by Mode'!R:R,'Track by Mode'!$C:$C,\"=\"&$C95))","v":0},{"$f":"IF($X$2,SUMIFS('Track by Mode'!T:T,'Track by Mode'!$C:$C,\"=\"&$C95,'Track by Mode'!$AI:$AI,\"=No\"),SUMIFS('Track by Mode'!T:T,'Track by Mode'!$C:$C,\"=\"&$C95))","v":0},{"$f":"IF($X$2,SUMIFS('Track by Mode'!V:V,'Track by Mode'!$C:$C,\"=\"&$C95,'Track by Mode'!$AI:$AI,\"=No\"),SUMIFS('Track by Mode'!V:V,'Track by Mode'!$C:$C,\"=\"&$C95))","v":0},{"$f":"IF($X$2,SUMIFS('Track by Mode'!X:X,'Track by Mode'!$C:$C,\"=\"&$C95,'Track by Mode'!$AI:$AI,\"=No\"),SUMIFS('Track by Mode'!X:X,'Track by Mode'!$C:$C,\"=\"&$C95))","v":0},{"$f":"IF($X$2,SUMIFS('Track by Mode'!Z:Z,'Track by Mode'!$C:$C,\"=\"&$C95,'Track by Mode'!$AI:$AI,\"=No\"),SUMIFS('Track by Mode'!Z:Z,'Track by Mode'!$C:$C,\"=\"&$C95))","v":0},{"$f":"IF($X$2,SUMIFS('Track by Mode'!AC:AC,'Track by Mode'!$C:$C,\"=\"&$C95,'Track by Mode'!$AI:$AI,\"=No\"),SUMIFS('Track by Mode'!AC:AC,'Track by Mode'!$C:$C,\"=\"&$C95))","v":0},{"$f":"IF($X$2,SUMIFS('Track by Mode'!AE:AE,'Track by Mode'!$C:$C,\"=\"&$C95,'Track by Mode'!$AI:$AI,\"=No\"),SUMIFS('Track by Mode'!AE:AE,'Track by Mode'!$C:$C,\"=\"&$C95))","v":0},{"$f":"IF($X$2,SUMIFS('Track by Mode'!AG:AG,'Track by Mode'!$C:$C,\"=\"&$C95,'Track by Mode'!$AI:$AI,\"=No\"),SUMIFS('Track by Mode'!AG:AG,'Track by Mode'!$C:$C,\"=\"&$C95))","v":0},{"$f":"IF($X$2,SUMIFS('Roadway by Mode'!N:N,'Roadway by Mode'!$C:$C,\"=\"&$C95,'Roadway by Mode'!$V:$V,\"=No\"),SUMIFS('Roadway by Mode'!N:N,'Roadway by Mode'!$C:$C,\"=\"&$C95))","v":0},{"$f":"IF($X$2,SUMIFS('Roadway by Mode'!P:P,'Roadway by Mode'!$C:$C,\"=\"&$C95,'Roadway by Mode'!$V:$V,\"=No\"),SUMIFS('Roadway by Mode'!P:P,'Roadway by Mode'!$C:$C,\"=\"&$C95))","v":0},{"$f":"IF($X$2,SUMIFS('Roadway by Mode'!R:R,'Roadway by Mode'!$C:$C,\"=\"&$C95,'Roadway by Mode'!$V:$V,\"=No\"),SUMIFS('Roadway by Mode'!R:R,'Roadway by Mode'!$C:$C,\"=\"&$C95))","v":0},{"$f":"IF($X$2,SUMIFS('Roadway by Mode'!T:T,'Roadway by Mode'!$C:$C,\"=\"&$C95,'Roadway by Mode'!$V:$V,\"=No\"),SUMIFS('Roadway by Mode'!T:T,'Roadway by Mode'!$C:$C,\"=\"&$C95))","v":0}]
[null,null,"NC","North Carolina",null,{"$f":"IF($X$2,SUMIFS('Track by Mode'!L:L,'Track by Mode'!$C:$C,\"=\"&$C96,'Track by Mode'!$AI:$AI,\"=No\"),SUMIFS('Track by Mode'!L:L,'Track by Mode'!$C:$C,\"=\"&$C96))+IF($X$2,SUMIFS('Roadway by Mode'!L:L,'Roadway by Mode'!$C:$C,\"=\"&$C96,'Roadway by Mode'!$V:$V,\"=No\"),SUMIFS('Roadway by Mode'!L:L,'Roadway by Mode'!$C:$C,\"=\"&$C96))","v":754},{"$f":"IF($X$2,SUMIFS('Track by Mode'!N:N,'Track by Mode'!$C:$C,\"=\"&$C96,'Track by Mode'!$AI:$AI,\"=No\"),SUMIFS('Track by Mode'!N:N,'Track by Mode'!$C:$C,\"=\"&$C96))","v":6.6},{"$f":"IF($X$2,SUMIFS('Track by Mode'!P:P,'Track by Mode'!$C:$C,\"=\"&$C96,'Track by Mode'!$AI:$AI,\"=No\"),SUMIFS('Track by Mode'!P:P,'Track by Mode'!$C:$C,\"=\"&$C96))","v":0},{"$f":"IF($X$2,SUMIFS('Track by Mode'!R:R,'Track by Mode'!$C:$C,\"=\"&$C96,'Track by Mode'!$AI:$AI,\"=No\"),SUMIFS('Track by Mode'!R:R,'Track by Mode'!$C:$C,\"=\"&$C96))","v":0.9},{"$f":"IF($X$2,SUMIFS('Track by Mode'!T:T,'Track by Mode'!$C:$C,\"=\"&$C96,'Track by Mode'!$AI:$AI,\"=No\"),SUMIFS('Track by Mode'!T:T,'Track by Mode'!$C:$C,\"=\"&$C96))","v":1.8},{"$f":"IF($X$2,SUMIFS('Track by Mode'!V:V,'Track by Mode'!$C:$C,\"=\"&$C96,'Track by Mode'!$AI:$AI,\"=No\"),SUMIFS('Track by Mode'!V:V,'Track by Mode'!$C:$C,\"=\"&$C96))","v":0},{"$f":"IF($X$2,SUMIFS('Track by Mode'!X:X,'Track by Mode'!$C:$C,\"=\"&$C96,'Track by Mode'!$AI:$AI,\"=No\"),SUMIFS('Track by Mode'!X:X,'Track by Mode'!$C:$C,\"=\"&$C96))","v":0},{"$f":"IF($X$2,SUMIFS('Track by Mode'!Z:Z,'Track by Mode'!$C:$C,\"=\"&$C96,'Track by Mode'!$AI:$AI,\"=No\"),SUMIFS('Track by Mode'!Z:Z,'Track by Mode'!$C:$C,\"=\"&$C96))","v":9.3000000000000007},{"$f":"IF($X$2,SUMIFS('Track by Mode'!AC:AC,'Track by Mode'!$C:$C,\"=\"&$C96,'Track by Mode'!$AI:$AI,\"=No\"),SUMIFS('Track by Mode'!AC:AC,'Track by Mode'!$C:$C,\"=\"&$C96))","v":20},{"$f":"IF($X$2,SUMIFS('Track by Mode'!AE:AE,'Track by Mode'!$C:$C,\"=\"&$C96,'Track by Mode'!$AI:$AI,\"=No\"),SUMIFS('Track by Mode'!AE:AE,'Track by Mode'!$C:$C,\"=\"&$C96))","v":0},{"$f":"IF($X$2,SUMIFS('Track by Mode'!AG:AG,'Track by Mode'!$C:$C,\"=\"&$C96,'Track by Mode'!$AI:$AI,\"=No\"),SUMIFS('Track by Mode'!AG:AG,'Track by Mode'!$C:$C,\"=\"&$C96))","v":20},{"$f":"IF($X$2,SUMIFS('Roadway by Mode'!N:N,'Roadway by Mode'!$C:$C,\"=\"&$C96,'Roadway by Mode'!$V:$V,\"=No\"),SUMIFS('Roadway by Mode'!N:N,'Roadway by Mode'!$C:$C,\"=\"&$C96))","v":15.4},{"$f":"IF($X$2,SUMIFS('Roadway by Mode'!P:P,'Roadway by Mode'!$C:$C,\"=\"&$C96,'Roadway by Mode'!$V:$V,\"=No\"),SUMIFS('Roadway by Mode'!P:P,'Roadway by Mode'!$C:$C,\"=\"&$C96))","v":28.8},{"$f":"IF($X$2,SUMIFS('Roadway by Mode'!R:R,'Roadway by Mode'!$C:$C,\"=\"&$C96,'Roadway by Mode'!$V:$V,\"=No\"),SUMIFS('Roadway by Mode'!R:R,'Roadway by Mode'!$C:$C,\"=\"&$C96))","v":0},{"$f":"IF($X$2,SUMIFS('Roadway by Mode'!T:T,'Roadway by Mode'!$C:$C,\"=\"&$C96,'Roadway by Mode'!$V:$V,\"=No\"),SUMIFS('Roadway by Mode'!T:T,'Roadway by Mode'!$C:$C,\"=\"&$C96))","v":44.2}]
[null,null,"ND","North Dakota",null,{"$f":"IF($X$2,SUMIFS('Track by Mode'!L:L,'Track by Mode'!$C:$C,\"=\"&$C97,'Track by Mode'!$AI:$AI,\"=No\"),SUMIFS('Track by Mode'!L:L,'Track by Mode'!$C:$C,\"=\"&$C97))+IF($X$2,SUMIFS('Roadway by Mode'!L:L,'Roadway by Mode'!$C:$C,\"=\"&$C97,'Roadway by Mode'!$V:$V,\"=No\"),SUMIFS('Roadway by Mode'!L:L,'Roadway by Mode'!$C:$C,\"=\"&$C97))","v":31},{"$f":"IF($X$2,SUMIFS('Track by Mode'!N:N,'Track by Mode'!$C:$C,\"=\"&$C97,'Track by Mode'!$AI:$AI,\"=No\"),SUMIFS('Track by Mode'!N:N,'Track by Mode'!$C:$C,\"=\"&$C97))","v":0},{"$f":"IF($X$2,SUMIFS('Track by Mode'!P:P,'Track by Mode'!$C:$C,\"=\"&$C97,'Track by Mode'!$AI:$AI,\"=No\"),SUMIFS('Track by Mode'!P:P,'Track by Mode'!$C:$C,\"=\"&$C97))","v":0},{"$f":"IF($X$2,SUMIFS('Track by Mode'!R:R,'Track by Mode'!$C:$C,\"=\"&$C97,'Track by Mode'!$AI:$AI,\"=No\"),SUMIFS('Track by Mode'!R:R,'Track by Mode'!$C:$C,\"=\"&$C97))","v":0},{"$f":"IF($X$2,SUMIFS('Track by Mode'!T:T,'Track by Mode'!$C:$C,\"=\"&$C97,'Track by Mode'!$AI:$AI,\"=No\"),SUMIFS('Track by Mode'!T:T,'Track by Mode'!$C:$C,\"=\"&$C97))","v":0},{"$f":"IF($X$2,SUMIFS('Track by Mode'!V:V,'Track by Mode'!$C:$C,\"=\"&$C97,'Track by Mode'!$AI:$AI,\"=No\"),SUMIFS('Track by Mode'!V:V,'Track by Mode'!$C:$C,\"=\"&$C97))","v":0},{"$f":"IF($X$2,SUMIFS('Track by Mode'!X:X,'Track by Mode'!$C:$C,\"=\"&$C97,'Track by Mode'!$AI:$AI,\"=No\"),SUMIFS('Track by Mode'!X:X,'Track by Mode'!$C:$C,\"=\"&$C97))","v":0},{"$f":"IF($X$2,SUMIFS('Track by Mode'!Z:Z,'Track by Mode'!$C:$C,\"=\"&$C97,'Track by Mode'!$AI:$AI,\"=No\"),SUMIFS('Track by Mode'!Z:Z,'Track by Mode'!$C:$C,\"=\"&$C97))","v":0},{"$f":"IF($X$2,SUMIFS('Track by Mode'!AC:AC,'Track by Mode'!$C:$C,\"=\"&$C97,'Track by Mode'!$AI:$AI,\"=No\"),SUMIFS('Track by Mode'!AC:AC,'Track by Mode'!$C:$C,\"=\"&$C97))","v":0},{"$f":"IF($X$2,SUMIFS('Track by Mode'!AE:AE,'Track by Mode'!$C:$C,\"=\"&$C97,'Track by Mode'!$AI:$AI,\"=No\"),SUMIFS('Track by Mode'!AE:AE,'Track by Mode'!$C:$C,\"=\"&$C97))","v":0},{"$f":"IF($X$2,SUMIFS('Track by Mode'!AG:AG,'Track by Mode'!$C:$C,\"=\"&$C97,'Track by Mode'!$AI:$AI,\"=No\"),SUMIFS('Track by Mode'!AG:AG,'Track by Mode'!$C:$C,\"=\"&$C97))","v":0},{"$f":"IF($X$2,SUMIFS('Roadway by Mode'!N:N,'Roadway by Mode'!$C:$C,\"=\"&$C97,'Roadway by Mode'!$V:$V,\"=No\"),SUMIFS('Roadway by Mode'!N:N,'Roadway by Mode'!$C:$C,\"=\"&$C97))","v":0},{"$f":"IF($X$2,SUMIFS('Roadway by Mode'!P:P,'Roadway by Mode'!$C:$C,\"=\"&$C97,'Roadway by Mode'!$V:$V,\"=No\"),SUMIFS('Roadway by Mode'!P:P,'Roadway by Mode'!$C:$C,\"=\"&$C97))","v":0},{"$f":"IF($X$2,SUMIFS('Roadway by Mode'!R:R,'Roadway by Mode'!$C:$C,\"=\"&$C97,'Roadway by Mode'!$V:$V,\"=No\"),SUMIFS('Roadway by Mode'!R:R,'Roadway by Mode'!$C:$C,\"=\"&$C97))","v":0},{"$f":"IF($X$2,SUMIFS('Roadway by Mode'!T:T,'Roadway by Mode'!$C:$C,\"=\"&$C97,'Roadway by Mode'!$V:$V,\"=No\"),SUMIFS('Roadway by Mode'!T:T,'Roadway by Mode'!$C:$C,\"=\"&$C97))","v":0}]
[null,null,"NE","Nebraska",null,{"$f":"IF($X$2,SUMIFS('Track by Mode'!L:L,'Track by Mode'!$C:$C,\"=\"&$C98,'Track by Mode'!$AI:$AI,\"=No\"),SUMIFS('Track by Mode'!L:L,'Track by Mode'!$C:$C,\"=\"&$C98))+IF($X$2,SUMIFS('Roadway by Mode'!L:L,'Roadway by Mode'!$C:$C,\"=\"&$C98,'Roadway by Mode'!$V:$V,\"=No\"),SUMIFS('Roadway by Mode'!L:L,'Roadway by Mode'!$C:$C,\"=\"&$C98))","v":154},{"$f":"IF($X$2,SUMIFS('Track by Mode'!N:N,'Track by Mode'!$C:$C,\"=\"&$C98,'Track by Mode'!$AI:$AI,\"=No\"),SUMIFS('Track by Mode'!N:N,'Track by Mode'!$C:$C,\"=\"&$C98))","v":0},{"$f":"IF($X$2,SUMIFS('Track by Mode'!P:P,'Track by Mode'!$C:$C,\"=\"&$C98,'Track by Mode'!$AI:$AI,\"=No\"),SUMIFS('Track by Mode'!P:P,'Track by Mode'!$C:$C,\"=\"&$C98))","v":0},{"$f":"IF($X$2,SUMIFS('Track by Mode'!R:R,'Track by Mode'!$C:$C,\"=\"&$C98,'Track by Mode'!$AI:$AI,\"=No\"),SUMIFS('Track by Mode'!R:R,'Track by Mode'!$C:$C,\"=\"&$C98))","v":0},{"$f":"IF($X$2,SUMIFS('Track by Mode'!T:T,'Track by Mode'!$C:$C,\"=\"&$C98,'Track by Mode'!$AI:$AI,\"=No\"),SUMIFS('Track by Mode'!T:T,'Track by Mode'!$C:$C,\"=\"&$C98))","v":0},{"$f":"IF($X$2,SUMIFS('Track by Mode'!V:V,'Track by Mode'!$C:$C,\"=\"&$C98,'Track by Mode'!$AI:$AI,\"=No\"),SUMIFS('Track by Mode'!V:V,'Track by Mode'!$C:$C,\"=\"&$C98))","v":0},{"$f":"IF($X$2,SUMIFS('Track by Mode'!X:X,'Track by Mode'!$C:$C,\"=\"&$C98,'Track by Mode'!$AI:$AI,\"=No\"),SUMIFS('Track by Mode'!X:X,'Track by Mode'!$C:$C,\"=\"&$C98))","v":0},{"$f":"IF($X$2,SUMIFS('Track by Mode'!Z:Z,'Track by Mode'!$C:$C,\"=\"&$C98,'Track by Mode'!$AI:$AI,\"=No\"),SUMIFS('Track by Mode'!Z:Z,'Track by Mode'!$C:$C,\"=\"&$C98))","v":0},{"$f":"IF($X$2,SUMIFS('Track by Mode'!AC:AC,'Track by Mode'!$C:$C,\"=\"&$C98,'Track by Mode'!$AI:$AI,\"=No\"),SUMIFS('Track by Mode'!AC:AC,'Track by Mode'!$C:$C,\"=\"&$C98))","v":0},{"$f":"IF($X$2,SUMIFS('Track by Mode'!AE:AE,'Track by Mode'!$C:$C,\"=\"&$C98,'Track by Mode'!$AI:$AI,\"=No\"),SUMIFS('Track by Mode'!AE:AE,'Track by Mode'!$C:$C,\"=\"&$C98))","v":0},{"$f":"IF($X$2,SUMIFS('Track by Mode'!AG:AG,'Track by Mode'!$C:$C,\"=\"&$C98,'Track by Mode'!$AI:$AI,\"=No\"),SUMIFS('Track by Mode'!AG:AG,'Track by Mode'!$C:$C,\"=\"&$C98))","v":0},{"$f":"IF($X$2,SUMIFS('Roadway by Mode'!N:N,'Roadway by Mode'!$C:$C,\"=\"&$C98,'Roadway by Mode'!$V:$V,\"=No\"),SUMIFS('Roadway by Mode'!N:N,'Roadway by Mode'!$C:$C,\"=\"&$C98))","v":0},{"$f":"IF($X$2,SUMIFS('Roadway by Mode'!P:P,'Roadway by Mode'!$C:$C,\"=\"&$C98,'Roadway by Mode'!$V:$V,\"=No\"),SUMIFS('Roadway by Mode'!P:P,'Roadway by Mode'!$C:$C,\"=\"&$C98))","v":0},{"$f":"IF($X$2,SUMIFS('Roadway by Mode'!R:R,'Roadway by Mode'!$C:$C,\"=\"&$C98,'Roadway by Mode'!$V:$V,\"=No\"),SUMIFS('Roadway by Mode'!R:R,'Roadway by Mode'!$C:$C,\"=\"&$C98))","v":0},{"$f":"IF($X$2,SUMIFS('Roadway by Mode'!T:T,'Roadway by Mode'!$C:$C,\"=\"&$C98,'Roadway by Mode'!$V:$V,\"=No\"),SUMIFS('Roadway by Mode'!T:T,'Roadway by Mode'!$C:$C,\"=\"&$C98))","v":0}]
[null,null,"NH","New Hampshire",null,{"$f":"IF($X$2,SUMIFS('Track by Mode'!L:L,'Track by Mode'!$C:$C,\"=\"&$C99,'Track by Mode'!$AI:$AI,\"=No\"),SUMIFS('Track by Mode'!L:L,'Track by Mode'!$C:$C,\"=\"&$C99))+IF($X$2,SUMIFS('Roadway by Mode'!L:L,'Roadway by Mode'!$C:$C,\"=\"&$C99,'Roadway by Mode'!$V:$V,\"=No\"),SUMIFS('Roadway by Mode'!L:L,'Roadway by Mode'!$C:$C,\"=\"&$C99))","v":48},{"$f":"IF($X$2,SUMIFS('Track by Mode'!N:N,'Track by Mode'!$C:$C,\"=\"&$C99,'Track by Mode'!$AI:$AI,\"=No\"),SUMIFS('Track by Mode'!N:N,'Track by Mode'!$C:$C,\"=\"&$C99))","v":0},{"$f":"IF($X$2,SUMIFS('Track by Mode'!P:P,'Track by Mode'!$C:$C,\"=\"&$C99,'Track by Mode'!$AI:$AI,\"=No\"),SUMIFS('Track by Mode'!P:P,'Track by Mode'!$C:$C,\"=\"&$C99))","v":0},{"$f":"IF($X$2,SUMIFS('Track by Mode'!R:R,'Track by Mode'!$C:$C,\"=\"&$C99,'Track by Mode'!$AI:$AI,\"=No\"),SUMIFS('Track by Mode'!R:R,'Track by Mode'!$C:$C,\"=\"&$C99))","v":0},{"$f":"IF($X$2,SUMIFS('Track by Mode'!T:T,'Track by Mode'!$C:$C,\"=\"&$C99,'Track by Mode'!$AI:$AI,\"=No\"),SUMIFS('Track by Mode'!T:T,'Track by Mode'!$C:$C,\"=\"&$C99))","v":0},{"$f":"IF($X$2,SUMIFS('Track by Mode'!V:V,'Track by Mode'!$C:$C,\"=\"&$C99,'Track by Mode'!$AI:$AI,\"=No\"),SUMIFS('Track by Mode'!V:V,'Track by Mode'!$C:$C,\"=\"&$C99))","v":0},{"$f":"IF($X$2,SUMIFS('Track by Mode'!X:X,'Track by Mode'!$C:$C,\"=\"&$C99,'Track by Mode'!$AI:$AI,\"=No\"),SUMIFS('Track by Mode'!X:X,'Track by Mode'!$C:$C,\"=\"&$C99))","v":0},{"$f":"IF($X$2,SUMIFS('Track by Mode'!Z:Z,'Track by Mode'!$C:$C,\"=\"&$C99,'Track by Mode'!$AI:$AI,\"=No\"),SUMIFS('Track by Mode'!Z:Z,'Track by Mode'!$C:$C,\"=\"&$C99))","v":0},{"$f":"IF($X$2,SUMIFS('Track by Mode'!AC:AC,'Track by Mode'!$C:$C,\"=\"&$C99,'Track by Mode'!$AI:$AI,\"=No\"),SUMIFS('Track by Mode'!AC:AC,'Track by Mode'!$C:$C,\"=\"&$C99))","v":0},{"$f":"IF($X$2,SUMIFS('Track by Mode'!AE:AE,'Track by Mode'!$C:$C,\"=\"&$C99,'Track by Mode'!$AI:$AI,\"=No\"),SUMIFS('Track by Mode'!AE:AE,'Track by Mode'!$C:$C,\"=\"&$C99))","v":0},{"$f":"IF($X$2,SUMIFS('Track by Mode'!AG:AG,'Track by Mode'!$C:$C,\"=\"&$C99,'Track by Mode'!$AI:$AI,\"=No\"),SUMIFS('Track by Mode'!AG:AG,'Track by Mode'!$C:$C,\"=\"&$C99))","v":0},{"$f":"IF($X$2,SUMIFS('Roadway by Mode'!N:N,'Roadway by Mode'!$C:$C,\"=\"&$C99,'Roadway by Mode'!$V:$V,\"=No\"),SUMIFS('Roadway by Mode'!N:N,'Roadway by Mode'!$C:$C,\"=\"&$C99))","v":0},{"$f":"IF($X$2,SUMIFS('Roadway by Mode'!P:P,'Roadway by Mode'!$C:$C,\"=\"&$C99,'Roadway by Mode'!$V:$V,\"=No\"),SUMIFS('Roadway by Mode'!P:P,'Roadway by Mode'!$C:$C,\"=\"&$C99))","v":0},{"$f":"IF($X$2,SUMIFS('Roadway by Mode'!R:R,'Roadway by Mode'!$C:$C,\"=\"&$C99,'Roadway by Mode'!$V:$V,\"=No\"),SUMIFS('Roadway by Mode'!R:R,'Roadway by Mode'!$C:$C,\"=\"&$C99))","v":0},{"$f":"IF($X$2,SUMIFS('Roadway by Mode'!T:T,'Roadway by Mode'!$C:$C,\"=\"&$C99,'Roadway by Mode'!$V:$V,\"=No\"),SUMIFS('Roadway by Mode'!T:T,'Roadway by Mode'!$C:$C,\"=\"&$C99))","v":0}]
[null,null,"NJ","New Jersey",null,{"$f":"IF($X$2,SUMIFS('Track by Mode'!L:L,'Track by Mode'!$C:$C,\"=\"&$C100,'Track by Mode'!$AI:$AI,\"=No\"),SUMIFS('Track by Mode'!L:L,'Track by Mode'!$C:$C,\"=\"&$C100))+IF($X$2,SUMIFS('Roadway by Mode'!L:L,'Roadway by Mode'!$C:$C,\"=\"&$C100,'Roadway by Mode'!$V:$V,\"=No\"),SUMIFS('Roadway by Mode'!L:L,'Roadway by Mode'!$C:$C,\"=\"&$C100))","v":4571},{"$f":"IF($X$2,SUMIFS('Track by Mode'!N:N,'Track by Mode'!$C:$C,\"=\"&$C100,'Track by Mode'!$AI:$AI,\"=No\"),SUMIFS('Track by Mode'!N:N,'Track by Mode'!$C:$C,\"=\"&$C100))","v":931.19999999999993},{"$f":"IF($X$2,SUMIFS('Track by Mode'!P:P,'Track by Mode'!$C:$C,\"=\"&$C100,'Track by Mode'!$AI:$AI,\"=No\"),SUMIFS('Track by Mode'!P:P,'Track by Mode'!$C:$C,\"=\"&$C100))","v":6.9},{"$f":"IF($X$2,SUMIFS('Track by Mode'!R:R,'Track by Mode'!$C:$C,\"=\"&$C100,'Track by Mode'!$AI:$AI,\"=No\"),SUMIFS('Track by Mode'!R:R,'Track by Mode'!$C:$C,\"=\"&$C100))","v":20.5},{"$f":"IF($X$2,SUMIFS('Track by Mode'!T:T,'Track by Mode'!$C:$C,\"=\"&$C100,'Track by Mode'!$AI:$AI,\"=No\"),SUMIFS('Track by Mode'!T:T,'Track by Mode'!$C:$C,\"=\"&$C100))","v":47.9},{"$f":"IF($X$2,SUMIFS('Track by Mode'!V:V,'Track by Mode'!$C:$C,\"=\"&$C100,'Track by Mode'!$AI:$AI,\"=No\"),SUMIFS('Track by Mode'!V:V,'Track by Mode'!$C:$C,\"=\"&$C100))","v":16.100000000000001},{"$f":"IF($X$2,SUMIFS('Track by Mode'!X:X,'Track by Mode'!$C:$C,\"=\"&$C100,'Track by Mode'!$AI:$AI,\"=No\"),SUMIFS('Track by Mode'!X:X,'Track by Mode'!$C:$C,\"=\"&$C100))","v":34},{"$f":"IF($X$2,SUMIFS('Track by Mode'!Z:Z,'Track by Mode'!$C:$C,\"=\"&$C100,'Track by Mode'!$AI:$AI,\"=No\"),SUMIFS('Track by Mode'!Z:Z,'Track by Mode'!$C:$C,\"=\"&$C100))","v":1056.5999999999999},{"$f":"IF($X$2,SUMIFS('Track by Mode'!AC:AC,'Track by Mode'!$C:$C,\"=\"&$C100,'Track by Mode'!$AI:$AI,\"=No\"),SUMIFS('Track by Mode'!AC:AC,'Track by Mode'!$C:$C,\"=\"&$C100))","v":418},{"$f":"IF($X$2,SUMIFS('Track by Mode'!AE:AE,'Track by Mode'!$C:$C,\"=\"&$C100,'Track by Mode'!$AI:$AI,\"=No\"),SUMIFS('Track by Mode'!AE:AE,'Track by Mode'!$C:$C,\"=\"&$C100))","v":32},{"$f":"IF($X$2,SUMIFS('Track by Mode'!AG:AG,'Track by Mode'!$C:$C,\"=\"&$C100,'Track by Mode'!$AI:$AI,\"=No\"),SUMIFS('Track by Mode'!AG:AG,'Track by Mode'!$C:$C,\"=\"&$C100))","v":450},{"$f":"IF($X$2,SUMIFS('Roadway by Mode'!N:N,'Roadway by Mode'!$C:$C,\"=\"&$C100,'Roadway by Mode'!$V:$V,\"=No\"),SUMIFS('Roadway by Mode'!N:N,'Roadway by Mode'!$C:$C,\"=\"&$C100))","v":1},{"$f":"IF($X$2,SUMIFS('Roadway by Mode'!P:P,'Roadway by Mode'!$C:$C,\"=\"&$C100,'Roadway by Mode'!$V:$V,\"=No\"),SUMIFS('Roadway by Mode'!P:P,'Roadway by Mode'!$C:$C,\"=\"&$C100))","v":0},{"$f":"IF($X$2,SUMIFS('Roadway by Mode'!R:R,'Roadway by Mode'!$C:$C,\"=\"&$C100,'Roadway by Mode'!$V:$V,\"=No\"),SUMIFS('Roadway by Mode'!R:R,'Roadway by Mode'!$C:$C,\"=\"&$C100))","v":53.199999999999989},{"$f":"IF($X$2,SUMIFS('Roadway by Mode'!T:T,'Roadway by Mode'!$C:$C,\"=\"&$C100,'Roadway by Mode'!$V:$V,\"=No\"),SUMIFS('Roadway by Mode'!T:T,'Roadway by Mode'!$C:$C,\"=\"&$C100))","v":54.199999999999989}]
[null,null,"NM","New Mexico",null,{"$f":"IF($X$2,SUMIFS('Track by Mode'!L:L,'Track by Mode'!$C:$C,\"=\"&$C101,'Track by Mode'!$AI:$AI,\"=No\"),SUMIFS('Track by Mode'!L:L,'Track by Mode'!$C:$C,\"=\"&$C101))+IF($X$2,SUMIFS('Roadway by Mode'!L:L,'Roadway by Mode'!$C:$C,\"=\"&$C101,'Roadway by Mode'!$V:$V,\"=No\"),SUMIFS('Roadway by Mode'!L:L,'Roadway by Mode'!$C:$C,\"=\"&$C101))","v":190},{"$f":"IF($X$2,SUMIFS('Track by Mode'!N:N,'Track by Mode'!$C:$C,\"=\"&$C101,'Track by Mode'!$AI:$AI,\"=No\"),SUMIFS('Track by Mode'!N:N,'Track by Mode'!$C:$C,\"=\"&$C101))","v":103},{"$f":"IF($X$2,SUMIFS('Track by Mode'!P:P,'Track by Mode'!$C:$C,\"=\"&$C101,'Track by Mode'!$AI:$AI,\"=No\"),SUMIFS('Track by Mode'!P:P,'Track by Mode'!$C:$C,\"=\"&$C101))","v":0},{"$f":"IF($X$2,SUMIFS('Track by Mode'!R:R,'Track by Mode'!$C:$C,\"=\"&$C101,'Track by Mode'!$AI:$AI,\"=No\"),SUMIFS('Track by Mode'!R:R,'Track by Mode'!$C:$C,\"=\"&$C101))","v":0.8},{"$f":"IF($X$2,SUMIFS('Track by Mode'!T:T,'Track by Mode'!$C:$C,\"=\"&$C101,'Track by Mode'!$AI:$AI,\"=No\"),SUMIFS('Track by Mode'!T:T,'Track by Mode'!$C:$C,\"=\"&$C101))","v":7.1},{"$f":"IF($X$2,SUMIFS('Track by Mode'!V:V,'Track by Mode'!$C:$C,\"=\"&$C101,'Track by Mode'!$AI:$AI,\"=No\"),SUMIFS('Track by Mode'!V:V,'Track by Mode'!$C:$C,\"=\"&$C101))","v":0.2},{"$f":"IF($X$2,SUMIFS('Track by Mode'!X:X,'Track by Mode'!$C:$C,\"=\"&$C101,'Track by Mode'!$AI:$AI,\"=No\"),SUMIFS('Track by Mode'!X:X,'Track by Mode'!$C:$C,\"=\"&$C101))","v":0},{"$f":"IF($X$2,SUMIFS('Track by Mode'!Z:Z,'Track by Mode'!$C:$C,\"=\"&$C101,'Track by Mode'!$AI:$AI,\"=No\"),SUMIFS('Track by Mode'!Z:Z,'Track by Mode'!$C:$C,\"=\"&$C101))","v":111.1},{"$f":"IF($X$2,SUMIFS('Track by Mode'!AC:AC,'Track by Mode'!$C:$C,\"=\"&$C101,'Track by Mode'!$AI:$AI,\"=No\"),SUMIFS('Track by Mode'!AC:AC,'Track by Mode'!$C:$C,\"=\"&$C101))","v":86},{"$f":"IF($X$2,SUMIFS('Track by Mode'!AE:AE,'Track by Mode'!$C:$C,\"=\"&$C101,'Track by Mode'!$AI:$AI,\"=No\"),SUMIFS('Track by Mode'!AE:AE,'Track by Mode'!$C:$C,\"=\"&$C101))","v":0},{"$f":"IF($X$2,SUMIFS('Track by Mode'!AG:AG,'Track by Mode'!$C:$C,\"=\"&$C101,'Track by Mode'!$AI:$AI,\"=No\"),SUMIFS('Track by Mode'!AG:AG,'Track by Mode'!$C:$C,\"=\"&$C101))","v":86},{"$f":"IF($X$2,SUMIFS('Roadway by Mode'!N:N,'Roadway by Mode'!$C:$C,\"=\"&$C101,'Roadway by Mode'!$V:$V,\"=No\"),SUMIFS('Roadway by Mode'!N:N,'Roadway by Mode'!$C:$C,\"=\"&$C101))","v":0},{"$f":"IF($X$2,SUMIFS('Roadway by Mode'!P:P,'Roadway by Mode'!$C:$C,\"=\"&$C101,'Roadway by Mode'!$V:$V,\"=No\"),SUMIFS('Roadway by Mode'!P:P,'Roadway by Mode'!$C:$C,\"=\"&$C101))","v":0},{"$f":"IF($X$2,SUMIFS('Roadway by Mode'!R:R,'Roadway by Mode'!$C:$C,\"=\"&$C101,'Roadway by Mode'!$V:$V,\"=No\"),SUMIFS('Roadway by Mode'!R:R,'Roadway by Mode'!$C:$C,\"=\"&$C101))","v":0},{"$f":"IF($X$2,SUMIFS('Roadway by Mode'!T:T,'Roadway by Mode'!$C:$C,\"=\"&$C101,'Roadway by Mode'!$V:$V,\"=No\"),SUMIFS('Roadway by Mode'!T:T,'Roadway by Mode'!$C:$C,\"=\"&$C101))","v":0}]
[null,null,"NV","Nevada",null,{"$f":"IF($X$2,SUMIFS('Track by Mode'!L:L,'Track by Mode'!$C:$C,\"=\"&$C102,'Track by Mode'!$AI:$AI,\"=No\"),SUMIFS('Track by Mode'!L:L,'Track by Mode'!$C:$C,\"=\"&$C102))+IF($X$2,SUMIFS('Roadway by Mode'!L:L,'Roadway by Mode'!$C:$C,\"=\"&$C102,'Roadway by Mode'!$V:$V,\"=No\"),SUMIFS('Roadway by Mode'!L:L,'Roadway by Mode'!$C:$C,\"=\"&$C102))","v":438},{"$f":"IF($X$2,SUMIFS('Track by Mode'!N:N,'Track by Mode'!$C:$C,\"=\"&$C102,'Track by Mode'!$AI:$AI,\"=No\"),SUMIFS('Track by Mode'!N:N,'Track by Mode'!$C:$C,\"=\"&$C102))","v":0},{"$f":"IF($X$2,SUMIFS('Track by Mode'!P:P,'Track by Mode'!$C:$C,\"=\"&$C102,'Track by Mode'!$AI:$AI,\"=No\"),SUMIFS('Track by Mode'!P:P,'Track by Mode'!$C:$C,\"=\"&$C102))","v":0},{"$f":"IF($X$2,SUMIFS('Track by Mode'!R:R,'Track by Mode'!$C:$C,\"=\"&$C102,'Track by Mode'!$AI:$AI,\"=No\"),SUMIFS('Track by Mode'!R:R,'Track by Mode'!$C:$C,\"=\"&$C102))","v":15.4},{"$f":"IF($X$2,SUMIFS('Track by Mode'!T:T,'Track by Mode'!$C:$C,\"=\"&$C102,'Track by Mode'!$AI:$AI,\"=No\"),SUMIFS('Track by Mode'!T:T,'Track by Mode'!$C:$C,\"=\"&$C102))","v":0},{"$f":"IF($X$2,SUMIFS('Track by Mode'!V:V,'Track by Mode'!$C:$C,\"=\"&$C102,'Track by Mode'!$AI:$AI,\"=No\"),SUMIFS('Track by Mode'!V:V,'Track by Mode'!$C:$C,\"=\"&$C102))","v":0},{"$f":"IF($X$2,SUMIFS('Track by Mode'!X:X,'Track by Mode'!$C:$C,\"=\"&$C102,'Track by Mode'!$AI:$AI,\"=No\"),SUMIFS('Track by Mode'!X:X,'Track by Mode'!$C:$C,\"=\"&$C102))","v":0},{"$f":"IF($X$2,SUMIFS('Track by Mode'!Z:Z,'Track by Mode'!$C:$C,\"=\"&$C102,'Track by Mode'!$AI:$AI,\"=No\"),SUMIFS('Track by Mode'!Z:Z,'Track by Mode'!$C:$C,\"=\"&$C102))","v":15.4},{"$f":"IF($X$2,SUMIFS('Track by Mode'!AC:AC,'Track by Mode'!$C:$C,\"=\"&$C102,'Track by Mode'!$AI:$AI,\"=No\"),SUMIFS('Track by Mode'!AC:AC,'Track by Mode'!$C:$C,\"=\"&$C102))","v":0},{"$f":"IF($X$2,SUMIFS('Track by Mode'!AE:AE,'Track by Mode'!$C:$C,\"=\"&$C102,'Track by Mode'!$AI:$AI,\"=No\"),SUMIFS('Track by Mode'!AE:AE,'Track by Mode'!$C:$C,\"=\"&$C102))","v":0},{"$f":"IF($X$2,SUMIFS('Track by Mode'!AG:AG,'Track by Mode'!$C:$C,\"=\"&$C102,'Track by Mode'!$AI:$AI,\"=No\"),SUMIFS('Track by Mode'!AG:AG,'Track by Mode'!$C:$C,\"=\"&$C102))","v":0},{"$f":"IF($X$2,SUMIFS('Roadway by Mode'!N:N,'Roadway by Mode'!$C:$C,\"=\"&$C102,'Roadway by Mode'!$V:$V,\"=No\"),SUMIFS('Roadway by Mode'!N:N,'Roadway by Mode'!$C:$C,\"=\"&$C102))","v":65.3},{"$f":"IF($X$2,SUMIFS('Roadway by Mode'!P:P,'Roadway by Mode'!$C:$C,\"=\"&$C102,'Roadway by Mode'!$V:$V,\"=No\"),SUMIFS('Roadway by Mode'!P:P,'Roadway by Mode'!$C:$C,\"=\"&$C102))","v":0},{"$f":"IF($X$2,SUMIFS('Roadway by Mode'!R:R,'Roadway by Mode'!$C:$C,\"=\"&$C102,'Roadway by Mode'!$V:$V,\"=No\"),SUMIFS('Roadway by Mode'!R:R,'Roadway by Mode'!$C:$C,\"=\"&$C102))","v":9.1999999999999993},{"$f":"IF($X$2,SUMIFS('Roadway by Mode'!T:T,'Roadway by Mode'!$C:$C,\"=\"&$C102,'Roadway by Mode'!$V:$V,\"=No\"),SUMIFS('Roadway by Mode'!T:T,'Roadway by Mode'!$C:$C,\"=\"&$C102))","v":74.5}]
[null,null,"NY","New York",null,{"$f":"IF($X$2,SUMIFS('Track by Mode'!L:L,'Track by Mode'!$C:$C,\"=\"&$C103,'Track by Mode'!$AI:$AI,\"=No\"),SUMIFS('Track by Mode'!L:L,'Track by Mode'!$C:$C,\"=\"&$C103))+IF($X$2,SUMIFS('Roadway by Mode'!L:L,'Roadway by Mode'!$C:$C,\"=\"&$C103,'Roadway by Mode'!$V:$V,\"=No\"),SUMIFS('Roadway by Mode'!L:L,'Roadway by Mode'!$C:$C,\"=\"&$C103))","v":14385},{"$f":"IF($X$2,SUMIFS('Track by Mode'!N:N,'Track by Mode'!$C:$C,\"=\"&$C103,'Track by Mode'!$AI:$AI,\"=No\"),SUMIFS('Track by Mode'!N:N,'Track by Mode'!$C:$C,\"=\"&$C103))","v":1538.1},{"$f":"IF($X$2,SUMIFS('Track by Mode'!P:P,'Track by Mode'!$C:$C,\"=\"&$C103,'Track by Mode'!$AI:$AI,\"=No\"),SUMIFS('Track by Mode'!P:P,'Track by Mode'!$C:$C,\"=\"&$C103))","v":0.4},{"$f":"IF($X$2,SUMIFS('Track by Mode'!R:R,'Track by Mode'!$C:$C,\"=\"&$C103,'Track by Mode'!$AI:$AI,\"=No\"),SUMIFS('Track by Mode'!R:R,'Track by Mode'!$C:$C,\"=\"&$C103))","v":240.6},{"$f":"IF($X$2,SUMIFS('Track by Mode'!T:T,'Track by Mode'!$C:$C,\"=\"&$C103,'Track by Mode'!$AI:$AI,\"=No\"),SUMIFS('Track by Mode'!T:T,'Track by Mode'!$C:$C,\"=\"&$C103))","v":65},{"$f":"IF($X$2,SUMIFS('Track by Mode'!V:V,'Track by Mode'!$C:$C,\"=\"&$C103,'Track by Mode'!$AI:$AI,\"=No\"),SUMIFS('Track by Mode'!V:V,'Track by Mode'!$C:$C,\"=\"&$C103))","v":44},{"$f":"IF($X$2,SUMIFS('Track by Mode'!X:X,'Track by Mode'!$C:$C,\"=\"&$C103,'Track by Mode'!$AI:$AI,\"=No\"),SUMIFS('Track by Mode'!X:X,'Track by Mode'!$C:$C,\"=\"&$C103))","v":468.49999999999994},{"$f":"IF($X$2,SUMIFS('Track by Mode'!Z:Z,'Track by Mode'!$C:$C,\"=\"&$C103,'Track by Mode'!$AI:$AI,\"=No\"),SUMIFS('Track by Mode'!Z:Z,'Track by Mode'!$C:$C,\"=\"&$C103))","v":2356.6},{"$f":"IF($X$2,SUMIFS('Track by Mode'!AC:AC,'Track by Mode'!$C:$C,\"=\"&$C103,'Track by Mode'!$AI:$AI,\"=No\"),SUMIFS('Track by Mode'!AC:AC,'Track by Mode'!$C:$C,\"=\"&$C103))","v":491},{"$f":"IF($X$2,SUMIFS('Track by Mode'!AE:AE,'Track by Mode'!$C:$C,\"=\"&$C103,'Track by Mode'!$AI:$AI,\"=No\"),SUMIFS('Track by Mode'!AE:AE,'Track by Mode'!$C:$C,\"=\"&$C103))","v":8},{"$f":"IF($X$2,SUMIFS('Track by Mode'!AG:AG,'Track by Mode'!$C:$C,\"=\"&$C103,'Track by Mode'!$AI:$AI,\"=No\"),SUMIFS('Track by Mode'!AG:AG,'Track by Mode'!$C:$C,\"=\"&$C103))","v":499},{"$f":"IF($X$2,SUMIFS('Roadway by Mode'!N:N,'Roadway by Mode'!$C:$C,\"=\"&$C103,'Roadway by Mode'!$V:$V,\"=No\"),SUMIFS('Roadway by Mode'!N:N,'Roadway by Mode'!$C:$C,\"=\"&$C103))","v":83.100000000000009},{"$f":"IF($X$2,SUMIFS('Roadway by Mode'!P:P,'Roadway by Mode'!$C:$C,\"=\"&$C103,'Roadway by Mode'!$V:$V,\"=No\"),SUMIFS('Roadway by Mode'!P:P,'Roadway by Mode'!$C:$C,\"=\"&$C103))","v":12.5},{"$f":"IF($X$2,SUMIFS('Roadway by Mode'!R:R,'Roadway by Mode'!$C:$C,\"=\"&$C103,'Roadway by Mode'!$V:$V,\"=No\"),SUMIFS('Roadway by Mode'!R:R,'Roadway by Mode'!$C:$C,\"=\"&$C103))","v":152.69999999999999},{"$f":"IF($X$2,SUMIFS('Roadway by Mode'!T:T,'Roadway by Mode'!$C:$C,\"=\"&$C103,'Roadway by Mode'!$V:$V,\"=No\"),SUMIFS('Roadway by Mode'!T:T,'Roadway by Mode'!$C:$C,\"=\"&$C103))","v":248.3}]
[null,null,"OH","Ohio",null,{"$f":"IF($X$2,SUMIFS('Track by Mode'!L:L,'Track by Mode'!$C:$C,\"=\"&$C104,'Track by Mode'!$AI:$AI,\"=No\"),SUMIFS('Track by Mode'!L:L,'Track by Mode'!$C:$C,\"=\"&$C104))+IF($X$2,SUMIFS('Roadway by Mode'!L:L,'Roadway by Mode'!$C:$C,\"=\"&$C104,'Roadway by Mode'!$V:$V,\"=No\"),SUMIFS('Roadway by Mode'!L:L,'Roadway by Mode'!$C:$C,\"=\"&$C104))","v":1484},{"$f":"IF($X$2,SUMIFS('Track by Mode'!N:N,'Track by Mode'!$C:$C,\"=\"&$C104,'Track by Mode'!$AI:$AI,\"=No\"),SUMIFS('Track by Mode'!N:N,'Track by Mode'!$C:$C,\"=\"&$C104))","v":64.5},{"$f":"IF($X$2,SUMIFS('Track by Mode'!P:P,'Track by Mode'!$C:$C,\"=\"&$C104,'Track by Mode'!$AI:$AI,\"=No\"),SUMIFS('Track by Mode'!P:P,'Track by Mode'!$C:$C,\"=\"&$C104))","v":0},{"$f":"IF($X$2,SUMIFS('Track by Mode'!R:R,'Track by Mode'!$C:$C,\"=\"&$C104,'Track by Mode'!$AI:$AI,\"=No\"),SUMIFS('Track by Mode'!R:R,'Track by Mode'!$C:$C,\"=\"&$C104))","v":2.8},{"$f":"IF($X$2,SUMIFS('Track by Mode'!T:T,'Track by Mode'!$C:$C,\"=\"&$C104,'Track by Mode'!$AI:$AI,\"=No\"),SUMIFS('Track by Mode'!T:T,'Track by Mode'!$C:$C,\"=\"&$C104))","v":3.9},{"$f":"IF($X$2,SUMIFS('Track by Mode'!V:V,'Track by Mode'!$C:$C,\"=\"&$C104,'Track by Mode'!$AI:$AI,\"=No\"),SUMIFS('Track by Mode'!V:V,'Track by Mode'!$C:$C,\"=\"&$C104))","v":3.1},{"$f":"IF($X$2,SUMIFS('Track by Mode'!X:X,'Track by Mode'!$C:$C,\"=\"&$C104,'Track by Mode'!$AI:$AI,\"=No\"),SUMIFS('Track by Mode'!X:X,'Track by Mode'!$C:$C,\"=\"&$C104))","v":0.6},{"$f":"IF($X$2,SUMIFS('Track by Mode'!Z:Z,'Track by Mode'!$C:$C,\"=\"&$C104,'Track by Mode'!$AI:$AI,\"=No\"),SUMIFS('Track by Mode'!Z:Z,'Track by Mode'!$C:$C,\"=\"&$C104))","v":74.900000000000006},{"$f":"IF($X$2,SUMIFS('Track by Mode'!AC:AC,'Track by Mode'!$C:$C,\"=\"&$C104,'Track by Mode'!$AI:$AI,\"=No\"),SUMIFS('Track by Mode'!AC:AC,'Track by Mode'!$C:$C,\"=\"&$C104))","v":22},{"$f":"IF($X$2,SUMIFS('Track by Mode'!AE:AE,'Track by Mode'!$C:$C,\"=\"&$C104,'Track by Mode'!$AI:$AI,\"=No\"),SUMIFS('Track by Mode'!AE:AE,'Track by Mode'!$C:$C,\"=\"&$C104))","v":0},{"$f":"IF($X$2,SUMIFS('Track by Mode'!AG:AG,'Track by Mode'!$C:$C,\"=\"&$C104,'Track by Mode'!$AI:$AI,\"=No\"),SUMIFS('Track by Mode'!AG:AG,'Track by Mode'!$C:$C,\"=\"&$C104))","v":22},{"$f":"IF($X$2,SUMIFS('Roadway by Mode'!N:N,'Roadway by Mode'!$C:$C,\"=\"&$C104,'Roadway by Mode'!$V:$V,\"=No\"),SUMIFS('Roadway by Mode'!N:N,'Roadway by Mode'!$C:$C,\"=\"&$C104))","v":137.69999999999999},{"$f":"IF($X$2,SUMIFS('Roadway by Mode'!P:P,'Roadway by Mode'!$C:$C,\"=\"&$C104,'Roadway by Mode'!$V:$V,\"=No\"),SUMIFS('Roadway by Mode'!P:P,'Roadway by Mode'!$C:$C,\"=\"&$C104))","v":0},{"$f":"IF($X$2,SUMIFS('Roadway by Mode'!R:R,'Roadway by Mode'!$C:$C,\"=\"&$C104,'Roadway by Mode'!$V:$V,\"=No\"),SUMIFS('Roadway by Mode'!R:R,'Roadway by Mode'!$C:$C,\"=\"&$C104))","v":6.4},{"$f":"IF($X$2,SUMIFS('Roadway by Mode'!T:T,'Roadway by Mode'!$C:$C,\"=\"&$C104,'Roadway by Mode'!$V:$V,\"=No\"),SUMIFS('Roadway by Mode'!T:T,'Roadway by Mode'!$C:$C,\"=\"&$C104))","v":144.1}]
[null,null,"OK","Oklahoma",null,{"$f":"IF($X$2,SUMIFS('Track by Mode'!L:L,'Track by Mode'!$C:$C,\"=\"&$C105,'Track by Mode'!$AI:$AI,\"=No\"),SUMIFS('Track by Mode'!L:L,'Track by Mode'!$C:$C,\"=\"&$C105))+IF($X$2,SUMIFS('Roadway by Mode'!L:L,'Roadway by Mode'!$C:$C,\"=\"&$C105,'Roadway by Mode'!$V:$V,\"=No\"),SUMIFS('Roadway by Mode'!L:L,'Roadway by Mode'!$C:$C,\"=\"&$C105))","v":110},{"$f":"IF($X$2,SUMIFS('Track by Mode'!N:N,'Track by Mode'!$C:$C,\"=\"&$C105,'Track by Mode'!$AI:$AI,\"=No\"),SUMIFS('Track by Mode'!N:N,'Track by Mode'!$C:$C,\"=\"&$C105))","v":0},{"$f":"IF($X$2,SUMIFS('Track by Mode'!P:P,'Track by Mode'!$C:$C,\"=\"&$C105,'Track by Mode'!$AI:$AI,\"=No\"),SUMIFS('Track by Mode'!P:P,'Track by Mode'!$C:$C,\"=\"&$C105))","v":0},{"$f":"IF($X$2,SUMIFS('Track by Mode'!R:R,'Track by Mode'!$C:$C,\"=\"&$C105,'Track by Mode'!$AI:$AI,\"=No\"),SUMIFS('Track by Mode'!R:R,'Track by Mode'!$C:$C,\"=\"&$C105))","v":0},{"$f":"IF($X$2,SUMIFS('Track by Mode'!T:T,'Track by Mode'!$C:$C,\"=\"&$C105,'Track by Mode'!$AI:$AI,\"=No\"),SUMIFS('Track by Mode'!T:T,'Track by Mode'!$C:$C,\"=\"&$C105))","v":0},{"$f":"IF($X$2,SUMIFS('Track by Mode'!V:V,'Track by Mode'!$C:$C,\"=\"&$C105,'Track by Mode'!$AI:$AI,\"=No\"),SUMIFS('Track by Mode'!V:V,'Track by Mode'!$C:$C,\"=\"&$C105))","v":0},{"$f":"IF($X$2,SUMIFS('Track by Mode'!X:X,'Track by Mode'!$C:$C,\"=\"&$C105,'Track by Mode'!$AI:$AI,\"=No\"),SUMIFS('Track by Mode'!X:X,'Track by Mode'!$C:$C,\"=\"&$C105))","v":0},{"$f":"IF($X$2,SUMIFS('Track by Mode'!Z:Z,'Track by Mode'!$C:$C,\"=\"&$C105,'Track by Mode'!$AI:$AI,\"=No\"),SUMIFS('Track by Mode'!Z:Z,'Track by Mode'!$C:$C,\"=\"&$C105))","v":0},{"$f":"IF($X$2,SUMIFS('Track by Mode'!AC:AC,'Track by Mode'!$C:$C,\"=\"&$C105,'Track by Mode'!$AI:$AI,\"=No\"),SUMIFS('Track by Mode'!AC:AC,'Track by Mode'!$C:$C,\"=\"&$C105))","v":0},{"$f":"IF($X$2,SUMIFS('Track by Mode'!AE:AE,'Track by Mode'!$C:$C,\"=\"&$C105,'Track by Mode'!$AI:$AI,\"=No\"),SUMIFS('Track by Mode'!AE:AE,'Track by Mode'!$C:$C,\"=\"&$C105))","v":0},{"$f":"IF($X$2,SUMIFS('Track by Mode'!AG:AG,'Track by Mode'!$C:$C,\"=\"&$C105,'Track by Mode'!$AI:$AI,\"=No\"),SUMIFS('Track by Mode'!AG:AG,'Track by Mode'!$C:$C,\"=\"&$C105))","v":0},{"$f":"IF($X$2,SUMIFS('Roadway by Mode'!N:N,'Roadway by Mode'!$C:$C,\"=\"&$C105,'Roadway by Mode'!$V:$V,\"=No\"),SUMIFS('Roadway by Mode'!N:N,'Roadway by Mode'!$C:$C,\"=\"&$C105))","v":0},{"$f":"IF($X$2,SUMIFS('Roadway by Mode'!P:P,'Roadway by Mode'!$C:$C,\"=\"&$C105,'Roadway by Mode'!$V:$V,\"=No\"),SUMIFS('Roadway by Mode'!P:P,'Roadway by Mode'!$C:$C,\"=\"&$C105))","v":0},{"$f":"IF($X$2,SUMIFS('Roadway by Mode'!R:R,'Roadway by Mode'!$C:$C,\"=\"&$C105,'Roadway by Mode'!$V:$V,\"=No\"),SUMIFS('Roadway by Mode'!R:R,'Roadway by Mode'!$C:$C,\"=\"&$C105))","v":0},{"$f":"IF($X$2,SUMIFS('Roadway by Mode'!T:T,'Roadway by Mode'!$C:$C,\"=\"&$C105,'Roadway by Mode'!$V:$V,\"=No\"),SUMIFS('Roadway by Mode'!T:T,'Roadway by Mode'!$C:$C,\"=\"&$C105))","v":0}]
[null,null,"OR","Oregon",null,{"$f":"IF($X$2,SUMIFS('Track by Mode'!L:L,'Track by Mode'!$C:$C,\"=\"&$C106,'Track by Mode'!$AI:$AI,\"=No\"),SUMIFS('Track by Mode'!L:L,'Track by Mode'!$C:$C,\"=\"&$C106))+IF($X$2,SUMIFS('Roadway by Mode'!L:L,'Roadway by Mode'!$C:$C,\"=\"&$C106,'Roadway by Mode'!$V:$V,\"=No\"),SUMIFS('Roadway by Mode'!L:L,'Roadway by Mode'!$C:$C,\"=\"&$C106))","v":836},{"$f":"IF($X$2,SUMIFS('Track by Mode'!N:N,'Track by Mode'!$C:$C,\"=\"&$C106,'Track by Mode'!$AI:$AI,\"=No\"),SUMIFS('Track by Mode'!N:N,'Track by Mode'!$C:$C,\"=\"&$C106))","v":97.3},{"$f":"IF($X$2,SUMIFS('Track by Mode'!P:P,'Track by Mode'!$C:$C,\"=\"&$C106,'Track by Mode'!$AI:$AI,\"=No\"),SUMIFS('Track by Mode'!P:P,'Track by Mode'!$C:$C,\"=\"&$C106))","v":14.8},{"$f":"IF($X$2,SUMIFS('Track by Mode'!R:R,'Track by Mode'!$C:$C,\"=\"&$C106,'Track by Mode'!$AI:$AI,\"=No\"),SUMIFS('Track by Mode'!R:R,'Track by Mode'!$C:$C,\"=\"&$C106))","v":5.3},{"$f":"IF($X$2,SUMIFS('Track by Mode'!T:T,'Track by Mode'!$C:$C,\"=\"&$C106,'Track by Mode'!$AI:$AI,\"=No\"),SUMIFS('Track by Mode'!T:T,'Track by Mode'!$C:$C,\"=\"&$C106))","v":3.4},{"$f":"IF($X$2,SUMIFS('Track by Mode'!V:V,'Track by Mode'!$C:$C,\"=\"&$C106,'Track by Mode'!$AI:$AI,\"=No\"),SUMIFS('Track by Mode'!V:V,'Track by Mode'!$C:$C,\"=\"&$C106))","v":10.9},{"$f":"IF($X$2,SUMIFS('Track by Mode'!X:X,'Track by Mode'!$C:$C,\"=\"&$C106,'Track by Mode'!$AI:$AI,\"=No\"),SUMIFS('Track by Mode'!X:X,'Track by Mode'!$C:$C,\"=\"&$C106))","v":6.4},{"$f":"IF($X$2,SUMIFS('Track by Mode'!Z:Z,'Track by Mode'!$C:$C,\"=\"&$C106,'Track by Mode'!$AI:$AI,\"=No\"),SUMIFS('Track by Mode'!Z:Z,'Track by Mode'!$C:$C,\"=\"&$C106))","v":138.1},{"$f":"IF($X$2,SUMIFS('Track by Mode'!AC:AC,'Track by Mode'!$C:$C,\"=\"&$C106,'Track by Mode'!$AI:$AI,\"=No\"),SUMIFS('Track by Mode'!AC:AC,'Track by Mode'!$C:$C,\"=\"&$C106))","v":214},{"$f":"IF($X$2,SUMIFS('Track by Mode'!AE:AE,'Track by Mode'!$C:$C,\"=\"&$C106,'Track by Mode'!$AI:$AI,\"=No\"),SUMIFS('Track by Mode'!AE:AE,'Track by Mode'!$C:$C,\"=\"&$C106))","v":191},{"$f":"IF($X$2,SUMIFS('Track by Mode'!AG:AG,'Track by Mode'!$C:$C,\"=\"&$C106,'Track by Mode'!$AI:$AI,\"=No\"),SUMIFS('Track by Mode'!AG:AG,'Track by Mode'!$C:$C,\"=\"&$C106))","v":405},{"$f":"IF($X$2,SUMIFS('Roadway by Mode'!N:N,'Roadway by Mode'!$C:$C,\"=\"&$C106,'Roadway by Mode'!$V:$V,\"=No\"),SUMIFS('Roadway by Mode'!N:N,'Roadway by Mode'!$C:$C,\"=\"&$C106))","v":13.399999999999999},{"$f":"IF($X$2,SUMIFS('Roadway by Mode'!P:P,'Roadway by Mode'!$C:$C,\"=\"&$C106,'Roadway by Mode'!$V:$V,\"=No\"),SUMIFS('Roadway by Mode'!P:P,'Roadway by Mode'!$C:$C,\"=\"&$C106))","v":0},{"$f":"IF($X$2,SUMIFS('Roadway by Mode'!R:R,'Roadway by Mode'!$C:$C,\"=\"&$C106,'Roadway by Mode'!$V:$V,\"=No\"),SUMIFS('Roadway by Mode'!R:R,'Roadway by Mode'!$C:$C,\"=\"&$C106))","v":0.6},{"$f":"IF($X$2,SUMIFS('Roadway by Mode'!T:T,'Roadway by Mode'!$C:$C,\"=\"&$C106,'Roadway by Mode'!$V:$V,\"=No\"),SUMIFS('Roadway by Mode'!T:T,'Roadway by Mode'!$C:$C,\"=\"&$C106))","v":14}]
[null,null,"PA","Pennsylvania",null,{"$f":"IF($X$2,SUMIFS('Track by Mode'!L:L,'Track by Mode'!$C:$C,\"=\"&$C107,'Track by Mode'!$AI:$AI,\"=No\"),SUMIFS('Track by Mode'!L:L,'Track by Mode'!$C:$C,\"=\"&$C107))+IF($X$2,SUMIFS('Roadway by Mode'!L:L,'Roadway by Mode'!$C:$C,\"=\"&$C107,'Roadway by Mode'!$V:$V,\"=No\"),SUMIFS('Roadway by Mode'!L:L,'Roadway by Mode'!$C:$C,\"=\"&$C107))","v":3323},{"$f":"IF($X$2,SUMIFS('Track by Mode'!N:N,'Track by Mode'!$C:$C,\"=\"&$C107,'Track by Mode'!$AI:$AI,\"=No\"),SUMIFS('Track by Mode'!N:N,'Track by Mode'!$C:$C,\"=\"&$C107))","v":844.8},{"$f":"IF($X$2,SUMIFS('Track by Mode'!P:P,'Track by Mode'!$C:$C,\"=\"&$C107,'Track by Mode'!$AI:$AI,\"=No\"),SUMIFS('Track by Mode'!P:P,'Track by Mode'!$C:$C,\"=\"&$C107))","v":195.89999999999998},{"$f":"IF($X$2,SUMIFS('Track by Mode'!R:R,'Track by Mode'!$C:$C,\"=\"&$C107,'Track by Mode'!$AI:$AI,\"=No\"),SUMIFS('Track by Mode'!R:R,'Track by Mode'!$C:$C,\"=\"&$C107))","v":26.6},{"$f":"IF($X$2,SUMIFS('Track by Mode'!T:T,'Track by Mode'!$C:$C,\"=\"&$C107,'Track by Mode'!$AI:$AI,\"=No\"),SUMIFS('Track by Mode'!T:T,'Track by Mode'!$C:$C,\"=\"&$C107))","v":0},{"$f":"IF($X$2,SUMIFS('Track by Mode'!V:V,'Track by Mode'!$C:$C,\"=\"&$C107,'Track by Mode'!$AI:$AI,\"=No\"),SUMIFS('Track by Mode'!V:V,'Track by Mode'!$C:$C,\"=\"&$C107))","v":0},{"$f":"IF($X$2,SUMIFS('Track by Mode'!X:X,'Track by Mode'!$C:$C,\"=\"&$C107,'Track by Mode'!$AI:$AI,\"=No\"),SUMIFS('Track by Mode'!X:X,'Track by Mode'!$C:$C,\"=\"&$C107))","v":61.4},{"$f":"IF($X$2,SUMIFS('Track by Mode'!Z:Z,'Track by Mode'!$C:$C,\"=\"&$C107,'Track by Mode'!$AI:$AI,\"=No\"),SUMIFS('Track by Mode'!Z:Z,'Track by Mode'!$C:$C,\"=\"&$C107))","v":1128.7},{"$f":"IF($X$2,SUMIFS('Track by Mode'!AC:AC,'Track by Mode'!$C:$C,\"=\"&$C107,'Track by Mode'!$AI:$AI,\"=No\"),SUMIFS('Track by Mode'!AC:AC,'Track by Mode'!$C:$C,\"=\"&$C107))","v":374},{"$f":"IF($X$2,SUMIFS('Track by Mode'!AE:AE,'Track by Mode'!$C:$C,\"=\"&$C107,'Track by Mode'!$AI:$AI,\"=No\"),SUMIFS('Track by Mode'!AE:AE,'Track by Mode'!$C:$C,\"=\"&$C107))","v":651},{"$f":"IF($X$2,SUMIFS('Track by Mode'!AG:AG,'Track by Mode'!$C:$C,\"=\"&$C107,'Track by Mode'!$AI:$AI,\"=No\"),SUMIFS('Track by Mode'!AG:AG,'Track by Mode'!$C:$C,\"=\"&$C107))","v":1025},{"$f":"IF($X$2,SUMIFS('Roadway by Mode'!N:N,'Roadway by Mode'!$C:$C,\"=\"&$C107,'Roadway by Mode'!$V:$V,\"=No\"),SUMIFS('Roadway by Mode'!N:N,'Roadway by Mode'!$C:$C,\"=\"&$C107))","v":107.59999999999998},{"$f":"IF($X$2,SUMIFS('Roadway by Mode'!P:P,'Roadway by Mode'!$C:$C,\"=\"&$C107,'Roadway by Mode'!$V:$V,\"=No\"),SUMIFS('Roadway by Mode'!P:P,'Roadway by Mode'!$C:$C,\"=\"&$C107))","v":18.3},{"$f":"IF($X$2,SUMIFS('Roadway by Mode'!R:R,'Roadway by Mode'!$C:$C,\"=\"&$C107,'Roadway by Mode'!$V:$V,\"=No\"),SUMIFS('Roadway by Mode'!R:R,'Roadway by Mode'!$C:$C,\"=\"&$C107))","v":0},{"$f":"IF($X$2,SUMIFS('Roadway by Mode'!T:T,'Roadway by Mode'!$C:$C,\"=\"&$C107,'Roadway by Mode'!$V:$V,\"=No\"),SUMIFS('Roadway by Mode'!T:T,'Roadway by Mode'!$C:$C,\"=\"&$C107))","v":125.89999999999999}]
[null,null,"PR","Puerto Rico",null,{"$f":"IF($X$2,SUMIFS('Track by Mode'!L:L,'Track by Mode'!$C:$C,\"=\"&$C108,'Track by Mode'!$AI:$AI,\"=No\"),SUMIFS('Track by Mode'!L:L,'Track by Mode'!$C:$C,\"=\"&$C108))+IF($X$2,SUMIFS('Roadway by Mode'!L:L,'Roadway by Mode'!$C:$C,\"=\"&$C108,'Roadway by Mode'!$V:$V,\"=No\"),SUMIFS('Roadway by Mode'!L:L,'Roadway by Mode'!$C:$C,\"=\"&$C108))","v":150},{"$f":"IF($X$2,SUMIFS('Track by Mode'!N:N,'Track by Mode'!$C:$C,\"=\"&$C108,'Track by Mode'!$AI:$AI,\"=No\"),SUMIFS('Track by Mode'!N:N,'Track by Mode'!$C:$C,\"=\"&$C108))","v":10.199999999999999},{"$f":"IF($X$2,SUMIFS('Track by Mode'!P:P,'Track by Mode'!$C:$C,\"=\"&$C108,'Track by Mode'!$AI:$AI,\"=No\"),SUMIFS('Track by Mode'!P:P,'Track by Mode'!$C:$C,\"=\"&$C108))","v":0},{"$f":"IF($X$2,SUMIFS('Track by Mode'!R:R,'Track by Mode'!$C:$C,\"=\"&$C108,'Track by Mode'!$AI:$AI,\"=No\"),SUMIFS('Track by Mode'!R:R,'Track by Mode'!$C:$C,\"=\"&$C108))","v":12.2},{"$f":"IF($X$2,SUMIFS('Track by Mode'!T:T,'Track by Mode'!$C:$C,\"=\"&$C108,'Track by Mode'!$AI:$AI,\"=No\"),SUMIFS('Track by Mode'!T:T,'Track by Mode'!$C:$C,\"=\"&$C108))","v":0},{"$f":"IF($X$2,SUMIFS('Track by Mode'!V:V,'Track by Mode'!$C:$C,\"=\"&$C108,'Track by Mode'!$AI:$AI,\"=No\"),SUMIFS('Track by Mode'!V:V,'Track by Mode'!$C:$C,\"=\"&$C108))","v":1.4},{"$f":"IF($X$2,SUMIFS('Track by Mode'!X:X,'Track by Mode'!$C:$C,\"=\"&$C108,'Track by Mode'!$AI:$AI,\"=No\"),SUMIFS('Track by Mode'!X:X,'Track by Mode'!$C:$C,\"=\"&$C108))","v":1.7},{"$f":"IF($X$2,SUMIFS('Track by Mode'!Z:Z,'Track by Mode'!$C:$C,\"=\"&$C108,'Track by Mode'!$AI:$AI,\"=No\"),SUMIFS('Track by Mode'!Z:Z,'Track by Mode'!$C:$C,\"=\"&$C108))","v":25.5},{"$f":"IF($X$2,SUMIFS('Track by Mode'!AC:AC,'Track by Mode'!$C:$C,\"=\"&$C108,'Track by Mode'!$AI:$AI,\"=No\"),SUMIFS('Track by Mode'!AC:AC,'Track by Mode'!$C:$C,\"=\"&$C108))","v":0},{"$f":"IF($X$2,SUMIFS('Track by Mode'!AE:AE,'Track by Mode'!$C:$C,\"=\"&$C108,'Track by Mode'!$AI:$AI,\"=No\"),SUMIFS('Track by Mode'!AE:AE,'Track by Mode'!$C:$C,\"=\"&$C108))","v":0},{"$f":"IF($X$2,SUMIFS('Track by Mode'!AG:AG,'Track by Mode'!$C:$C,\"=\"&$C108,'Track by Mode'!$AI:$AI,\"=No\"),SUMIFS('Track by Mode'!AG:AG,'Track by Mode'!$C:$C,\"=\"&$C108))","v":0},{"$f":"IF($X$2,SUMIFS('Roadway by Mode'!N:N,'Roadway by Mode'!$C:$C,\"=\"&$C108,'Roadway by Mode'!$V:$V,\"=No\"),SUMIFS('Roadway by Mode'!N:N,'Roadway by Mode'!$C:$C,\"=\"&$C108))","v":28.200000000000003},{"$f":"IF($X$2,SUMIFS('Roadway by Mode'!P:P,'Roadway by Mode'!$C:$C,\"=\"&$C108,'Roadway by Mode'!$V:$V,\"=No\"),SUMIFS('Roadway by Mode'!P:P,'Roadway by Mode'!$C:$C,\"=\"&$C108))","v":0},{"$f":"IF($X$2,SUMIFS('Roadway by Mode'!R:R,'Roadway by Mode'!$C:$C,\"=\"&$C108,'Roadway by Mode'!$V:$V,\"=No\"),SUMIFS('Roadway by Mode'!R:R,'Roadway by Mode'!$C:$C,\"=\"&$C108))","v":0},{"$f":"IF($X$2,SUMIFS('Roadway by Mode'!T:T,'Roadway by Mode'!$C:$C,\"=\"&$C108,'Roadway by Mode'!$V:$V,\"=No\"),SUMIFS('Roadway by Mode'!T:T,'Roadway by Mode'!$C:$C,\"=\"&$C108))","v":28.200000000000003}]
[null,null,"RI","Rhode Island",null,{"$f":"IF($X$2,SUMIFS('Track by Mode'!L:L,'Track by Mode'!$C:$C,\"=\"&$C109,'Track by Mode'!$AI:$AI,\"=No\"),SUMIFS('Track by Mode'!L:L,'Track by Mode'!$C:$C,\"=\"&$C109))+IF($X$2,SUMIFS('Roadway by Mode'!L:L,'Roadway by Mode'!$C:$C,\"=\"&$C109,'Roadway by Mode'!$V:$V,\"=No\"),SUMIFS('Roadway by Mode'!L:L,'Roadway by Mode'!$C:$C,\"=\"&$C109))","v":196},{"$f":"IF($X$2,SUMIFS('Track by Mode'!N:N,'Track by Mode'!$C:$C,\"=\"&$C109,'Track by Mode'!$AI:$AI,\"=No\"),SUMIFS('Track by Mode'!N:N,'Track by Mode'!$C:$C,\"=\"&$C109))","v":0},{"$f":"IF($X$2,SUMIFS('Track by Mode'!P:P,'Track by Mode'!$C:$C,\"=\"&$C109,'Track by Mode'!$AI:$AI,\"=No\"),SUMIFS('Track by Mode'!P:P,'Track by Mode'!$C:$C,\"=\"&$C109))","v":0},{"$f":"IF($X$2,SUMIFS('Track by Mode'!R:R,'Track by Mode'!$C:$C,\"=\"&$C109,'Track by Mode'!$AI:$AI,\"=No\"),SUMIFS('Track by Mode'!R:R,'Track by Mode'!$C:$C,\"=\"&$C109))","v":0},{"$f":"IF($X$2,SUMIFS('Track by Mode'!T:T,'Track by Mode'!$C:$C,\"=\"&$C109,'Track by Mode'!$AI:$AI,\"=No\"),SUMIFS('Track by Mode'!T:T,'Track by Mode'!$C:$C,\"=\"&$C109))","v":0},{"$f":"IF($X$2,SUMIFS('Track by Mode'!V:V,'Track by Mode'!$C:$C,\"=\"&$C109,'Track by Mode'!$AI:$AI,\"=No\"),SUMIFS('Track by Mode'!V:V,'Track by Mode'!$C:$C,\"=\"&$C109))","v":0},{"$f":"IF($X$2,SUMIFS('Track by Mode'!X:X,'Track by Mode'!$C:$C,\"=\"&$C109,'Track by Mode'!$AI:$AI,\"=No\"),SUMIFS('Track by Mode'!X:X,'Track by Mode'!$C:$C,\"=\"&$C109))","v":0},{"$f":"IF($X$2,SUMIFS('Track by Mode'!Z:Z,'Track by Mode'!$C:$C,\"=\"&$C109,'Track by Mode'!$AI:$AI,\"=No\"),SUMIFS('Track by Mode'!Z:Z,'Track by Mode'!$C:$C,\"=\"&$C109))","v":0},{"$f":"IF($X$2,SUMIFS('Track by Mode'!AC:AC,'Track by Mode'!$C:$C,\"=\"&$C109,'Track by Mode'!$AI:$AI,\"=No\"),SUMIFS('Track by Mode'!AC:AC,'Track by Mode'!$C:$C,\"=\"&$C109))","v":0},{"$f":"IF($X$2,SUMIFS('Track by Mode'!AE:AE,'Track by Mode'!$C:$C,\"=\"&$C109,'Track by Mode'!$AI:$AI,\"=No\"),SUMIFS('Track by Mode'!AE:AE,'Track by Mode'!$C:$C,\"=\"&$C109))","v":0},{"$f":"IF($X$2,SUMIFS('Track by Mode'!AG:AG,'Track by Mode'!$C:$C,\"=\"&$C109,'Track by Mode'!$AI:$AI,\"=No\"),SUMIFS('Track by Mode'!AG:AG,'Track by Mode'!$C:$C,\"=\"&$C109))","v":0},{"$f":"IF($X$2,SUMIFS('Roadway by Mode'!N:N,'Roadway by Mode'!$C:$C,\"=\"&$C109,'Roadway by Mode'!$V:$V,\"=No\"),SUMIFS('Roadway by Mode'!N:N,'Roadway by Mode'!$C:$C,\"=\"&$C109))","v":1.6},{"$f":"IF($X$2,SUMIFS('Roadway by Mode'!P:P,'Roadway by Mode'!$C:$C,\"=\"&$C109,'Roadway by Mode'!$V:$V,\"=No\"),SUMIFS('Roadway by Mode'!P:P,'Roadway by Mode'!$C:$C,\"=\"&$C109))","v":0},{"$f":"IF($X$2,SUMIFS('Roadway by Mode'!R:R,'Roadway by Mode'!$C:$C,\"=\"&$C109,'Roadway by Mode'!$V:$V,\"=No\"),SUMIFS('Roadway by Mode'!R:R,'Roadway by Mode'!$C:$C,\"=\"&$C109))","v":0},{"$f":"IF($X$2,SUMIFS('Roadway by Mode'!T:T,'Roadway by Mode'!$C:$C,\"=\"&$C109,'Roadway by Mode'!$V:$V,\"=No\"),SUMIFS('Roadway by Mode'!T:T,'Roadway by Mode'!$C:$C,\"=\"&$C109))","v":1.6}]
[null,null,"SC","South Carolina",null,{"$f":"IF($X$2,SUMIFS('Track by Mode'!L:L,'Track by Mode'!$C:$C,\"=\"&$C110,'Track by Mode'!$AI:$AI,\"=No\"),SUMIFS('Track by Mode'!L:L,'Track by Mode'!$C:$C,\"=\"&$C110))+IF($X$2,SUMIFS('Roadway by Mode'!L:L,'Roadway by Mode'!$C:$C,\"=\"&$C110,'Roadway by Mode'!$V:$V,\"=No\"),SUMIFS('Roadway by Mode'!L:L,'Roadway by Mode'!$C:$C,\"=\"&$C110))","v":164},{"$f":"IF($X$2,SUMIFS('Track by Mode'!N:N,'Track by Mode'!$C:$C,\"=\"&$C110,'Track by Mode'!$AI:$AI,\"=No\"),SUMIFS('Track by Mode'!N:N,'Track by Mode'!$C:$C,\"=\"&$C110))","v":0},{"$f":"IF($X$2,SUMIFS('Track by Mode'!P:P,'Track by Mode'!$C:$C,\"=\"&$C110,'Track by Mode'!$AI:$AI,\"=No\"),SUMIFS('Track by Mode'!P:P,'Track by Mode'!$C:$C,\"=\"&$C110))","v":0},{"$f":"IF($X$2,SUMIFS('Track by Mode'!R:R,'Track by Mode'!$C:$C,\"=\"&$C110,'Track by Mode'!$AI:$AI,\"=No\"),SUMIFS('Track by Mode'!R:R,'Track by Mode'!$C:$C,\"=\"&$C110))","v":0},{"$f":"IF($X$2,SUMIFS('Track by Mode'!T:T,'Track by Mode'!$C:$C,\"=\"&$C110,'Track by Mode'!$AI:$AI,\"=No\"),SUMIFS('Track by Mode'!T:T,'Track by Mode'!$C:$C,\"=\"&$C110))","v":0},{"$f":"IF($X$2,SUMIFS('Track by Mode'!V:V,'Track by Mode'!$C:$C,\"=\"&$C110,'Track by Mode'!$AI:$AI,\"=No\"),SUMIFS('Track by Mode'!V:V,'Track by Mode'!$C:$C,\"=\"&$C110))","v":0},{"$f":"IF($X$2,SUMIFS('Track by Mode'!X:X,'Track by Mode'!$C:$C,\"=\"&$C110,'Track by Mode'!$AI:$AI,\"=No\"),SUMIFS('Track by Mode'!X:X,'Track by Mode'!$C:$C,\"=\"&$C110))","v":0},{"$f":"IF($X$2,SUMIFS('Track by Mode'!Z:Z,'Track by Mode'!$C:$C,\"=\"&$C110,'Track by Mode'!$AI:$AI,\"=No\"),SUMIFS('Track by Mode'!Z:Z,'Track by Mode'!$C:$C,\"=\"&$C110))","v":0},{"$f":"IF($X$2,SUMIFS('Track by Mode'!AC:AC,'Track by Mode'!$C:$C,\"=\"&$C110,'Track by Mode'!$AI:$AI,\"=No\"),SUMIFS('Track by Mode'!AC:AC,'Track by Mode'!$C:$C,\"=\"&$C110))","v":0},{"$f":"IF($X$2,SUMIFS('Track by Mode'!AE:AE,'Track by Mode'!$C:$C,\"=\"&$C110,'Track by Mode'!$AI:$AI,\"=No\"),SUMIFS('Track by Mode'!AE:AE,'Track by Mode'!$C:$C,\"=\"&$C110))","v":0},{"$f":"IF($X$2,SUMIFS('Track by Mode'!AG:AG,'Track by Mode'!$C:$C,\"=\"&$C110,'Track by Mode'!$AI:$AI,\"=No\"),SUMIFS('Track by Mode'!AG:AG,'Track by Mode'!$C:$C,\"=\"&$C110))","v":0},{"$f":"IF($X$2,SUMIFS('Roadway by Mode'!N:N,'Roadway by Mode'!$C:$C,\"=\"&$C110,'Roadway by Mode'!$V:$V,\"=No\"),SUMIFS('Roadway by Mode'!N:N,'Roadway by Mode'!$C:$C,\"=\"&$C110))","v":0},{"$f":"IF($X$2,SUMIFS('Roadway by Mode'!P:P,'Roadway by Mode'!$C:$C,\"=\"&$C110,'Roadway by Mode'!$V:$V,\"=No\"),SUMIFS('Roadway by Mode'!P:P,'Roadway by Mode'!$C:$C,\"=\"&$C110))","v":0},{"$f":"IF($X$2,SUMIFS('Roadway by Mode'!R:R,'Roadway by Mode'!$C:$C,\"=\"&$C110,'Roadway by Mode'!$V:$V,\"=No\"),SUMIFS('Roadway by Mode'!R:R,'Roadway by Mode'!$C:$C,\"=\"&$C110))","v":0},{"$f":"IF($X$2,SUMIFS('Roadway by Mode'!T:T,'Roadway by Mode'!$C:$C,\"=\"&$C110,'Roadway by Mode'!$V:$V,\"=No\"),SUMIFS('Roadway by Mode'!T:T,'Roadway by Mode'!$C:$C,\"=\"&$C110))","v":0}]
[null,null,"SD","South Dakota",null,{"$f":"IF($X$2,SUMIFS('Track by Mode'!L:L,'Track by Mode'!$C:$C,\"=\"&$C111,'Track by Mode'!$AI:$AI,\"=No\"),SUMIFS('Track by Mode'!L:L,'Track by Mode'!$C:$C,\"=\"&$C111))+IF($X$2,SUMIFS('Roadway by Mode'!L:L,'Roadway by Mode'!$C:$C,\"=\"&$C111,'Roadway by Mode'!$V:$V,\"=No\"),SUMIFS('Roadway by Mode'!L:L,'Roadway by Mode'!$C:$C,\"=\"&$C111))","v":22},{"$f":"IF($X$2,SUMIFS('Track by Mode'!N:N,'Track by Mode'!$C:$C,\"=\"&$C111,'Track by Mode'!$AI:$AI,\"=No\"),SUMIFS('Track by Mode'!N:N,'Track by Mode'!$C:$C,\"=\"&$C111))","v":0},{"$f":"IF($X$2,SUMIFS('Track by Mode'!P:P,'Track by Mode'!$C:$C,\"=\"&$C111,'Track by Mode'!$AI:$AI,\"=No\"),SUMIFS('Track by Mode'!P:P,'Track by Mode'!$C:$C,\"=\"&$C111))","v":0},{"$f":"IF($X$2,SUMIFS('Track by Mode'!R:R,'Track by Mode'!$C:$C,\"=\"&$C111,'Track by Mode'!$AI:$AI,\"=No\"),SUMIFS('Track by Mode'!R:R,'Track by Mode'!$C:$C,\"=\"&$C111))","v":0},{"$f":"IF($X$2,SUMIFS('Track by Mode'!T:T,'Track by Mode'!$C:$C,\"=\"&$C111,'Track by Mode'!$AI:$AI,\"=No\"),SUMIFS('Track by Mode'!T:T,'Track by Mode'!$C:$C,\"=\"&$C111))","v":0},{"$f":"IF($X$2,SUMIFS('Track by Mode'!V:V,'Track by Mode'!$C:$C,\"=\"&$C111,'Track by Mode'!$AI:$AI,\"=No\"),SUMIFS('Track by Mode'!V:V,'Track by Mode'!$C:$C,\"=\"&$C111))","v":0},{"$f":"IF($X$2,SUMIFS('Track by Mode'!X:X,'Track by Mode'!$C:$C,\"=\"&$C111,'Track by Mode'!$AI:$AI,\"=No\"),SUMIFS('Track by Mode'!X:X,'Track by Mode'!$C:$C,\"=\"&$C111))","v":0},{"$f":"IF($X$2,SUMIFS('Track by Mode'!Z:Z,'Track by Mode'!$C:$C,\"=\"&$C111,'Track by Mode'!$AI:$AI,\"=No\"),SUMIFS('Track by Mode'!Z:Z,'Track by Mode'!$C:$C,\"=\"&$C111))","v":0},{"$f":"IF($X$2,SUMIFS('Track by Mode'!AC:AC,'Track by Mode'!$C:$C,\"=\"&$C111,'Track by Mode'!$AI:$AI,\"=No\"),SUMIFS('Track by Mode'!AC:AC,'Track by Mode'!$C:$C,\"=\"&$C111))","v":0},{"$f":"IF($X$2,SUMIFS('Track by Mode'!AE:AE,'Track by Mode'!$C:$C,\"=\"&$C111,'Track by Mode'!$AI:$AI,\"=No\"),SUMIFS('Track by Mode'!AE:AE,'Track by Mode'!$C:$C,\"=\"&$C111))","v":0},{"$f":"IF($X$2,SUMIFS('Track by Mode'!AG:AG,'Track by Mode'!$C:$C,\"=\"&$C111,'Track by Mode'!$AI:$AI,\"=No\"),SUMIFS('Track by Mode'!AG:AG,'Track by Mode'!$C:$C,\"=\"&$C111))","v":0},{"$f":"IF($X$2,SUMIFS('Roadway by Mode'!N:N,'Roadway by Mode'!$C:$C,\"=\"&$C111,'Roadway by Mode'!$V:$V,\"=No\"),SUMIFS('Roadway by Mode'!N:N,'Roadway by Mode'!$C:$C,\"=\"&$C111))","v":0},{"$f":"IF($X$2,SUMIFS('Roadway by Mode'!P:P,'Roadway by Mode'!$C:$C,\"=\"&$C111,'Roadway by Mode'!$V:$V,\"=No\"),SUMIFS('Roadway by Mode'!P:P,'Roadway by Mode'!$C:$C,\"=\"&$C111))","v":0},{"$f":"IF($X$2,SUMIFS('Roadway by Mode'!R:R,'Roadway by Mode'!$C:$C,\"=\"&$C111,'Roadway by Mode'!$V:$V,\"=No\"),SUMIFS('Roadway by Mode'!R:R,'Roadway by Mode'!$C:$C,\"=\"&$C111))","v":0},{"$f":"IF($X$2,SUMIFS('Roadway by Mode'!T:T,'Roadway by Mode'!$C:$C,\"=\"&$C111,'Roadway by Mode'!$V:$V,\"=No\"),SUMIFS('Roadway by Mode'!T:T,'Roadway by Mode'!$C:$C,\"=\"&$C111))","v":0}]
[null,null,"TN","Tennessee",null,{"$f":"IF($X$2,SUMIFS('Track by Mode'!L:L,'Track by Mode'!$C:$C,\"=\"&$C112,'Track by Mode'!$AI:$AI,\"=No\"),SUMIFS('Track by Mode'!L:L,'Track by Mode'!$C:$C,\"=\"&$C112))+IF($X$2,SUMIFS('Roadway by Mode'!L:L,'Roadway by Mode'!$C:$C,\"=\"&$C112,'Roadway by Mode'!$V:$V,\"=No\"),SUMIFS('Roadway by Mode'!L:L,'Roadway by Mode'!$C:$C,\"=\"&$C112))","v":400},{"$f":"IF($X$2,SUMIFS('Track by Mode'!N:N,'Track by Mode'!$C:$C,\"=\"&$C112,'Track by Mode'!$AI:$AI,\"=No\"),SUMIFS('Track by Mode'!N:N,'Track by Mode'!$C:$C,\"=\"&$C112))","v":37.200000000000003},{"$f":"IF($X$2,SUMIFS('Track by Mode'!P:P,'Track by Mode'!$C:$C,\"=\"&$C112,'Track by Mode'!$AI:$AI,\"=No\"),SUMIFS('Track by Mode'!P:P,'Track by Mode'!$C:$C,\"=\"&$C112))","v":7},{"$f":"IF($X$2,SUMIFS('Track by Mode'!R:R,'Track by Mode'!$C:$C,\"=\"&$C112,'Track by Mode'!$AI:$AI,\"=No\"),SUMIFS('Track by Mode'!R:R,'Track by Mode'!$C:$C,\"=\"&$C112))","v":0.1},{"$f":"IF($X$2,SUMIFS('Track by Mode'!T:T,'Track by Mode'!$C:$C,\"=\"&$C112,'Track by Mode'!$AI:$AI,\"=No\"),SUMIFS('Track by Mode'!T:T,'Track by Mode'!$C:$C,\"=\"&$C112))","v":0.2},{"$f":"IF($X$2,SUMIFS('Track by Mode'!V:V,'Track by Mode'!$C:$C,\"=\"&$C112,'Track by Mode'!$AI:$AI,\"=No\"),SUMIFS('Track by Mode'!V:V,'Track by Mode'!$C:$C,\"=\"&$C112))","v":0},{"$f":"IF($X$2,SUMIFS('Track by Mode'!X:X,'Track by Mode'!$C:$C,\"=\"&$C112,'Track by Mode'!$AI:$AI,\"=No\"),SUMIFS('Track by Mode'!X:X,'Track by Mode'!$C:$C,\"=\"&$C112))","v":0},{"$f":"IF($X$2,SUMIFS('Track by Mode'!Z:Z,'Track by Mode'!$C:$C,\"=\"&$C112,'Track by Mode'!$AI:$AI,\"=No\"),SUMIFS('Track by Mode'!Z:Z,'Track by Mode'!$C:$C,\"=\"&$C112))","v":44.5},{"$f":"IF($X$2,SUMIFS('Track by Mode'!AC:AC,'Track by Mode'!$C:$C,\"=\"&$C112,'Track by Mode'!$AI:$AI,\"=No\"),SUMIFS('Track by Mode'!AC:AC,'Track by Mode'!$C:$C,\"=\"&$C112))","v":35},{"$f":"IF($X$2,SUMIFS('Track by Mode'!AE:AE,'Track by Mode'!$C:$C,\"=\"&$C112,'Track by Mode'!$AI:$AI,\"=No\"),SUMIFS('Track by Mode'!AE:AE,'Track by Mode'!$C:$C,\"=\"&$C112))","v":0},{"$f":"IF($X$2,SUMIFS('Track by Mode'!AG:AG,'Track by Mode'!$C:$C,\"=\"&$C112,'Track by Mode'!$AI:$AI,\"=No\"),SUMIFS('Track by Mode'!AG:AG,'Track by Mode'!$C:$C,\"=\"&$C112))","v":35},{"$f":"IF($X$2,SUMIFS('Roadway by Mode'!N:N,'Roadway by Mode'!$C:$C,\"=\"&$C112,'Roadway by Mode'!$V:$V,\"=No\"),SUMIFS('Roadway by Mode'!N:N,'Roadway by Mode'!$C:$C,\"=\"&$C112))","v":0},{"$f":"IF($X$2,SUMIFS('Roadway by Mode'!P:P,'Roadway by Mode'!$C:$C,\"=\"&$C112,'Roadway by Mode'!$V:$V,\"=No\"),SUMIFS('Roadway by Mode'!P:P,'Roadway by Mode'!$C:$C,\"=\"&$C112))","v":0},{"$f":"IF($X$2,SUMIFS('Roadway by Mode'!R:R,'Roadway by Mode'!$C:$C,\"=\"&$C112,'Roadway by Mode'!$V:$V,\"=No\"),SUMIFS('Roadway by Mode'!R:R,'Roadway by Mode'!$C:$C,\"=\"&$C112))","v":0},{"$f":"IF($X$2,SUMIFS('Roadway by Mode'!T:T,'Roadway by Mode'!$C:$C,\"=\"&$C112,'Roadway by Mode'!$V:$V,\"=No\"),SUMIFS('Roadway by Mode'!T:T,'Roadway by Mode'!$C:$C,\"=\"&$C112))","v":0}]
[null,null,"TX","Texas",null,{"$f":"IF($X$2,SUMIFS('Track by Mode'!L:L,'Track by Mode'!$C:$C,\"=\"&$C113,'Track by Mode'!$AI:$AI,\"=No\"),SUMIFS('Track by Mode'!L:L,'Track by Mode'!$C:$C,\"=\"&$C113))+IF($X$2,SUMIFS('Roadway by Mode'!L:L,'Roadway by Mode'!$C:$C,\"=\"&$C113,'Roadway by Mode'!$V:$V,\"=No\"),SUMIFS('Roadway by Mode'!L:L,'Roadway by Mode'!$C:$C,\"=\"&$C113))","v":3194},{"$f":"IF($X$2,SUMIFS('Track by Mode'!N:N,'Track by Mode'!$C:$C,\"=\"&$C113,'Track by Mode'!$AI:$AI,\"=No\"),SUMIFS('Track by Mode'!N:N,'Track by Mode'!$C:$C,\"=\"&$C113))","v":317.2},{"$f":"IF($X$2,SUMIFS('Track by Mode'!P:P,'Track by Mode'!$C:$C,\"=\"&$C113,'Track by Mode'!$AI:$AI,\"=No\"),SUMIFS('Track by Mode'!P:P,'Track by Mode'!$C:$C,\"=\"&$C113))","v":12.7},{"$f":"IF($X$2,SUMIFS('Track by Mode'!R:R,'Track by Mode'!$C:$C,\"=\"&$C113,'Track by Mode'!$AI:$AI,\"=No\"),SUMIFS('Track by Mode'!R:R,'Track by Mode'!$C:$C,\"=\"&$C113))","v":78.199999999999989},{"$f":"IF($X$2,SUMIFS('Track by Mode'!T:T,'Track by Mode'!$C:$C,\"=\"&$C113,'Track by Mode'!$AI:$AI,\"=No\"),SUMIFS('Track by Mode'!T:T,'Track by Mode'!$C:$C,\"=\"&$C113))","v":0.4},{"$f":"IF($X$2,SUMIFS('Track by Mode'!V:V,'Track by Mode'!$C:$C,\"=\"&$C113,'Track by Mode'!$AI:$AI,\"=No\"),SUMIFS('Track by Mode'!V:V,'Track by Mode'!$C:$C,\"=\"&$C113))","v":2.2000000000000002},{"$f":"IF($X$2,SUMIFS('Track by Mode'!X:X,'Track by Mode'!$C:$C,\"=\"&$C113,'Track by Mode'!$AI:$AI,\"=No\"),SUMIFS('Track by Mode'!X:X,'Track by Mode'!$C:$C,\"=\"&$C113))","v":6.2},{"$f":"IF($X$2,SUMIFS('Track by Mode'!Z:Z,'Track by Mode'!$C:$C,\"=\"&$C113,'Track by Mode'!$AI:$AI,\"=No\"),SUMIFS('Track by Mode'!Z:Z,'Track by Mode'!$C:$C,\"=\"&$C113))","v":416.89999999999992},{"$f":"IF($X$2,SUMIFS('Track by Mode'!AC:AC,'Track by Mode'!$C:$C,\"=\"&$C113,'Track by Mode'!$AI:$AI,\"=No\"),SUMIFS('Track by Mode'!AC:AC,'Track by Mode'!$C:$C,\"=\"&$C113))","v":435},{"$f":"IF($X$2,SUMIFS('Track by Mode'!AE:AE,'Track by Mode'!$C:$C,\"=\"&$C113,'Track by Mode'!$AI:$AI,\"=No\"),SUMIFS('Track by Mode'!AE:AE,'Track by Mode'!$C:$C,\"=\"&$C113))","v":118},{"$f":"IF($X$2,SUMIFS('Track by Mode'!AG:AG,'Track by Mode'!$C:$C,\"=\"&$C113,'Track by Mode'!$AI:$AI,\"=No\"),SUMIFS('Track by Mode'!AG:AG,'Track by Mode'!$C:$C,\"=\"&$C113))","v":553},{"$f":"IF($X$2,SUMIFS('Roadway by Mode'!N:N,'Roadway by Mode'!$C:$C,\"=\"&$C113,'Roadway by Mode'!$V:$V,\"=No\"),SUMIFS('Roadway by Mode'!N:N,'Roadway by Mode'!$C:$C,\"=\"&$C113))","v":0},{"$f":"IF($X$2,SUMIFS('Roadway by Mode'!P:P,'Roadway by Mode'!$C:$C,\"=\"&$C113,'Roadway by Mode'!$V:$V,\"=No\"),SUMIFS('Roadway by Mode'!P:P,'Roadway by Mode'!$C:$C,\"=\"&$C113))","v":132.30000000000001},{"$f":"IF($X$2,SUMIFS('Roadway by Mode'!R:R,'Roadway by Mode'!$C:$C,\"=\"&$C113,'Roadway by Mode'!$V:$V,\"=No\"),SUMIFS('Roadway by Mode'!R:R,'Roadway by Mode'!$C:$C,\"=\"&$C113))","v":120.10000000000001},{"$f":"IF($X$2,SUMIFS('Roadway by Mode'!T:T,'Roadway by Mode'!$C:$C,\"=\"&$C113,'Roadway by Mode'!$V:$V,\"=No\"),SUMIFS('Roadway by Mode'!T:T,'Roadway by Mode'!$C:$C,\"=\"&$C113))","v":252.39999999999998}]
[null,null,"UT","Utah",null,{"$f":"IF($X$2,SUMIFS('Track by Mode'!L:L,'Track by Mode'!$C:$C,\"=\"&$C114,'Track by Mode'!$AI:$AI,\"=No\"),SUMIFS('Track by Mode'!L:L,'Track by Mode'!$C:$C,\"=\"&$C114))+IF($X$2,SUMIFS('Roadway by Mode'!L:L,'Roadway by Mode'!$C:$C,\"=\"&$C114,'Roadway by Mode'!$V:$V,\"=No\"),SUMIFS('Roadway by Mode'!L:L,'Roadway by Mode'!$C:$C,\"=\"&$C114))","v":592},{"$f":"IF($X$2,SUMIFS('Track by Mode'!N:N,'Track by Mode'!$C:$C,\"=\"&$C114,'Track by Mode'!$AI:$AI,\"=No\"),SUMIFS('Track by Mode'!N:N,'Track by Mode'!$C:$C,\"=\"&$C114))","v":212.5},{"$f":"IF($X$2,SUMIFS('Track by Mode'!P:P,'Track by Mode'!$C:$C,\"=\"&$C114,'Track by Mode'!$AI:$AI,\"=No\"),SUMIFS('Track by Mode'!P:P,'Track by Mode'!$C:$C,\"=\"&$C114))","v":1},{"$f":"IF($X$2,SUMIFS('Track by Mode'!R:R,'Track by Mode'!$C:$C,\"=\"&$C114,'Track by Mode'!$AI:$AI,\"=No\"),SUMIFS('Track by Mode'!R:R,'Track by Mode'!$C:$C,\"=\"&$C114))","v":2.9000000000000004},{"$f":"IF($X$2,SUMIFS('Track by Mode'!T:T,'Track by Mode'!$C:$C,\"=\"&$C114,'Track by Mode'!$AI:$AI,\"=No\"),SUMIFS('Track by Mode'!T:T,'Track by Mode'!$C:$C,\"=\"&$C114))","v":9.6000000000000014},{"$f":"IF($X$2,SUMIFS('Track by Mode'!V:V,'Track by Mode'!$C:$C,\"=\"&$C114,'Track by Mode'!$AI:$AI,\"=No\"),SUMIFS('Track by Mode'!V:V,'Track by Mode'!$C:$C,\"=\"&$C114))","v":1.9},{"$f":"IF($X$2,SUMIFS('Track by Mode'!X:X,'Track by Mode'!$C:$C,\"=\"&$C114,'Track by Mode'!$AI:$AI,\"=No\"),SUMIFS('Track by Mode'!X:X,'Track by Mode'!$C:$C,\"=\"&$C114))","v":0},{"$f":"IF($X$2,SUMIFS('Track by Mode'!Z:Z,'Track by Mode'!$C:$C,\"=\"&$C114,'Track by Mode'!$AI:$AI,\"=No\"),SUMIFS('Track by Mode'!Z:Z,'Track by Mode'!$C:$C,\"=\"&$C114))","v":227.9},{"$f":"IF($X$2,SUMIFS('Track by Mode'!AC:AC,'Track by Mode'!$C:$C,\"=\"&$C114,'Track by Mode'!$AI:$AI,\"=No\"),SUMIFS('Track by Mode'!AC:AC,'Track by Mode'!$C:$C,\"=\"&$C114))","v":133},{"$f":"IF($X$2,SUMIFS('Track by Mode'!AE:AE,'Track by Mode'!$C:$C,\"=\"&$C114,'Track by Mode'!$AI:$AI,\"=No\"),SUMIFS('Track by Mode'!AE:AE,'Track by Mode'!$C:$C,\"=\"&$C114))","v":76},{"$f":"IF($X$2,SUMIFS('Track by Mode'!AG:AG,'Track by Mode'!$C:$C,\"=\"&$C114,'Track by Mode'!$AI:$AI,\"=No\"),SUMIFS('Track by Mode'!AG:AG,'Track by Mode'!$C:$C,\"=\"&$C114))","v":209},{"$f":"IF($X$2,SUMIFS('Roadway by Mode'!N:N,'Roadway by Mode'!$C:$C,\"=\"&$C114,'Roadway by Mode'!$V:$V,\"=No\"),SUMIFS('Roadway by Mode'!N:N,'Roadway by Mode'!$C:$C,\"=\"&$C114))","v":2.1},{"$f":"IF($X$2,SUMIFS('Roadway by Mode'!P:P,'Roadway by Mode'!$C:$C,\"=\"&$C114,'Roadway by Mode'!$V:$V,\"=No\"),SUMIFS('Roadway by Mode'!P:P,'Roadway by Mode'!$C:$C,\"=\"&$C114))","v":12.7},{"$f":"IF($X$2,SUMIFS('Roadway by Mode'!R:R,'Roadway by Mode'!$C:$C,\"=\"&$C114,'Roadway by Mode'!$V:$V,\"=No\"),SUMIFS('Roadway by Mode'!R:R,'Roadway by Mode'!$C:$C,\"=\"&$C114))","v":0},{"$f":"IF($X$2,SUMIFS('Roadway by Mode'!T:T,'Roadway by Mode'!$C:$C,\"=\"&$C114,'Roadway by Mode'!$V:$V,\"=No\"),SUMIFS('Roadway by Mode'!T:T,'Roadway by Mode'!$C:$C,\"=\"&$C114))","v":14.799999999999999}]
[null,null,"VA","Virginia",null,{"$f":"IF($X$2,SUMIFS('Track by Mode'!L:L,'Track by Mode'!$C:$C,\"=\"&$C115,'Track by Mode'!$AI:$AI,\"=No\"),SUMIFS('Track by Mode'!L:L,'Track by Mode'!$C:$C,\"=\"&$C115))+IF($X$2,SUMIFS('Roadway by Mode'!L:L,'Roadway by Mode'!$C:$C,\"=\"&$C115,'Roadway by Mode'!$V:$V,\"=No\"),SUMIFS('Roadway by Mode'!L:L,'Roadway by Mode'!$C:$C,\"=\"&$C115))","v":1149},{"$f":"IF($X$2,SUMIFS('Track by Mode'!N:N,'Track by Mode'!$C:$C,\"=\"&$C115,'Track by Mode'!$AI:$AI,\"=No\"),SUMIFS('Track by Mode'!N:N,'Track by Mode'!$C:$C,\"=\"&$C115))","v":175.6},{"$f":"IF($X$2,SUMIFS('Track by Mode'!P:P,'Track by Mode'!$C:$C,\"=\"&$C115,'Track by Mode'!$AI:$AI,\"=No\"),SUMIFS('Track by Mode'!P:P,'Track by Mode'!$C:$C,\"=\"&$C115))","v":1.9},{"$f":"IF($X$2,SUMIFS('Track by Mode'!R:R,'Track by Mode'!$C:$C,\"=\"&$C115,'Track by Mode'!$AI:$AI,\"=No\"),SUMIFS('Track by Mode'!R:R,'Track by Mode'!$C:$C,\"=\"&$C115))","v":3.5},{"$f":"IF($X$2,SUMIFS('Track by Mode'!T:T,'Track by Mode'!$C:$C,\"=\"&$C115,'Track by Mode'!$AI:$AI,\"=No\"),SUMIFS('Track by Mode'!T:T,'Track by Mode'!$C:$C,\"=\"&$C115))","v":0},{"$f":"IF($X$2,SUMIFS('Track by Mode'!V:V,'Track by Mode'!$C:$C,\"=\"&$C115,'Track by Mode'!$AI:$AI,\"=No\"),SUMIFS('Track by Mode'!V:V,'Track by Mode'!$C:$C,\"=\"&$C115))","v":0},{"$f":"IF($X$2,SUMIFS('Track by Mode'!X:X,'Track by Mode'!$C:$C,\"=\"&$C115,'Track by Mode'!$AI:$AI,\"=No\"),SUMIFS('Track by Mode'!X:X,'Track by Mode'!$C:$C,\"=\"&$C115))","v":0.9},{"$f":"IF($X$2,SUMIFS('Track by Mode'!Z:Z,'Track by Mode'!$C:$C,\"=\"&$C115,'Track by Mode'!$AI:$AI,\"=No\"),SUMIFS('Track by Mode'!Z:Z,'Track by Mode'!$C:$C,\"=\"&$C115))","v":181.9},{"$f":"IF($X$2,SUMIFS('Track by Mode'!AC:AC,'Track by Mode'!$C:$C,\"=\"&$C115,'Track by Mode'!$AI:$AI,\"=No\"),SUMIFS('Track by Mode'!AC:AC,'Track by Mode'!$C:$C,\"=\"&$C115))","v":34},{"$f":"IF($X$2,SUMIFS('Track by Mode'!AE:AE,'Track by Mode'!$C:$C,\"=\"&$C115,'Track by Mode'!$AI:$AI,\"=No\"),SUMIFS('Track by Mode'!AE:AE,'Track by Mode'!$C:$C,\"=\"&$C115))","v":8},{"$f":"IF($X$2,SUMIFS('Track by Mode'!AG:AG,'Track by Mode'!$C:$C,\"=\"&$C115,'Track by Mode'!$AI:$AI,\"=No\"),SUMIFS('Track by Mode'!AG:AG,'Track by Mode'!$C:$C,\"=\"&$C115))","v":42},{"$f":"IF($X$2,SUMIFS('Roadway by Mode'!N:N,'Roadway by Mode'!$C:$C,\"=\"&$C115,'Roadway by Mode'!$V:$V,\"=No\"),SUMIFS('Roadway by Mode'!N:N,'Roadway by Mode'!$C:$C,\"=\"&$C115))","v":0},{"$f":"IF($X$2,SUMIFS('Roadway by Mode'!P:P,'Roadway by Mode'!$C:$C,\"=\"&$C115,'Roadway by Mode'!$V:$V,\"=No\"),SUMIFS('Roadway by Mode'!P:P,'Roadway by Mode'!$C:$C,\"=\"&$C115))","v":0},{"$f":"IF($X$2,SUMIFS('Roadway by Mode'!R:R,'Roadway by Mode'!$C:$C,\"=\"&$C115,'Roadway by Mode'!$V:$V,\"=No\"),SUMIFS('Roadway by Mode'!R:R,'Roadway by Mode'!$C:$C,\"=\"&$C115))","v":277.89999999999998},{"$f":"IF($X$2,SUMIFS('Roadway by Mode'!T:T,'Roadway by Mode'!$C:$C,\"=\"&$C115,'Roadway by Mode'!$V:$V,\"=No\"),SUMIFS('Roadway by Mode'!T:T,'Roadway by Mode'!$C:$C,\"=\"&$C115))","v":277.89999999999998}]
[null,null,"VI","Virgin Islands",null,{"$f":"IF($X$2,SUMIFS('Track by Mode'!L:L,'Track by Mode'!$C:$C,\"=\"&$C116,'Track by Mode'!$AI:$AI,\"=No\"),SUMIFS('Track by Mode'!L:L,'Track by Mode'!$C:$C,\"=\"&$C116))+IF($X$2,SUMIFS('Roadway by Mode'!L:L,'Roadway by Mode'!$C:$C,\"=\"&$C116,'Roadway by Mode'!$V:$V,\"=No\"),SUMIFS('Roadway by Mode'!L:L,'Roadway by Mode'!$C:$C,\"=\"&$C116))","v":0},{"$f":"IF($X$2,SUMIFS('Track by Mode'!N:N,'Track by Mode'!$C:$C,\"=\"&$C116,'Track by Mode'!$AI:$AI,\"=No\"),SUMIFS('Track by Mode'!N:N,'Track by Mode'!$C:$C,\"=\"&$C116))","v":0},{"$f":"IF($X$2,SUMIFS('Track by Mode'!P:P,'Track by Mode'!$C:$C,\"=\"&$C116,'Track by Mode'!$AI:$AI,\"=No\"),SUMIFS('Track by Mode'!P:P,'Track by Mode'!$C:$C,\"=\"&$C116))","v":0},{"$f":"IF($X$2,SUMIFS('Track by Mode'!R:R,'Track by Mode'!$C:$C,\"=\"&$C116,'Track by Mode'!$AI:$AI,\"=No\"),SUMIFS('Track by Mode'!R:R,'Track by Mode'!$C:$C,\"=\"&$C116))","v":0},{"$f":"IF($X$2,SUMIFS('Track by Mode'!T:T,'Track by Mode'!$C:$C,\"=\"&$C116,'Track by Mode'!$AI:$AI,\"=No\"),SUMIFS('Track by Mode'!T:T,'Track by Mode'!$C:$C,\"=\"&$C116))","v":0},{"$f":"IF($X$2,SUMIFS('Track by Mode'!V:V,'Track by Mode'!$C:$C,\"=\"&$C116,'Track by Mode'!$AI:$AI,\"=No\"),SUMIFS('Track by Mode'!V:V,'Track by Mode'!$C:$C,\"=\"&$C116))","v":0},{"$f":"IF($X$2,SUMIFS('Track by Mode'!X:X,'Track by Mode'!$C:$C,\"=\"&$C116,'Track by Mode'!$AI:$AI,\"=No\"),SUMIFS('Track by Mode'!X:X,'Track by Mode'!$C:$C,\"=\"&$C116))","v":0},{"$f":"IF($X$2,SUMIFS('Track by Mode'!Z:Z,'Track by Mode'!$C:$C,\"=\"&$C116,'Track by Mode'!$AI:$AI,\"=No\"),SUMIFS('Track by Mode'!Z:Z,'Track by Mode'!$C:$C,\"=\"&$C116))","v":0},{"$f":"IF($X$2,SUMIFS('Track by Mode'!AC:AC,'Track by Mode'!$C:$C,\"=\"&$C116,'Track by Mode'!$AI:$AI,\"=No\"),SUMIFS('Track by Mode'!AC:AC,'Track by Mode'!$C:$C,\"=\"&$C116))","v":0},{"$f":"IF($X$2,SUMIFS('Track by Mode'!AE:AE,'Track by Mode'!$C:$C,\"=\"&$C116,'Track by Mode'!$AI:$AI,\"=No\"),SUMIFS('Track by Mode'!AE:AE,'Track by Mode'!$C:$C,\"=\"&$C116))","v":0},{"$f":"IF($X$2,SUMIFS('Track by Mode'!AG:AG,'Track by Mode'!$C:$C,\"=\"&$C116,'Track by Mode'!$AI:$AI,\"=No\"),SUMIFS('Track by Mode'!AG:AG,'Track by Mode'!$C:$C,\"=\"&$C116))","v":0},{"$f":"IF($X$2,SUMIFS('Roadway by Mode'!N:N,'Roadway by Mode'!$C:$C,\"=\"&$C116,'Roadway by Mode'!$V:$V,\"=No\"),SUMIFS('Roadway by Mode'!N:N,'Roadway by Mode'!$C:$C,\"=\"&$C116))","v":0},{"$f":"IF($X$2,SUMIFS('Roadway by Mode'!P:P,'Roadway by Mode'!$C:$C,\"=\"&$C116,'Roadway by Mode'!$V:$V,\"=No\"),SUMIFS('Roadway by Mode'!P:P,'Roadway by Mode'!$C:$C,\"=\"&$C116))","v":0},{"$f":"IF($X$2,SUMIFS('Roadway by Mode'!R:R,'Roadway by Mode'!$C:$C,\"=\"&$C116,'Roadway by Mode'!$V:$V,\"=No\"),SUMIFS('Roadway by Mode'!R:R,'Roadway by Mode'!$C:$C,\"=\"&$C116))","v":0},{"$f":"IF($X$2,SUMIFS('Roadway by Mode'!T:T,'Roadway by Mode'!$C:$C,\"=\"&$C116,'Roadway by Mode'!$V:$V,\"=No\"),SUMIFS('Roadway by Mode'!T:T,'Roadway by Mode'!$C:$C,\"=\"&$C116))","v":0}]
[null,null,"VT","Vermont",null,{"$f":"IF($X$2,SUMIFS('Track by Mode'!L:L,'Track by Mode'!$C:$C,\"=\"&$C117,'Track by Mode'!$AI:$AI,\"=No\"),SUMIFS('Track by Mode'!L:L,'Track by Mode'!$C:$C,\"=\"&$C117))+IF($X$2,SUMIFS('Roadway by Mode'!L:L,'Roadway by Mode'!$C:$C,\"=\"&$C117,'Roadway by Mode'!$V:$V,\"=No\"),SUMIFS('Roadway by Mode'!L:L,'Roadway by Mode'!$C:$C,\"=\"&$C117))","v":54},{"$f":"IF($X$2,SUMIFS('Track by Mode'!N:N,'Track by Mode'!$C:$C,\"=\"&$C117,'Track by Mode'!$AI:$AI,\"=No\"),SUMIFS('Track by Mode'!N:N,'Track by Mode'!$C:$C,\"=\"&$C117))","v":0},{"$f":"IF($X$2,SUMIFS('Track by Mode'!P:P,'Track by Mode'!$C:$C,\"=\"&$C117,'Track by Mode'!$AI:$AI,\"=No\"),SUMIFS('Track by Mode'!P:P,'Track by Mode'!$C:$C,\"=\"&$C117))","v":0},{"$f":"IF($X$2,SUMIFS('Track by Mode'!R:R,'Track by Mode'!$C:$C,\"=\"&$C117,'Track by Mode'!$AI:$AI,\"=No\"),SUMIFS('Track by Mode'!R:R,'Track by Mode'!$C:$C,\"=\"&$C117))","v":0},{"$f":"IF($X$2,SUMIFS('Track by Mode'!T:T,'Track by Mode'!$C:$C,\"=\"&$C117,'Track by Mode'!$AI:$AI,\"=No\"),SUMIFS('Track by Mode'!T:T,'Track by Mode'!$C:$C,\"=\"&$C117))","v":0},{"$f":"IF($X$2,SUMIFS('Track by Mode'!V:V,'Track by Mode'!$C:$C,\"=\"&$C117,'Track by Mode'!$AI:$AI,\"=No\"),SUMIFS('Track by Mode'!V:V,'Track by Mode'!$C:$C,\"=\"&$C117))","v":0},{"$f":"IF($X$2,SUMIFS('Track by Mode'!X:X,'Track by Mode'!$C:$C,\"=\"&$C117,'Track by Mode'!$AI:$AI,\"=No\"),SUMIFS('Track by Mode'!X:X,'Track by Mode'!$C:$C,\"=\"&$C117))","v":0},{"$f":"IF($X$2,SUMIFS('Track by Mode'!Z:Z,'Track by Mode'!$C:$C,\"=\"&$C117,'Track by Mode'!$AI:$AI,\"=No\"),SUMIFS('Track by Mode'!Z:Z,'Track by Mode'!$C:$C,\"=\"&$C117))","v":0},{"$f":"IF($X$2,SUMIFS('Track by Mode'!AC:AC,'Track by Mode'!$C:$C,\"=\"&$C117,'Track by Mode'!$AI:$AI,\"=No\"),SUMIFS('Track by Mode'!AC:AC,'Track by Mode'!$C:$C,\"=\"&$C117))","v":0},{"$f":"IF($X$2,SUMIFS('Track by Mode'!AE:AE,'Track by Mode'!$C:$C,\"=\"&$C117,'Track by Mode'!$AI:$AI,\"=No\"),SUMIFS('Track by Mode'!AE:AE,'Track by Mode'!$C:$C,\"=\"&$C117))","v":0},{"$f":"IF($X$2,SUMIFS('Track by Mode'!AG:AG,'Track by Mode'!$C:$C,\"=\"&$C117,'Track by Mode'!$AI:$AI,\"=No\"),SUMIFS('Track by Mode'!AG:AG,'Track by Mode'!$C:$C,\"=\"&$C117))","v":0},{"$f":"IF($X$2,SUMIFS('Roadway by Mode'!N:N,'Roadway by Mode'!$C:$C,\"=\"&$C117,'Roadway by Mode'!$V:$V,\"=No\"),SUMIFS('Roadway by Mode'!N:N,'Roadway by Mode'!$C:$C,\"=\"&$C117))","v":0},{"$f":"IF($X$2,SUMIFS('Roadway by Mode'!P:P,'Roadway by Mode'!$C:$C,\"=\"&$C117,'Roadway by Mode'!$V:$V,\"=No\"),SUMIFS('Roadway by Mode'!P:P,'Roadway by Mode'!$C:$C,\"=\"&$C117))","v":0},{"$f":"IF($X$2,SUMIFS('Roadway by Mode'!R:R,'Roadway by Mode'!$C:$C,\"=\"&$C117,'Roadway by Mode'!$V:$V,\"=No\"),SUMIFS('Roadway by Mode'!R:R,'Roadway by Mode'!$C:$C,\"=\"&$C117))","v":0},{"$f":"IF($X$2,SUMIFS('Roadway by Mode'!T:T,'Roadway by Mode'!$C:$C,\"=\"&$C117,'Roadway by Mode'!$V:$V,\"=No\"),SUMIFS('Roadway by Mode'!T:T,'Roadway by Mode'!$C:$C,\"=\"&$C117))","v":0}]
[null,null,"WA","Washington",null,{"$f":"IF($X$2,SUMIFS('Track by Mode'!L:L,'Track by Mode'!$C:$C,\"=\"&$C118,'Track by Mode'!$AI:$AI,\"=No\"),SUMIFS('Track by Mode'!L:L,'Track by Mode'!$C:$C,\"=\"&$C118))+IF($X$2,SUMIFS('Roadway by Mode'!L:L,'Roadway by Mode'!$C:$C,\"=\"&$C118,'Roadway by Mode'!$V:$V,\"=No\"),SUMIFS('Roadway by Mode'!L:L,'Roadway by Mode'!$C:$C,\"=\"&$C118))","v":2250},{"$f":"IF($X$2,SUMIFS('Track by Mode'!N:N,'Track by Mode'!$C:$C,\"=\"&$C118,'Track by Mode'!$AI:$AI,\"=No\"),SUMIFS('Track by Mode'!N:N,'Track by Mode'!$C:$C,\"=\"&$C118))","v":177.7},{"$f":"IF($X$2,SUMIFS('Track by Mode'!P:P,'Track by Mode'!$C:$C,\"=\"&$C118,'Track by Mode'!$AI:$AI,\"=No\"),SUMIFS('Track by Mode'!P:P,'Track by Mode'!$C:$C,\"=\"&$C118))","v":3.5},{"$f":"IF($X$2,SUMIFS('Track by Mode'!R:R,'Track by Mode'!$C:$C,\"=\"&$C118,'Track by Mode'!$AI:$AI,\"=No\"),SUMIFS('Track by Mode'!R:R,'Track by Mode'!$C:$C,\"=\"&$C118))","v":15.2},{"$f":"IF($X$2,SUMIFS('Track by Mode'!T:T,'Track by Mode'!$C:$C,\"=\"&$C118,'Track by Mode'!$AI:$AI,\"=No\"),SUMIFS('Track by Mode'!T:T,'Track by Mode'!$C:$C,\"=\"&$C118))","v":0},{"$f":"IF($X$2,SUMIFS('Track by Mode'!V:V,'Track by Mode'!$C:$C,\"=\"&$C118,'Track by Mode'!$AI:$AI,\"=No\"),SUMIFS('Track by Mode'!V:V,'Track by Mode'!$C:$C,\"=\"&$C118))","v":0.6},{"$f":"IF($X$2,SUMIFS('Track by Mode'!X:X,'Track by Mode'!$C:$C,\"=\"&$C118,'Track by Mode'!$AI:$AI,\"=No\"),SUMIFS('Track by Mode'!X:X,'Track by Mode'!$C:$C,\"=\"&$C118))","v":7.5},{"$f":"IF($X$2,SUMIFS('Track by Mode'!Z:Z,'Track by Mode'!$C:$C,\"=\"&$C118,'Track by Mode'!$AI:$AI,\"=No\"),SUMIFS('Track by Mode'!Z:Z,'Track by Mode'!$C:$C,\"=\"&$C118))","v":204.5},{"$f":"IF($X$2,SUMIFS('Track by Mode'!AC:AC,'Track by Mode'!$C:$C,\"=\"&$C118,'Track by Mode'!$AI:$AI,\"=No\"),SUMIFS('Track by Mode'!AC:AC,'Track by Mode'!$C:$C,\"=\"&$C118))","v":113},{"$f":"IF($X$2,SUMIFS('Track by Mode'!AE:AE,'Track by Mode'!$C:$C,\"=\"&$C118,'Track by Mode'!$AI:$AI,\"=No\"),SUMIFS('Track by Mode'!AE:AE,'Track by Mode'!$C:$C,\"=\"&$C118))","v":22},{"$f":"IF($X$2,SUMIFS('Track by Mode'!AG:AG,'Track by Mode'!$C:$C,\"=\"&$C118,'Track by Mode'!$AI:$AI,\"=No\"),SUMIFS('Track by Mode'!AG:AG,'Track by Mode'!$C:$C,\"=\"&$C118))","v":135},{"$f":"IF($X$2,SUMIFS('Roadway by Mode'!N:N,'Roadway by Mode'!$C:$C,\"=\"&$C118,'Roadway by Mode'!$V:$V,\"=No\"),SUMIFS('Roadway by Mode'!N:N,'Roadway by Mode'!$C:$C,\"=\"&$C118))","v":133.70000000000002},{"$f":"IF($X$2,SUMIFS('Roadway by Mode'!P:P,'Roadway by Mode'!$C:$C,\"=\"&$C118,'Roadway by Mode'!$V:$V,\"=No\"),SUMIFS('Roadway by Mode'!P:P,'Roadway by Mode'!$C:$C,\"=\"&$C118))","v":494.30000000000007},{"$f":"IF($X$2,SUMIFS('Roadway by Mode'!R:R,'Roadway by Mode'!$C:$C,\"=\"&$C118,'Roadway by Mode'!$V:$V,\"=No\"),SUMIFS('Roadway by Mode'!R:R,'Roadway by Mode'!$C:$C,\"=\"&$C118))","v":196},{"$f":"IF($X$2,SUMIFS('Roadway by Mode'!T:T,'Roadway by Mode'!$C:$C,\"=\"&$C118,'Roadway by Mode'!$V:$V,\"=No\"),SUMIFS('Roadway by Mode'!T:T,'Roadway by Mode'!$C:$C,\"=\"&$C118))","v":824}]
[null,null,"WI","Wisconsin",null,{"$f":"IF($X$2,SUMIFS('Track by Mode'!L:L,'Track by Mode'!$C:$C,\"=\"&$C119,'Track by Mode'!$AI:$AI,\"=No\"),SUMIFS('Track by Mode'!L:L,'Track by Mode'!$C:$C,\"=\"&$C119))+IF($X$2,SUMIFS('Roadway by Mode'!L:L,'Roadway by Mode'!$C:$C,\"=\"&$C119,'Roadway by Mode'!$V:$V,\"=No\"),SUMIFS('Roadway by Mode'!L:L,'Roadway by Mode'!$C:$C,\"=\"&$C119))","v":762},{"$f":"IF($X$2,SUMIFS('Track by Mode'!N:N,'Track by Mode'!$C:$C,\"=\"&$C119,'Track by Mode'!$AI:$AI,\"=No\"),SUMIFS('Track by Mode'!N:N,'Track by Mode'!$C:$C,\"=\"&$C119))","v":2},{"$f":"IF($X$2,SUMIFS('Track by Mode'!P:P,'Track by Mode'!$C:$C,\"=\"&$C119,'Track by Mode'!$AI:$AI,\"=No\"),SUMIFS('Track by Mode'!P:P,'Track by Mode'!$C:$C,\"=\"&$C119))","v":0},{"$f":"IF($X$2,SUMIFS('Track by Mode'!R:R,'Track by Mode'!$C:$C,\"=\"&$C119,'Track by Mode'!$AI:$AI,\"=No\"),SUMIFS('Track by Mode'!R:R,'Track by Mode'!$C:$C,\"=\"&$C119))","v":0},{"$f":"IF($X$2,SUMIFS('Track by Mode'!T:T,'Track by Mode'!$C:$C,\"=\"&$C119,'Track by Mode'!$AI:$AI,\"=No\"),SUMIFS('Track by Mode'!T:T,'Track by Mode'!$C:$C,\"=\"&$C119))","v":0},{"$f":"IF($X$2,SUMIFS('Track by Mode'!V:V,'Track by Mode'!$C:$C,\"=\"&$C119,'Track by Mode'!$AI:$AI,\"=No\"),SUMIFS('Track by Mode'!V:V,'Track by Mode'!$C:$C,\"=\"&$C119))","v":0},{"$f":"IF($X$2,SUMIFS('Track by Mode'!X:X,'Track by Mode'!$C:$C,\"=\"&$C119,'Track by Mode'!$AI:$AI,\"=No\"),SUMIFS('Track by Mode'!X:X,'Track by Mode'!$C:$C,\"=\"&$C119))","v":0},{"$f":"IF($X$2,SUMIFS('Track by Mode'!Z:Z,'Track by Mode'!$C:$C,\"=\"&$C119,'Track by Mode'!$AI:$AI,\"=No\"),SUMIFS('Track by Mode'!Z:Z,'Track by Mode'!$C:$C,\"=\"&$C119))","v":2},{"$f":"IF($X$2,SUMIFS('Track by Mode'!AC:AC,'Track by Mode'!$C:$C,\"=\"&$C119,'Track by Mode'!$AI:$AI,\"=No\"),SUMIFS('Track by Mode'!AC:AC,'Track by Mode'!$C:$C,\"=\"&$C119))","v":14},{"$f":"IF($X$2,SUMIFS('Track by Mode'!AE:AE,'Track by Mode'!$C:$C,\"=\"&$C119,'Track by Mode'!$AI:$AI,\"=No\"),SUMIFS('Track by Mode'!AE:AE,'Track by Mode'!$C:$C,\"=\"&$C119))","v":0},{"$f":"IF($X$2,SUMIFS('Track by Mode'!AG:AG,'Track by Mode'!$C:$C,\"=\"&$C119,'Track by Mode'!$AI:$AI,\"=No\"),SUMIFS('Track by Mode'!AG:AG,'Track by Mode'!$C:$C,\"=\"&$C119))","v":14},{"$f":"IF($X$2,SUMIFS('Roadway by Mode'!N:N,'Roadway by Mode'!$C:$C,\"=\"&$C119,'Roadway by Mode'!$V:$V,\"=No\"),SUMIFS('Roadway by Mode'!N:N,'Roadway by Mode'!$C:$C,\"=\"&$C119))","v":23.2},{"$f":"IF($X$2,SUMIFS('Roadway by Mode'!P:P,'Roadway by Mode'!$C:$C,\"=\"&$C119,'Roadway by Mode'!$V:$V,\"=No\"),SUMIFS('Roadway by Mode'!P:P,'Roadway by Mode'!$C:$C,\"=\"&$C119))","v":0},{"$f":"IF($X$2,SUMIFS('Roadway by Mode'!R:R,'Roadway by Mode'!$C:$C,\"=\"&$C119,'Roadway by Mode'!$V:$V,\"=No\"),SUMIFS('Roadway by Mode'!R:R,'Roadway by Mode'!$C:$C,\"=\"&$C119))","v":0},{"$f":"IF($X$2,SUMIFS('Roadway by Mode'!T:T,'Roadway by Mode'!$C:$C,\"=\"&$C119,'Roadway by Mode'!$V:$V,\"=No\"),SUMIFS('Roadway by Mode'!T:T,'Roadway by Mode'!$C:$C,\"=\"&$C119))","v":23.2}]
[null,null,"WV","West Virginia",null,{"$f":"IF($X$2,SUMIFS('Track by Mode'!L:L,'Track by Mode'!$C:$C,\"=\"&$C120,'Track by Mode'!$AI:$AI,\"=No\"),SUMIFS('Track by Mode'!L:L,'Track by Mode'!$C:$C,\"=\"&$C120))+IF($X$2,SUMIFS('Roadway by Mode'!L:L,'Roadway by Mode'!$C:$C,\"=\"&$C120,'Roadway by Mode'!$V:$V,\"=No\"),SUMIFS('Roadway by Mode'!L:L,'Roadway by Mode'!$C:$C,\"=\"&$C120))","v":150},{"$f":"IF($X$2,SUMIFS('Track by Mode'!N:N,'Track by Mode'!$C:$C,\"=\"&$C120,'Track by Mode'!$AI:$AI,\"=No\"),SUMIFS('Track by Mode'!N:N,'Track by Mode'!$C:$C,\"=\"&$C120))","v":4},{"$f":"IF($X$2,SUMIFS('Track by Mode'!P:P,'Track by Mode'!$C:$C,\"=\"&$C120,'Track by Mode'!$AI:$AI,\"=No\"),SUMIFS('Track by Mode'!P:P,'Track by Mode'!$C:$C,\"=\"&$C120))","v":0},{"$f":"IF($X$2,SUMIFS('Track by Mode'!R:R,'Track by Mode'!$C:$C,\"=\"&$C120,'Track by Mode'!$AI:$AI,\"=No\"),SUMIFS('Track by Mode'!R:R,'Track by Mode'!$C:$C,\"=\"&$C120))","v":4.7},{"$f":"IF($X$2,SUMIFS('Track by Mode'!T:T,'Track by Mode'!$C:$C,\"=\"&$C120,'Track by Mode'!$AI:$AI,\"=No\"),SUMIFS('Track by Mode'!T:T,'Track by Mode'!$C:$C,\"=\"&$C120))","v":0},{"$f":"IF($X$2,SUMIFS('Track by Mode'!V:V,'Track by Mode'!$C:$C,\"=\"&$C120,'Track by Mode'!$AI:$AI,\"=No\"),SUMIFS('Track by Mode'!V:V,'Track by Mode'!$C:$C,\"=\"&$C120))","v":0},{"$f":"IF($X$2,SUMIFS('Track by Mode'!X:X,'Track by Mode'!$C:$C,\"=\"&$C120,'Track by Mode'!$AI:$AI,\"=No\"),SUMIFS('Track by Mode'!X:X,'Track by Mode'!$C:$C,\"=\"&$C120))","v":0},{"$f":"IF($X$2,SUMIFS('Track by Mode'!Z:Z,'Track by Mode'!$C:$C,\"=\"&$C120,'Track by Mode'!$AI:$AI,\"=No\"),SUMIFS('Track by Mode'!Z:Z,'Track by Mode'!$C:$C,\"=\"&$C120))","v":8.6999999999999993},{"$f":"IF($X$2,SUMIFS('Track by Mode'!AC:AC,'Track by Mode'!$C:$C,\"=\"&$C120,'Track by Mode'!$AI:$AI,\"=No\"),SUMIFS('Track by Mode'!AC:AC,'Track by Mode'!$C:$C,\"=\"&$C120))","v":0},{"$f":"IF($X$2,SUMIFS('Track by Mode'!AE:AE,'Track by Mode'!$C:$C,\"=\"&$C120,'Track by Mode'!$AI:$AI,\"=No\"),SUMIFS('Track by Mode'!AE:AE,'Track by Mode'!$C:$C,\"=\"&$C120))","v":0},{"$f":"IF($X$2,SUMIFS('Track by Mode'!AG:AG,'Track by Mode'!$C:$C,\"=\"&$C120,'Track by Mode'!$AI:$AI,\"=No\"),SUMIFS('Track by Mode'!AG:AG,'Track by Mode'!$C:$C,\"=\"&$C120))","v":0},{"$f":"IF($X$2,SUMIFS('Roadway by Mode'!N:N,'Roadway by Mode'!$C:$C,\"=\"&$C120,'Roadway by Mode'!$V:$V,\"=No\"),SUMIFS('Roadway by Mode'!N:N,'Roadway by Mode'!$C:$C,\"=\"&$C120))","v":0},{"$f":"IF($X$2,SUMIFS('Roadway by Mode'!P:P,'Roadway by Mode'!$C:$C,\"=\"&$C120,'Roadway by Mode'!$V:$V,\"=No\"),SUMIFS('Roadway by Mode'!P:P,'Roadway by Mode'!$C:$C,\"=\"&$C120))","v":0},{"$f":"IF($X$2,SUMIFS('Roadway by Mode'!R:R,'Roadway by Mode'!$C:$C,\"=\"&$C120,'Roadway by Mode'!$V:$V,\"=No\"),SUMIFS('Roadway by Mode'!R:R,'Roadway by Mode'!$C:$C,\"=\"&$C120))","v":0},{"$f":"IF($X$2,SUMIFS('Roadway by Mode'!T:T,'Roadway by Mode'!$C:$C,\"=\"&$C120,'Roadway by Mode'!$V:$V,\"=No\"),SUMIFS('Roadway by Mode'!T:T,'Roadway by Mode'!$C:$C,\"=\"&$C120))","v":0}]
[null,null,"WY","Wyoming",null,{"$f":"IF($X$2,SUMIFS('Track by Mode'!L:L,'Track by Mode'!$C:$C,\"=\"&$C121,'Track by Mode'!$AI:$AI,\"=No\"),SUMIFS('Track by Mode'!L:L,'Track by Mode'!$C:$C,\"=\"&$C121))+IF($X$2,SUMIFS('Roadway by Mode'!L:L,'Roadway by Mode'!$C:$C,\"=\"&$C121,'Roadway by Mode'!$V:$V,\"=No\"),SUMIFS('Roadway by Mode'!L:L,'Roadway by Mode'!$C:$C,\"=\"&$C121))","v":0},{"$f":"IF($X$2,SUMIFS('Track by Mode'!N:N,'Track by Mode'!$C:$C,\"=\"&$C121,'Track by Mode'!$AI:$AI,\"=No\"),SUMIFS('Track by Mode'!N:N,'Track by Mode'!$C:$C,\"=\"&$C121))","v":0},{"$f":"IF($X$2,SUMIFS('Track by Mode'!P:P,'Track by Mode'!$C:$C,\"=\"&$C121,'Track by Mode'!$AI:$AI,\"=No\"),SUMIFS('Track by Mode'!P:P,'Track by Mode'!$C:$C,\"=\"&$C121))","v":0},{"$f":"IF($X$2,SUMIFS('Track by Mode'!R:R,'Track by Mode'!$C:$C,\"=\"&$C121,'Track by Mode'!$AI:$AI,\"=No\"),SUMIFS('Track by Mode'!R:R,'Track by Mode'!$C:$C,\"=\"&$C121))","v":0},{"$f":"IF($X$2,SUMIFS('Track by Mode'!T:T,'Track by Mode'!$C:$C,\"=\"&$C121,'Track by Mode'!$AI:$AI,\"=No\"),SUMIFS('Track by Mode'!T:T,'Track by Mode'!$C:$C,\"=\"&$C121))","v":0},{"$f":"IF($X$2,SUMIFS('Track by Mode'!V:V,'Track by Mode'!$C:$C,\"=\"&$C121,'Track by Mode'!$AI:$AI,\"=No\"),SUMIFS('Track by Mode'!V:V,'Track by Mode'!$C:$C,\"=\"&$C121))","v":0},{"$f":"IF($X$2,SUMIFS('Track by Mode'!X:X,'Track by Mode'!$C:$C,\"=\"&$C121,'Track by Mode'!$AI:$AI,\"=No\"),SUMIFS('Track by Mode'!X:X,'Track by Mode'!$C:$C,\"=\"&$C121))","v":0},{"$f":"IF($X$2,SUMIFS('Track by Mode'!Z:Z,'Track by Mode'!$C:$C,\"=\"&$C121,'Track by Mode'!$AI:$AI,\"=No\"),SUMIFS('Track by Mode'!Z:Z,'Track by Mode'!$C:$C,\"=\"&$C121))","v":0},{"$f":"IF($X$2,SUMIFS('Track by Mode'!AC:AC,'Track by Mode'!$C:$C,\"=\"&$C121,'Track by Mode'!$AI:$AI,\"=No\"),SUMIFS('Track by Mode'!AC:AC,'Track by Mode'!$C:$C,\"=\"&$C121))","v":0},{"$f":"IF($X$2,SUMIFS('Track by Mode'!AE:AE,'Track by Mode'!$C:$C,\"=\"&$C121,'Track by Mode'!$AI:$AI,\"=No\"),SUMIFS('Track by Mode'!AE:AE,'Track by Mode'!$C:$C,\"=\"&$C121))","v":0},{"$f":"IF($X$2,SUMIFS('Track by Mode'!AG:AG,'Track by Mode'!$C:$C,\"=\"&$C121,'Track by Mode'!$AI:$AI,\"=No\"),SUMIFS('Track by Mode'!AG:AG,'Track by Mode'!$C:$C,\"=\"&$C121))","v":0},{"$f":"IF($X$2,SUMIFS('Roadway by Mode'!N:N,'Roadway by Mode'!$C:$C,\"=\"&$C121,'Roadway by Mode'!$V:$V,\"=No\"),SUMIFS('Roadway by Mode'!N:N,'Roadway by Mode'!$C:$C,\"=\"&$C121))","v":0},{"$f":"IF($X$2,SUMIFS('Roadway by Mode'!P:P,'Roadway by Mode'!$C:$C,\"=\"&$C121,'Roadway by Mode'!$V:$V,\"=No\"),SUMIFS('Roadway by Mode'!P:P,'Roadway by Mode'!$C:$C,\"=\"&$C121))","v":0},{"$f":"IF($X$2,SUMIFS('Roadway by Mode'!R:R,'Roadway by Mode'!$C:$C,\"=\"&$C121,'Roadway by Mode'!$V:$V,\"=No\"),SUMIFS('Roadway by Mode'!R:R,'Roadway by Mode'!$C:$C,\"=\"&$C121))","v":0},{"$f":"IF($X$2,SUMIFS('Roadway by Mode'!T:T,'Roadway by Mode'!$C:$C,\"=\"&$C121,'Roadway by Mode'!$V:$V,\"=No\"),SUMIFS('Roadway by Mode'!T:T,'Roadway by Mode'!$C:$C,\"=\"&$C121))","v":0}]