{"text_format":"1","workbook":"xlsx","n_sheets":6,"sheets":["Read Me","Data Dictionary","Track by Mode","Roadway by Mode","Track and Roadway by Agency","Summary Tables"],"not_rendered":{"charts":4,"images":0,"macros":1,"external_links":0,"defined_names":18,"comments":0,"pivot_tables":0},"unopened":[],"bounds":{"document_bytes":16777216,"sheet_cells":100000,"rows_first":2000,"rows_last":500,"rows_between":2000,"halvings":0,"cell_chars":16384,"cell_head_chars":4096},"cells_cut":0,"cells_raw":0,"read":"whole","date_system":"1900"}

{"sheet":"Read Me","index":0,"n_rows":0,"n_cols":0,"rows_kept":0,"cut":false,"hidden":false,"merged":[]}

{"sheet":"Data Dictionary","index":1,"n_rows":56,"n_cols":3,"rows_kept":56,"cut":false,"hidden":false,"merged":[]}
["Term","Who reports it?","Definition"]
["Agency","All","The transit agency's name."]
["City","All","The city in which the agency is headquartered."]
["State","All","The state in which the agency is headquartered."]
["Legacy NTD ID","All","A four-digit identifying number for each agency used in the legacy NTD system."]
["NTD ID","All","A five-digit identifying number for each agency used in the current NTD system."]
["Organization Type","All","Description of the agency's legal entity."]
["Reporter Type","All","The type of NTD report that the agency completed this year."]
{"$rows_left_out":49}
{"sheet":"Track by Mode","index":2,"n_rows":95,"n_cols":39,"rows_kept":95,"cut":false,"hidden":false,"merged":[]}
["Name","City","State","Legacy NTD ID","NTD ID","Organization Type","Reporter Type","Primary UZA Population","Agency VOMS","Mode","TOS","Mode VOMS","Miles of Track:","At Grade: Restricted Right-of-Way","At Grade: Restricted Right-of-Way Questionable","Street Running","Street Running Questionable","Elevated on Structure","Elevated on Structure Questionable","Elevated on Fill","Elevated on Fill Questionable","Open Cut","Open Cut Questionable","Subway","Subway Questionable","Total Miles","Total Miles Questionable","Number of Crossings:","At Grade: Restricted Right-of-Way Crossings","At Grade: Restricted Right-of-Way Questionable","Street Running Crossings","Street Running Questionable","Total Crossings","Total Crossings Questionable","Any data questionable?",null,null,null,{"$f":"IF(AM4=1,1,0)","v":1}]
["MTA New York City Transit","New York","NY",2008,20008,"Subsidiary Unit of a Transit Agency, Reporting Separately","Full Reporter",18351295,11000,"HR","DO",5282,null,137.30000000000001,"",0,"",196.3,"",29,"",29.5,"",440.4,"",832.5,"",null,0,"",0,"",0,"",{"$f":"IF(OR(O2=\"Q\",Q2=\"Q\",S2=\"Q\",U2=\"Q\", W2=\"Q\", Y2=\"Q\",AA2=\"Q\",AD2=\"Q\", AF2=\"Q\",AH2=\"Q\"),\"Yes\",\"No\")","v":"No"},null,null,null,"Hide questionable data tags"]
["New Jersey Transit Corporation","Newark","NJ",2080,20080,"Other Publicly-Owned or Privately Chartered Corporation","Full Reporter",18351295,4020,"CR","DO",1267,null,812.59999999999991,"",0,"",10.4,"",28.4,"",8.6,"",8,"",867.99999999999989,"",null,328,"",0,"",328,"",{"$f":"IF(OR(O3=\"Q\",Q3=\"Q\",S3=\"Q\",U3=\"Q\", W3=\"Q\", Y3=\"Q\",AA3=\"Q\",AD3=\"Q\", AF3=\"Q\",AH3=\"Q\"),\"Yes\",\"No\")","v":"No"},null,null,null,"Show questionable data tags"]
["New Jersey Transit Corporation","Newark","NJ",2080,20080,"Other Publicly-Owned or Privately Chartered Corporation","Full Reporter",18351295,4020,"LR","PT",42,null,31.299999999999997,"",1.6,"",2.7,"",0.9,"",0,"",0,"",36.5,"",null,24,"",9,"",33,"","No",null,null,null,1]
["New Jersey Transit Corporation","Newark","NJ",2080,20080,"Other Publicly-Owned or Privately Chartered Corporation","Full Reporter",18351295,4020,"YR","PT",16,null,52.9,"",3.8,"",0,"",0,"",0,"",0,"",56.699999999999996,"",null,59,"",13,"",72,"","No"]
["New Jersey Transit Corporation","Newark","NJ",2080,20080,"Other Publicly-Owned or Privately Chartered Corporation","Full Reporter",18351295,4020,"LR","DO",14,null,9.1,"",1.5,"",0,"",0,"",0,"",3.3,"",13.899999999999999,"",null,5,"",10,"",15,"","No"]
["Los Angeles County Metropolitan Transportation Authority dba: Metro","Los Angeles","CA",9154,90154,"Independent Public Agency or Authority of Transit Service","Full Reporter",12150996,3516,"LR","DO",144,null,72,"",0,"",15.5,"",26,"",16.7,"",5.6,"",135.80000000000001,"",null,152,"",0,"",152,"","No"]
["Los Angeles County Metropolitan Transportation Authority dba: Metro","Los Angeles","CA",9154,90154,"Independent Public Agency or Authority of Transit Service","Full Reporter",12150996,3516,"HR","DO",70,null,1.3,"",0,"",0,"",0,"",0.2,"",32.6,"",34.1,"",null,0,"",0,"",0,"","No"]
{"$rows_left_out":88}
{"sheet":"Roadway by Mode","index":3,"n_rows":590,"n_cols":26,"rows_kept":590,"cut":false,"hidden":false,"merged":[]}
["Name","City","State","Legacy NTD ID","NTD ID","Organization Type","Reporter Type","Primary UZA Population","Agency VOMS","Mode","TOS","Mode VOMS","Miles of Roadway:","Permanent Busway","Permanent Busway Questionable","Permanent HOV","Permanent HOV Questionable","Part-Time Busway or HOV","Part-Time Busway or HOV Questionable","Total Miles","Total Miles Questionable","Any data questionable?",null,null,null,{"$f":"IF(Z4=1,1,0)","v":1}]
["MTA New York City Transit","New York","NY",2008,20008,"Subsidiary Unit of a Transit Agency, Reporting Separately","Full Reporter",18351295,11000,"MB","DO",3314,null,24.3,"",0,"",62.4,"",86.7,"",{"$f":"IF(OR(O2=\"Q\",Q2=\"Q\",S2=\"Q\",U2=\"Q\"),\"Yes\",\"No\")","v":"No"},null,null,null,"Hide questionable data tags"]
["MTA New York City Transit","New York","NY",2008,20008,"Subsidiary Unit of a Transit Agency, Reporting Separately","Full Reporter",18351295,11000,"CB","DO",456,null,5.9,"",9.6,"",25.9,"",41.4,"","No",null,null,null,"Show questionable data tags"]
["MTA New York City Transit","New York","NY",2008,20008,"Subsidiary Unit of a Transit Agency, Reporting Separately","Full Reporter",18351295,11000,"RB","DO",108,null,52.6,"",0,"",0,"",52.6,"","No",null,null,null,1]
["New Jersey Transit Corporation","Newark","NJ",2080,20080,"Other Publicly-Owned or Privately Chartered Corporation","Full Reporter",18351295,4020,"MB","DO",1870,null,0.5,"",0,"",35.799999999999997,"",36.299999999999997,"","No"]
["New Jersey Transit Corporation","Newark","NJ",2080,20080,"Other Publicly-Owned or Privately Chartered Corporation","Full Reporter",18351295,4020,"MB","PT",181,null,"","","","","","",0,"","No"]
["Los Angeles County Metropolitan Transportation Authority dba: Metro","Los Angeles","CA",9154,90154,"Independent Public Agency or Authority of Transit Service","Full Reporter",12150996,3516,"MB","DO",1766,null,2.5,"",34.1,"",0,"",36.6,"","No"]
["Los Angeles County Metropolitan Transportation Authority dba: Metro","Los Angeles","CA",9154,90154,"Independent Public Agency or Authority of Transit Service","Full Reporter",12150996,3516,"MB","PT",125,null,2.5,"",38.4,"",0,"",40.9,"","No"]
{"$rows_left_out":583}
{"sheet":"Track and Roadway by Agency","index":4,"n_rows":534,"n_cols":45,"rows_kept":534,"cut":false,"hidden":false,"merged":[]}
["Name","City","State","Legacy NTD ID","NTD ID","Organization Type","Reporter Type","Primary UZA Population","VOMS","Miles of Track:","At Grade: Restricted Right-of-Way","At Grade: Restricted Right-of-Way Questionable","Street Running","Street Running Questionable","Elevated on Structure","Elevated on Structure Questionable","Elevated on Fill","Elevated on Fill Questionable","Open Cut","Open Cut Questionable","Subway","Subway Questionable","Total Track Miles","Total Track Miles Questionable","Number of Crossings:","At Grade: Restricted Right-of-Way Crossings","At Grade: Restricted Right-of-Way Questionable","Street Running Crossings","Street Running Questionable","Total Crossings","Total Crossings Questionable","Miles of Roadway:","Permanent Busway","Permanent Busway Questionable","Permanent HOV","Permanent HOV Questionable","Part-Time Busway or HOV","Part-Time Busway or HOV Questionable","Total Roadway Miles","Total Roadway Miles Questionable","Any data questionable?",null,null,null,{"$f":"IF(AS4=1,1,0)","v":1}]
["MTA New York City Transit","New York","NY",2008,20008,"Subsidiary Unit of a Transit Agency, Reporting Separately","Full Reporter",18351295,11000,null,137.30000000000001,"",0,"",196.3,"",29,"",29.5,"",440.4,"",832.5,"",null,0,"",0,"",0,"",null,82.800000000000011,"",9.6,"",88.3,"",180.7,"",{"$f":"IF(OR(L2=\"Q\",N2=\"Q\",P2=\"Q\",R2=\"Q\",T2=\"Q\",V2=\"Q\",X2=\"Q\",AA2=\"Q\",AC2=\"Q\",AE2=\"Q\",AH2=\"Q\",AJ2=\"Q\",AL2=\"Q\",AN2=\"Q\"),\"Yes\",\"No\")","v":"No"},null,null,null,"Hide questionable data tags"]
["New Jersey Transit Corporation","Newark","NJ",2080,20080,"Other Publicly-Owned or Privately Chartered Corporation","Full Reporter",18351295,4020,null,905.89999999999986,"",6.9,"",13.100000000000001,"",29.299999999999997,"",8.6,"",11.3,"",975.09999999999991,"",null,416,"",32,"",448,"",null,0.5,"",0,"",35.799999999999997,"",36.299999999999997,"","No",null,null,null,"Show questionable data tags"]
["Los Angeles County Metropolitan Transportation Authority dba: Metro","Los Angeles","CA",9154,90154,"Independent Public Agency or Authority of Transit Service","Full Reporter",12150996,3516,null,73.3,"",0,"",15.5,"",26,"",16.899999999999999,"",38.200000000000003,"",169.89999999999998,"",null,152,"",0,"",152,"",null,40.4,"",72.5,"",0,"",112.9,"","No",null,null,null,1]
["Washington Metropolitan Area Transit Authority","Washington","DC",3030,30030,"Independent Public Agency or Authority of Transit Service","Full Reporter",4586770,3200,null,152.19999999999999,"",0,"",24.2,"",0.5,"",3.1,"",112.3,"",292.29999999999995,"",null,0,"",0,"",0,"",null,1.3,"",10.4,"",61.8,"",73.5,"","No"]
["King County Department of Transportation - Metro Transit Division","Seattle","WA",1,1,"City, County or Local Government Unit or Department of Transportation","Full Reporter",3059393,2875,null,0.1,"",2.5,"",0,"",0,"",0,"",0,"",2.6,"",null,0,"",18,"",18,"",null,125.60000000000001,"",149.4,"",97.4,"",372.40000000000003,"","No"]
["Chicago Transit Authority","Chicago","IL",5066,50066,"Independent Public Agency or Authority of Transit Service","Full Reporter",8608208,2728,null,95.300000000000011,"",0,"",116.5,"",49.8,"",2.7,"",23.5,"",287.8,"",null,25,"",0,"",25,"",null,3.8,"",0,"",0,"",3.8,"","No"]
["Massachusetts Bay Transportation Authority","Boston","MA",1003,10003,"Independent Public Agency or Authority of Transit Service","Full Reporter",4181019,2344,null,823,"",2,"",8,"",0,"",10,"",54.5,"",897.5,"",null,314,"",9,"",323,"",null,11.4,"",0,"",1.6,"",13,"","No"]
{"$rows_left_out":527}
{"sheet":"Summary Tables","index":5,"n_rows":121,"n_cols":24,"rows_kept":121,"cut":false,"hidden":false,"merged":[[63,6,63,12],[63,13,63,15],[63,16,63,19],[48,0,48,2],[22,6,22,12],[22,13,22,15],[47,6,47,12],[47,13,47,15],[22,16,22,19],[47,16,47,19],[7,0,7,2],[1,16,1,19],[1,6,1,12],[1,13,1,15],[6,6,6,12],[6,13,6,15],[6,16,6,19]]}
["To bring up the accessible control panel, press ctrl + a. Some screen reading functionality will not work while the sheet is protected. To unprotect the sheet press alt h o p and enter the password ntd.",null,null,null,null,"National Totals","At Grade: Restricted Right-of-Way","Street Running","Elevated on Structure","Elevated on Fill","Open Cut","Subway","Total Track Miles","At Grade: Restricted Right-of-Way","Street Running","Total Crossings","Permanent Busway","Permanent HOV","Part-Time Busway or HOV","Total Roadway Miles"]
[null,null,null,null,null,null,"Miles of Track",null,null,null,null,null,null,"Number of Crossings",null,null,"Miles of Roadway",null,null,null,null,null,null,{"$f":"IF(X5=1,0,1)","v":0}]
[null,null,null,null,null,"VOMS","At Grade: Restricted Right-of-Way\nTrack Miles","\n\nStreet Running\nTrack Miles","\n\nElevated on Structure\nTrack Miles","\n\nElevated on Fill\nTrack Miles","\n\n\nOpen Cut\nTrack Miles","\n\n\nSubway\nTrack Miles","Total Track Miles","At Grade: Restricted Right-of-Way\nCrossings","\n\nStreet Running\nCrossings","Total Crossings","\n\nPermanent Busway\nRoadway Miles","\n\nPermanent HOV\nRoadway Miles","\nPart-Time Busway or HOV\nRoadway Miles","Total Roadway Miles",null,null,null,"Include questionable data"]
[null,null,null,null,null,{"$f":"IF($X$2,SUMIFS('Track by Mode'!L:L,'Track by Mode'!AI:AI,\"=No\")+SUMIFS('Roadway by Mode'!L:L,'Roadway by Mode'!V:V,\"=No\"),SUM('Track by Mode'!L:L)+SUM('Roadway by Mode'!L:L))","v":68532},{"$f":"IF($X$2,SUMIFS('Track by Mode'!N:N,'Track by Mode'!$AI:$AI,\"=No\"),SUM('Track by Mode'!N:N))","v":9948.2000000000007},{"$f":"IF($X$2,SUMIFS('Track by Mode'!P:P,'Track by Mode'!$AI:$AI,\"=No\"),SUM('Track by Mode'!P:P))","v":331.6},{"$f":"IF($X$2,SUMIFS('Track by Mode'!R:R,'Track by Mode'!$AI:$AI,\"=No\"),SUM('Track by Mode'!R:R))","v":800.60000000000014},{"$f":"IF($X$2,SUMIFS('Track by Mode'!T:T,'Track by Mode'!$AI:$AI,\"=No\"),SUM('Track by Mode'!T:T))","v":662.49999999999989},{"$f":"IF($X$2,SUMIFS('Track by Mode'!V:V,'Track by Mode'!$AI:$AI,\"=No\"),SUM('Track by Mode'!V:V))","v":198.9},{"$f":"IF($X$2,SUMIFS('Track by Mode'!X:X,'Track by Mode'!$AI:$AI,\"=No\"),SUM('Track by Mode'!X:X))","v":935.90000000000009},{"$f":"IF($X$2,SUMIFS('Track by Mode'!Z:Z,'Track by Mode'!$AI:$AI,\"=No\"),SUM('Track by Mode'!Z:Z))","v":12877.700000000008},{"$f":"IF($X$2,SUMIFS('Track by Mode'!AC:AC,'Track by Mode'!$AI:$AI,\"=No\"),SUM('Track by Mode'!AC:AC))","v":5696},{"$f":"IF($X$2,SUMIFS('Track by Mode'!AE:AE,'Track by Mode'!$AI:$AI,\"=No\"),SUM('Track by Mode'!AE:AE))","v":1780},{"$f":"IF($X$2,SUMIFS('Track by Mode'!AG:AG,'Track by Mode'!$AI:$AI,\"=No\"),SUM('Track by Mode'!AG:AG))","v":7476},{"$f":"IF($X$2,SUMIFS('Roadway by Mode'!N:N,'Roadway by Mode'!$V:$V,\"=No\"),SUM('Roadway by Mode'!N:N))","v":1009.9000000000007},{"$f":"IF($X$2,SUMIFS('Roadway by Mode'!P:P,'Roadway by Mode'!$V:$V,\"=No\"),SUM('Roadway by Mode'!P:P))","v":1446.3999999999999},{"$f":"IF($X$2,SUMIFS('Roadway by Mode'!R:R,'Roadway by Mode'!$V:$V,\"=No\"),SUM('Roadway by Mode'!R:R))","v":2057.8000000000006},{"$f":"IF($X$2,SUMIFS('Roadway by Mode'!T:T,'Roadway by Mode'!$V:$V,\"=No\"),SUM('Roadway by Mode'!T:T))","v":4514.0999999999967},null,null,null,"Exclude questionable data"]
[null,null,null,null,null,{"$f":"IFERROR(G5&CHAR(10)&H5&CHAR(10)&I5&CHAR(10)&J5&CHAR(10)&K5&CHAR(10)&L5,\"\")","v":"At Grade: Restricted Right-of-Way: 77%\nStreet Running: 3%\nElevated on Structure: 6%\nElevated on Fill: 5%\nOpen Cut: 2%\nSubway: 7%"},{"$f":"G1&\": \"&FIXED(100*G4/SUM($G$4:$L$4),0,0)&\"%\"","v":"At Grade: Restricted Right-of-Way: 77%"},{"$f":"H1&\": \"&FIXED(100*H4/SUM($G$4:$L$4),0,0)&\"%\"","v":"Street Running: 3%"},"Elevated on Structure: 6%","Elevated on Fill: 5%","Open Cut: 2%","Subway: 7%",null,null,null,null,null,null,null,null,null,null,null,1]
["By Urbanized Area Size"]
[null,null,null,null,null,null,"Miles of Track",null,null,null,null,null,null,"Number of Crossings",null,null,"Miles of Roadway"]
[null,null,null,"enter bins below","click to graph","VOMS","At Grade: Restricted Right-of-Way\nTrack Miles","\n\nStreet Running\nTrack Miles","\n\nElevated on Structure\nTrack Miles","\n\nElevated on Fill\nTrack Miles","\n\n\nOpen Cut\nTrack Miles","\n\n\nSubway\nTrack Miles","Total Track Miles","At Grade: Restricted Right-of-Way\nCrossings","\n\nStreet Running\nCrossings","Total Crossings","\n\nPermanent Busway\nRoadway Miles","\n\nPermanent HOV\nRoadway Miles","\nPart-Time Busway or HOV\nRoadway Miles","Total Roadway Miles"]
{"$rows_left_out":113}